{"text_format":"1","workbook":"xlsx","n_sheets":12,"sheets":["Cover","User Instructions","Input Page","1. Planning","2. Programming","3. Prelim. Eng.","4. Final Eng.","5. Constr.","6. O&M","Review Result","Report","Default_Ref"],"not_rendered":{"charts":0,"images":14,"macros":1,"external_links":0,"defined_names":17,"comments":1,"pivot_tables":0},"unopened":[],"bounds":{"document_bytes":16777216,"sheet_cells":100000,"rows_first":2000,"rows_last":500,"rows_between":2000,"halvings":0,"cell_chars":16384,"cell_head_chars":4096},"cells_cut":0,"cells_raw":0,"read":"whole","date_system":"1900"}

{"sheet":"Cover","index":0,"n_rows":6,"n_cols":4,"rows_kept":6,"cut":false,"hidden":false,"merged":[[0,1,6,1],[0,2,6,2]]}
["Project Bundling"]
["Saves Bundles!        ",null,null,"(Ctrl + PgDn)                                             First time users, go to the next tab for user instructions to navigate the self-assessment tool."]
[null,null,null,"(Ctrl + PgDn + PgDn)"]
["Agency Capability                          Self-Assessment Tool "]
[" A Capability Matrix"]
[" Every Day Counts | Innovation Initiative"]

{"sheet":"User Instructions","index":1,"n_rows":36,"n_cols":2,"rows_kept":36,"cut":false,"hidden":false,"merged":[[8,0,18,0],[1,1,35,1]]}
["              Instructions for Users for Self-Assessment","The contents of this tool do not necessarily reflect the official policy of the Department of Transportation. The contents do not have the force and effect of law and are not meant to bind the public in any way."]
[]
["Organizational Capability Background"]
["This Federal Highway Administration (FHWA) tool is designed for an agency to assess its current project bundling practices, to inform users of the range of bundling practices used by others, to identify practices and action steps for improvement, and to evaluate practices being used on a bundling project or program. It uses the organizational capability approach where capability is defined as the level to which an organization has institutionalized its policies, processes, and procedures, documenting them so that they can be consistently applied across the agency."]
["Therefore, it is important to understand that a low capability score is merely a sign that the agency's practices may not be properly institutionalized and as a result may be inconsistent in their application. Inconsistency leads to uncertainty and uncertainty costs time and money as both internal stakeholders and the agency's design and construction industry partners struggle with determining exactly when a given bundled project will be developed and delivered."]
["This tool provides a structured format in which to conduct an organizational capability assessment workshop. The agency will relate its own practices to a set of effective practices that was developed from a national study of project bundling. Some of those may not directly apply to the agency and the tool will allow the agency to eliminate those from the assessment. However, it is recommended that a discussion of why a specific practice does not apply occur before dropping it from the analysis to ensure that there is a strong justification for doing so, such as lack of enabling legislation."]
[]
["Detailed Instructions"]
{"$rows_left_out":29}
{"sheet":"Input Page","index":2,"n_rows":30,"n_cols":13,"rows_kept":30,"cut":false,"hidden":false,"merged":[[1,0,1,12]]}
["Self-Assessment Questionnaire Answer Sheet"]
["Basic Effective Bundling Practices Set"]
["Step 1 - Indicate if each practice is applicable for bundling in your agency (practices 1-4 are required, for practices 5-25 use pull-down menu to select yes or no if applicable to your agency).",null,null,"Step 2 - Select the project stage(s) in which the practice would be applied in your agency (the checked project stages should be adjusted to meet your agency practice stage).\nWhen completed press \"Populate\"  button below or Ctrl+Shift+R.",null,null,null,null,null,"Step 3 - Assign stage-specific capability levels in the next series of pages.\nTo complete press \"Next\" button on the right or Ctrl + Shift + P."]
[]
["Practice #          (Step 1)","Practice                                                                                                                   (Step 1)","Applicable? (Step 1)","Planning                (Step 2)","Programming (Step 2)","Prelim Engineering        (Step 2)","Final Engineering              (Step 2)","Construction (Step 2)","O&M Stage                (Step 2)","Capability Level Criteria"]
[1,{"$f":"VLOOKUP(A6,Default_Ref!A5:B30,2,FALSE)","v":"Early bundling decision during planning/programming"},"Required",true,true,false,false,false,false,"Level","Description","EDC Definition","Definition applied specifically to bundling"]
[{"$f":"A6+1","v":2},{"$f":"VLOOKUP(A7,Default_Ref!A6:B31,2,FALSE)","v":"Determine optimum bundle size"},"Required",false,true,true,true,false,false,1,"Not Implementing","The agency is not pursuing innovation anywhere and is not interested in pursuing innovation","Project bundling is not considered."]
[{"$f":"A7+1","v":3},{"$f":"VLOOKUP(A8,Default_Ref!A7:B32,2,FALSE)","v":"Limit bundle by work type"},"Required",false,true,true,true,false,false,2,"Development Stage","The agency is collecting guidance and best practices, building support with partners and stakeholders, and developing an implementation process.","No formal policy, process or tools. Ad hoc approach to project bundling is applied when required."]
{"$rows_left_out":23}
{"sheet":"1. Planning","index":3,"n_rows":31,"n_cols":7,"rows_kept":31,"cut":false,"hidden":false,"merged":[[14,3,17,4],[0,0,0,6],[2,0,2,2],[3,3,3,6],[3,0,3,2],[5,3,5,6]]}
["Self-Assessment Questionnaire Answer Sheet"]
[]
["Click on cell to get drop-down menu of possible answers."]
["Questionnaire Set I - Planning Stage"]
["Practice #","Question","Capability\n(from 1 to 6)"]
[1,{"$f":"IFERROR(VLOOKUP(A6,'Input Page'!$A$6:$B$30,2),\"\")","v":"Early bundling decision during planning/programming"},3,"Capability Level Criteria"]
[8,{"$f":"IFERROR(VLOOKUP(A7,'Input Page'!$A$6:$B$30,2),\"\")","v":"Identify Federal-aid eligible work types "},5,"Level","Description","EDC Definition","Definition applied specifically to bundling"]
[10,{"$f":"IFERROR(VLOOKUP(A8,'Input Page'!$A$6:$B$30,2),\"\")","v":"Use state funding only"},4,1,"Not Implementing","The agency is not using the innovation anywhere and is not interested in pursuing the innovation."," Project bundling is not considered."]
{"$rows_left_out":24}
{"sheet":"2. Programming","index":4,"n_rows":31,"n_cols":7,"rows_kept":31,"cut":false,"hidden":false,"merged":[[2,0,2,2],[0,0,0,6],[14,3,17,4],[5,3,5,6],[3,0,3,2]]}
["Self-Assessment Questionnaire Answer Sheet"]
[]
["Click on cell to get drop-down menu of possible answers."]
["Questionnaire Set II - Programming Stage"]
["Practice #","Question","Capability\n(from 1 to 6)"]
[1,{"$f":"IFERROR(VLOOKUP(A6,'Input Page'!$A$6:$B$30,2),\"\")","v":"Early bundling decision during planning/programming"},1,"Capability Level Criteria"]
[2,{"$f":"IFERROR(VLOOKUP(A7,'Input Page'!$A$6:$B$30,2),\"\")","v":"Determine optimum bundle size"},2,"Level","Description","EDC Definition","Definition applied specifically to bundling"]
[3,{"$f":"IFERROR(VLOOKUP(A8,'Input Page'!$A$6:$B$30,2),\"\")","v":"Limit bundle by work type"},4,1,"Not Implementing","The agency is not using the innovation anywhere and is not interested in pursuing the innovation."," Project bundling is not considered."]
{"$rows_left_out":24}
{"sheet":"3. Prelim. Eng.","index":5,"n_rows":31,"n_cols":7,"rows_kept":31,"cut":false,"hidden":false,"merged":[[0,0,0,6],[2,0,2,2],[3,0,3,2],[5,3,5,6]]}
["Self-Assessment Questionnaire Answer Sheet"]
[]
["Click on cell to get drop-down menu of possible answers."]
["Questionnaire Set III - Preliminary Engineering Stage"]
["Practice #","Question","Capability\n(from 1 to 6)"]
[2,{"$f":"IFERROR(VLOOKUP(A6,'Input Page'!$A$6:$B$30,2),\"\")","v":"Determine optimum bundle size"},2,"Capability Level Criteria"]
[3,{"$f":"IFERROR(VLOOKUP(A7,'Input Page'!$A$6:$B$30,2),\"\")","v":"Limit bundle by work type"},4,"Level","Description","EDC Definition","Definition applied specifically to bundling"]
[4,{"$f":"IFERROR(VLOOKUP(A8,'Input Page'!$A$6:$B$30,2),\"\")","v":"Limit bundle by geographic proximity"},4,1,"Not Implementing","The agency is not using the innovation anywhere and is not interested in pursuing the innovation."," Project bundling is not considered."]
{"$rows_left_out":24}
{"sheet":"4. Final Eng.","index":6,"n_rows":31,"n_cols":7,"rows_kept":31,"cut":false,"hidden":false,"merged":[[0,0,0,6],[2,0,2,2],[3,0,3,2],[5,3,5,6]]}
["Self-Assessment Questionnaire Answer Sheet"]
[]
["Click on cell to get drop-down menu of possible answers."]
["Questionnaire Set IV - Final Engineering Stage"]
["Practice #","Question","Capability\n(from 1 to 6)"]
[2,{"$f":"IFERROR(VLOOKUP(A6,'Input Page'!$A$6:$B$30,2),\"\")","v":"Determine optimum bundle size"},2,"Capability Level Criteria"]
[3,{"$f":"IFERROR(VLOOKUP(A7,'Input Page'!$A$6:$B$30,2),\"\")","v":"Limit bundle by work type"},4,"Level","Description","EDC Definition","Definition applied specifically to bundling"]
[8,{"$f":"IFERROR(VLOOKUP(A8,'Input Page'!$A$6:$B$30,2),\"\")","v":"Identify Federal-aid eligible work types "},5,1,"Not Implementing","The agency is not using the innovation anywhere and is not interested in pursuing the innovation."," Project bundling is not considered."]
{"$rows_left_out":24}
{"sheet":"5. Constr.","index":7,"n_rows":31,"n_cols":7,"rows_kept":31,"cut":false,"hidden":false,"merged":[[0,0,0,6],[2,0,2,2],[3,0,3,2],[5,3,5,6]]}
["Self-Assessment Questionnaire Answer Sheet"]
[]
["Click on cell to get drop-down menu of possible answers."]
["Questionnaire Set V - Construction Stage"]
["Practice #","Question","Capability\n(from 1 to 6)"]
[19,{"$f":"IFERROR(VLOOKUP(A6,'Input Page'!$A$6:$B$30,2),\"\")","v":"Use ACM"},5,"Capability Level Criteria"]
[20,{"$f":"IFERROR(VLOOKUP(A7,'Input Page'!$A$6:$B$30,2),\"\")","v":"Use ATC"},5,"Level","Description","EDC Definition","Definition applied specifically to bundling"]
[21,{"$f":"IFERROR(VLOOKUP(A8,'Input Page'!$A$6:$B$30,2),\"\")","v":"Coordinate construction staging"},5,1,"Not Implementing","The agency is not using the innovation anywhere and is not interested in pursuing the innovation."," Project bundling is not considered."]
{"$rows_left_out":24}
{"sheet":"6. O&M","index":8,"n_rows":30,"n_cols":7,"rows_kept":30,"cut":false,"hidden":false,"merged":[[0,0,0,6],[2,0,2,2],[5,3,5,6],[3,0,3,2]]}
["Self-Assessment Questionnaire Answer Sheet"]
[]
["Click on cell to get drop-down menu of possible answers."]
["Questionnaire Set VI - Operation and Maintenance Stage"]
["Practice #","Question","Capability\n(from 1 to 6)"]
[19,{"$f":"IFERROR(VLOOKUP(A6,'Input Page'!$A$6:$B$30,2),\"\")","v":"Use ACM"},5,"Capability Level Criteria"]
[null,{"$f":"IFERROR(VLOOKUP(A7,'Input Page'!$A$6:$B$30,2),\"\")","v":""},null,"Level","Description","EDC Definition","Definition applied specifically to bundling"]
[null,{"$f":"IFERROR(VLOOKUP(A8,'Input Page'!$A$6:$B$30,2),\"\")","v":""},null,1,"Not Implementing","The agency is not using the innovation anywhere and is not interested in pursuing the innovation."," Project bundling is not considered."]
{"$rows_left_out":23}
{"sheet":"Review Result","index":9,"n_rows":30,"n_cols":13,"rows_kept":30,"cut":false,"hidden":false,"merged":[[2,9,2,12],[0,0,0,7]]}
["Capability Assessment Result Review Sheet"]
[]
["Practice #","Practice","Planning","Program","Prelim. Eng.","Final Eng.","Constr.","O&M","Capability for Each Practice","Capability Level Criteria"]
[1,{"$f":"IFERROR(VLOOKUP(A4,'Input Page'!A6:B30,2,),\"\")","v":"Early bundling decision during planning/programming"},{"$f":"IFERROR(VLOOKUP($A4,'1. Planning'!$A$6:$C$30,3,FALSE),\"\")","v":3},{"$f":"IFERROR(VLOOKUP($A4,'2. Programming'!$A$6:$C$30,3,FALSE),\"\")","v":1},{"$f":"IFERROR(VLOOKUP($A4,'3. Prelim. Eng.'!$A$6:$C$30,3,FALSE),\"\")","v":""},{"$f":"IFERROR(VLOOKUP($A4,'4. Final Eng.'!$A$6:$C$30,3,FALSE),\"\")","v":""},{"$f":"IFERROR(VLOOKUP($A4,'5. Constr.'!$A$6:$C$30,3,FALSE),\"\")","v":""},{"$f":"IFERROR(VLOOKUP($A4,'6. O&M'!$A$6:$C$30,3,FALSE),\"\")","v":""},{"$f":"IF(MIN(C4:H4)=0,\"\",MIN(C4:H4))","v":1},"Level","Description","EDC Definition","Definition applied specifically to bundling"]
[2,{"$f":"IFERROR(VLOOKUP(A5,'Input Page'!A7:B31,2,),\"\")","v":"Determine optimum bundle size"},{"$f":"IFERROR(VLOOKUP($A5,'1. Planning'!$A$6:$C$30,3,FALSE),\"\")","v":""},{"$f":"IFERROR(VLOOKUP($A5,'2. Programming'!$A$6:$C$30,3,FALSE),\"\")","v":2},{"$f":"IFERROR(VLOOKUP($A5,'3. Prelim. Eng.'!$A$6:$C$30,3,FALSE),\"\")","v":2},{"$f":"IFERROR(VLOOKUP($A5,'4. Final Eng.'!$A$6:$C$30,3,FALSE),\"\")","v":2},{"$f":"IFERROR(VLOOKUP($A5,'5. Constr.'!$A$6:$C$30,3,FALSE),\"\")","v":""},{"$f":"IFERROR(VLOOKUP($A5,'6. O&M'!$A$6:$C$30,3,FALSE),\"\")","v":""},{"$f":"IF(MIN(C5:H5)=0,\"\",MIN(C5:H5))","v":2},1,"Not Implementing","The agency is not using the innovation anywhere and is not interested in pursuing the innovation."," Project bundling is not considered."]
[3,{"$f":"IFERROR(VLOOKUP(A6,'Input Page'!A8:B32,2,),\"\")","v":"Limit bundle by work type"},{"$f":"IFERROR(VLOOKUP($A6,'1. Planning'!$A$6:$C$30,3,FALSE),\"\")","v":""},{"$f":"IFERROR(VLOOKUP($A6,'2. Programming'!$A$6:$C$30,3,FALSE),\"\")","v":4},{"$f":"IFERROR(VLOOKUP($A6,'3. Prelim. Eng.'!$A$6:$C$30,3,FALSE),\"\")","v":4},{"$f":"IFERROR(VLOOKUP($A6,'4. Final Eng.'!$A$6:$C$30,3,FALSE),\"\")","v":4},{"$f":"IFERROR(VLOOKUP($A6,'5. Constr.'!$A$6:$C$30,3,FALSE),\"\")","v":""},{"$f":"IFERROR(VLOOKUP($A6,'6. O&M'!$A$6:$C$30,3,FALSE),\"\")","v":""},4,2,"Development Stage","The agency is collecting guidance and best practices, building support with partners and stakeholders, and developing an implementation process."," No formal policy, process or tools. Ad hoc approach to project bundling is applied when required."]
[4,{"$f":"IFERROR(VLOOKUP(A7,'Input Page'!A9:B33,2,),\"\")","v":"Limit bundle by geographic proximity"},{"$f":"IFERROR(VLOOKUP($A7,'1. Planning'!$A$6:$C$30,3,FALSE),\"\")","v":""},{"$f":"IFERROR(VLOOKUP($A7,'2. Programming'!$A$6:$C$30,3,FALSE),\"\")","v":4},{"$f":"IFERROR(VLOOKUP($A7,'3. Prelim. Eng.'!$A$6:$C$30,3,FALSE),\"\")","v":4},{"$f":"IFERROR(VLOOKUP($A7,'4. Final Eng.'!$A$6:$C$30,3,FALSE),\"\")","v":""},{"$f":"IFERROR(VLOOKUP($A7,'5. Constr.'!$A$6:$C$30,3,FALSE),\"\")","v":""},{"$f":"IFERROR(VLOOKUP($A7,'6. O&M'!$A$6:$C$30,3,FALSE),\"\")","v":""},4,3,"Demonstration Stage","The agency is testing and piloting the innovation."," Basic project bundling process and tools are repeatedly used but not standardized. Approach varies from project to project."]
[5,{"$f":"IFERROR(VLOOKUP(A8,'Input Page'!A10:B34,2,),\"\")","v":"Outreach - Industry"},{"$f":"IFERROR(VLOOKUP($A8,'1. Planning'!$A$6:$C$30,3,FALSE),\"\")","v":""},{"$f":"IFERROR(VLOOKUP($A8,'2. Programming'!$A$6:$C$30,3,FALSE),\"\")","v":2},{"$f":"IFERROR(VLOOKUP($A8,'3. Prelim. Eng.'!$A$6:$C$30,3,FALSE),\"\")","v":3},{"$f":"IFERROR(VLOOKUP($A8,'4. Final Eng.'!$A$6:$C$30,3,FALSE),\"\")","v":""},{"$f":"IFERROR(VLOOKUP($A8,'5. Constr.'!$A$6:$C$30,3,FALSE),\"\")","v":""},{"$f":"IFERROR(VLOOKUP($A8,'6. O&M'!$A$6:$C$30,3,FALSE),\"\")","v":""},2,4,"Assessment Stage","The agency is assessing the performance of and process for carrying out the innovation and making adjustments to prepare for full deployment.","Draft organizational standard process for developing project bundling strategy is documented. Supporting methods, tools, and staff training are being assessed."]
{"$rows_left_out":23}
{"sheet":"Report","index":10,"n_rows":29,"n_cols":9,"rows_kept":29,"cut":false,"hidden":false,"merged":[[28,3,28,4],[14,5,14,8],[0,0,0,8],[2,5,2,8],[13,5,13,8],[1,0,1,4],[12,5,12,8],[11,5,11,8]]}
["Capability Bundling Practices Report"]
["Based on the Organizational Self-Assessment Tool, the following highlighted bundling practices are currently at low capability levels (1 or 2) in the organization:"]
["Practice #","Practice","Capability \n(from 1 to 5)","Capability Level Goal (enter desired level)","Action Plan to Raise Capability Level*\n(Enters  action steps to reach desired  level.)","Capability Level Criteria"]
[1,{"$f":"IFERROR(VLOOKUP(A4,'Input Page'!A6:B30,2,FALSE),\"\")","v":"Early bundling decision during planning/programming"},{"$f":"IFERROR(VLOOKUP(A4,'Review Result'!$A$4:$I$28,9,FALSE),\"\")","v":1},4,"1. Develop a draft policy & process (business rules) to provide guidance on including bundling program development.\n2. Coordinate with asset managers for piloting process, refine as necessary, adopt.","Level","Description","EDC definition","Definition applied specifically to bundling"]
[2,{"$f":"IFERROR(VLOOKUP(A5,'Input Page'!A7:B31,2,FALSE),\"\")","v":"Determine optimum bundle size"},{"$f":"IFERROR(VLOOKUP(A5,'Review Result'!$A$4:$I$28,9,FALSE),\"\")","v":2},4,"1. Develop a draft policy & process (business rules) for determining optimum bundles sizes.\n2. Coordinate with asset managers for piloting process, refine as necessary, adopt.",1,"Not Implementing","The agency is not using the innovation anywhere and is not interested in pursuing the innovation."," Project bundling is not considered."]
[3,{"$f":"IFERROR(VLOOKUP(A6,'Input Page'!A8:B32,2,FALSE),\"\")","v":"Limit bundle by work type"},{"$f":"IFERROR(VLOOKUP(A6,'Review Result'!$A$4:$I$28,9,FALSE),\"\")","v":4},null,null,2,"Development Stage","The agency is collecting guidance and best practices, building support with partners and stakeholders, and developing an implementation process."," No formal policy, process or tools. Ad hoc approach to project bundling is applied when required."]
[4,{"$f":"IFERROR(VLOOKUP(A7,'Input Page'!A9:B33,2,FALSE),\"\")","v":"Limit bundle by geographic proximity"},{"$f":"IFERROR(VLOOKUP(A7,'Review Result'!$A$4:$I$28,9,FALSE),\"\")","v":4},null,null,3,"Demonstration Stage","The agency is testing and piloting the innovation."," Basic project bundling process and tools are repeatedly used but not standardized. Approach varies from project to project."]
[5,{"$f":"IFERROR(VLOOKUP(A8,'Input Page'!A10:B34,2,FALSE),\"\")","v":"Outreach - Industry"},{"$f":"IFERROR(VLOOKUP(A8,'Review Result'!$A$4:$I$28,9,FALSE),\"\")","v":2},3,"Formalize an outreach plan template for industry input on potential bundles projects.",4,"Assessment Stage","The agency is assessing the performance of and process for carrying out the innovation and making adjustments to prepare for full deployment.","Draft organizational standard process for developing project bundling strategy is documented. Supporting methods, tools, and staff training are being assessed."]
{"$rows_left_out":22}
{"sheet":"Default_Ref","index":11,"n_rows":30,"n_cols":8,"rows_kept":30,"cut":false,"hidden":true,"merged":[]}
[]
[]
[]
[]
["Practice #","Policy","Planning Phase","Programming Phase","Prelim Eng Phase","Final Eng Phase","Construction Phase","O&M Phase"]
[1,"Early bundling decision during planning/programming","x","x"]
[{"$f":"A6+1","v":2},"Determine optimum bundle size",null,"x","x","x"]
[{"$f":"A7+1","v":3},"Limit bundle by work type",null,"x","x"]
{"$rows_left_out":22}