{"text_format":"1","workbook":"xlsx","n_sheets":4,"sheets":["Information","Sheet","Calculations","Variables"],"not_rendered":{"charts":0,"images":1,"macros":1,"external_links":0,"defined_names":38,"comments":0,"pivot_tables":0},"unopened":[],"bounds":{"document_bytes":16777216,"sheet_cells":100000,"rows_first":2000,"rows_last":500,"rows_between":2000,"halvings":0,"cell_chars":16384,"cell_head_chars":4096},"cells_cut":0,"cells_raw":0,"read":"whole","date_system":"1900"}

{"sheet":"Information","index":0,"n_rows":15,"n_cols":6,"rows_kept":15,"cut":false,"hidden":false,"merged":[[12,0,14,1],[11,3,11,4],[5,1,5,4],[1,1,1,4],[3,1,3,4],[4,1,4,4],[7,1,7,4],[2,1,2,4],[8,3,8,4],[9,3,10,4]]}
[null,"Information"]
[{"$f":"OFFSET(A2,-1,0)+1","v":1},"Add project/sheet information below.  Use the \"Reload Data\" button to select the correct CSV file.    Fill in the constants below."]
[{"$f":"OFFSET(A3,-1,0)+1","v":2},"Make modifications to the Sheet tab before adding additional sheets.  \n - The column widths for the description and remarks may be resized and the content will reformat to match the width of the columns on the first sheet (F9 to recalculate).  Ensure that the content fits on the sheet.\n - Only resize columns F to Y.  Keep columns D and AA outside the sheet border.\n - Notes may be added to the bottom right half of the sheet.  ",null,null,null,{"$f":"IFERROR(IF(OR(trunDesc,trunRemarks),\"Content truncated from:\"&IF(trunDesc,CHAR(10)&\" - Description\",\"\")&IF(trunRemarks,CHAR(10)&\" - Remarks\",\"\")&CHAR(10)&\"Check and adjust columns to fit entire text.\",\"\"),\"The Description and/or Remarks columns are too short to see content.  Resize.\")","v":""}]
[{"$f":"OFFSET(A4,-1,0)+1","v":3},"The Summary of Quantity sheets are located on the Sheet, Sheet (2), etc. tabs.  To copy a sheet, hold the left mouse button on the worksheet's tab (below) while pressing the <CTRL> key.  A mini sheet with a plus sign should appear.  Drag this and drop it to the desired location.  "]
[{"$f":"OFFSET(A5,-1,0)+1","v":4},"Until the file is saved, the filename block will be blank.  Sheet numbers may not update until having exited and reentered the file."]
[]
[null,"Constants"]
[null,"Insert the following values (they will appear on every sheet):"]
[null,"Project: ","AZ FTNP GRCA 13(1)\nMT OMAD 18(38)","Note:  If there is more than one project number, use <ALT><ENTER> to insert page break for additional lines."]
[null,"NPS PMIS No. ","NPS PMIS No. ","Note: NPS fields do not appear on the sheet unless additional text is added."]
{"$rows_left_out":6}
{"sheet":"Sheet","index":1,"n_rows":50,"n_cols":26,"rows_kept":50,"cut":false,"hidden":false,"merged":[[49,6,49,9],[0,0,1,2],[6,5,8,5],[6,6,8,6],[6,7,8,7],[2,0,2,1],[3,0,3,1],[5,0,5,1],[5,5,5,24],[44,3,49,3],[6,24,8,24],[6,8,8,8],[6,9,8,9],[6,23,7,23],[6,0,6,1],[5,3,42,3]]}
["Sheet Information",null,null,null,null,null,null,null,null,null,{"$f":"OFFSET(EEBACS,2,K2,1,1)","v":"C: Typical Section"},"D: Plan, Roadway","E: Layout, Parking Area","F: Drainage","G: Walls","M: Temp. Erosion Control","P: Perm. Traffic Control","***: Column 8","B.66-B.85`: Column 9","-: Column 10","Plan: Allow- ance","C12: Column 12","C13: Column 13"]
[null,null,null,null,null,{"$f":"MATCH(F7&\"*\",OFFSET(EEBACS,2,0,1,EEBACS.cols),0)-1","v":0},{"$f":"MATCH(G7&\"*\",OFFSET(EEBACS,2,0,1,EEBACS.cols),0)-1","v":1},{"$f":"MATCH(H7&\"*\",OFFSET(EEBACS,2,0,1,EEBACS.cols),0)-1","v":2},{"$f":"MATCH(I7,OFFSET(Calcs,0,0,1,COLUMNS(Calcs)),0)","v":4},{"$f":"MATCH(J7&\"*\",OFFSET(EEBACS,2,0,1,EEBACS.cols),0)-1","v":4},{"$f":"IF(OFFSET(K2,0,-1)+1<$X2,OFFSET(K2,0,-1)+1,$X2+2)","v":5},6,7,8,9,10,11,12,13,14,15,16,17,{"$f":"MATCH(X7&\"*\",OFFSET(EEBACS,2,0,1,EEBACS.cols),0)-1","v":18},{"$f":"MATCH(Y7,OFFSET(Calcs,0,0,1,COLUMNS(Calcs)),0)","v":46}]
["Sheet num:",null,{"$f":"INDEX(SheetNames[Sheet],MATCH(C4,SheetNames[Worksheet],0))","v":"B.1"}]
["Sheet name:",null,{"$f":"RIGHT(Filename,LEN(Filename)-FIND(\"]\",Filename))","v":"Sheet"}]
[null,null,null,null,"left",null,null,null,null,null,null,null,null,null,null,null,null,null,null,null,null,null,null,null,{"$f":"IF(LEN(SUBSTITUTE(SUBSTITUTE(NPS.PMIS,\".\",\"\"),\" \",\"\"))>9,NPS.PMIS,\"\")&IF(LEN(SUBSTITUTE(SUBSTITUTE(NPS.Drwg,\".\",\"\"),\" \",\"\"))>9,REPT(\" \",3)&NPS.Drwg,\"\")","v":""},"right"]
["Show \"Schedule / Option\" text in sheet title?",null,null,{"$f":"CELL(\"filename\",Filename)","v":"C:\\pw-work\\d0561506\\[summary.xlsm]Sheet"},null,{"$f":"\"SUMMARY OF QUANTITIES\"&IF(LEFT(Type,1)=\"<\",\"\",\" - \"&Type&\" \"&LEFT(VLOOKUP(OFFSET(Begin,1,2),Calcs,col_Schedule,0),1))","v":"SUMMARY OF QUANTITIES - Schedule A"}]
["Schedule",null,null,null,null,"AMEND","Line Item No.","Pay Item Number","Pay Item Description","Unit","Sheet and Description",null,null,null,null,null,null,null,null,null,null,null,null,"Estimated Quantities","Remarks and/or Determination of Estimated Quantity"]
[null,{"$f":"MATCH(B9,OFFSET(EEBACS,2,0,1,EEBACS.cols),0)-1","v":20},null,null,null,null,null,null,null,null,{"$f":"IF(ISNUMBER(FIND(\":\",K1)),LEFT(K1,FIND(\":\",K1)-1),\"\")","v":"C"},"D","E","F","G","M","P","***","B.66-B.85`","-","Plan","C12","C13"]
[{"$f":"INDEX(SheetNames[Begins],MATCH(Sheet.number,SheetNames[Sheet],0))","v":0},"Deleted",null,null,null,null,null,null,null,null,{"$f":"IF(ISNUMBER(FIND(\":\",K1)),TRIM(SUBSTITUTE(K1,K8&\":\",\"\")),\"\")","v":"Typical Section"},"Plan, Roadway","Layout, Parking Area","Drainage","Walls","Temp. Erosion Control","Perm. Traffic Control","Column 8","Column 9","Column 10","Allow- ance","Column 12","Column 13","Bid Schedule"]
[{"$f":"OFFSET(A10,-1,0)+1","v":1},{"$f":"IF($A10>End,\"\",OFFSET(EEBACS,MATCH($C10,OFFSET(Calcs,0,0,ROWS(Calcs),1),0),B$8,1,1)=1)","v":false},{"$f":"IFERROR(VLOOKUP(A10,Calcs,1,0),OFFSET(C10,1,0))","v":1},null,null,{"$f":"IF(OR($C10=OFFSET($C10,-1,0),$A10>End),\"\",OFFSET(EEBACS,MATCH($C10,OFFSET(Calcs,0,0,ROWS(Calcs),1),0),F$2,1,1))","v":0},"A0010","15101-0000",{"$f":"IF(OR($A10>End,COUNTIF($C$9:$C10,$C10)>lines_D),\"\",IF(COUNTIF($C$9:$C10,$C10)=1,LEFT(VLOOKUP($C10,Calcs,col_Description,0),VLOOKUP($C10,Calcs,col_D,0)),MID(VLOOKUP($C10,Calcs,col_Description,0),VLOOKUP($C10,Calcs,col_D+COUNTIF($C$9:$C10,$C10)-2,0)+1,VLOOKUP($C10,Calcs,col_D+COUNTIF($C$9:$C10,$C10)-1,0)-VLOOKUP($C10,Calcs,col_D+COUNTIF($C$9:$C10,$C10)-2,0))))","v":"Mobilization"},{"$f":"IF(OR($C10=OFFSET($C10,1,0),$A10>End),\"\",OFFSET(EEBACS,MATCH($C10,OFFSET(Calcs,0,0,ROWS(Calcs),1),0),J$2,1,1))","v":"LPSM"},{"$f":"IF(OR($C10=OFFSET($C10,1,0),$A10>End),\"\",SUBSTITUTE(SUBSTITUTE(OFFSET(EEBACS,MATCH($C10,OFFSET(Calcs,0,0,ROWS(Calcs),1),0),K$2,1,1),\"All|\",\"\",1),\"||\",\"\"))","v":""},"","","","","","","","","","","","","ALL",{"$f":"IF(OR($A10>End,COUNTIF($C$9:$C10,$C10)>lines_R),\"\",IF(COUNTIF($C$9:$C10,$C10)=1,LEFT(VLOOKUP($C10,Calcs,col_Remarks,0),VLOOKUP($C10,Calcs,col_R,0)),MID(VLOOKUP($C10,Calcs,col_Remarks,0),VLOOKUP($C10,Calcs,col_R+COUNTIF($C$9:$C10,$C10)-2,0)+1,VLOOKUP($C10,Calcs,col_R+COUNTIF($C$9:$C10,$C10)-1,0)-VLOOKUP($C10,Calcs,col_R+COUNTIF($C$9:$C10,$C10)-2,0))))","v":""}]
{"$rows_left_out":41}
{"sheet":"Calculations","index":2,"n_rows":92,"n_cols":110,"rows_kept":92,"cut":false,"hidden":false,"merged":[[1,26,1,57],[1,58,1,65],[1,68,1,99],[1,100,1,107]]}
[null,null,null,null,null,null,null,null,null,null,null,null,null,null,null,null,null,null,null,null,null,{"$f":"MAX(W:W)","v":120},null,null,null,{"$f":"CELL(\"width\",INDIRECT(CELL(\"address\",OFFSET(INDIRECT(OFFSET(SheetNames[[#Headers],[Worksheet]],1,0)&\"!Header\"),0,MATCH(Z4,INDIRECT(OFFSET(SheetNames[[#Headers],[Worksheet]],1,0)&\"!Header\"),0)-1,1,1))))+IF(Metric,4,0)","v":34},null,null,null,null,null,null,null,null,null,null,null,null,null,null,null,null,null,null,null,null,null,null,null,null,null,null,null,null,null,null,null,null,null,null,null,null,null,null,null,null,null,{"$f":"CELL(\"width\",INDIRECT(CELL(\"address\",OFFSET(INDIRECT(OFFSET(SheetNames[[#Headers],[Worksheet]],1,0)&\"!Header\"),0,MATCH(BP4,INDIRECT(OFFSET(SheetNames[[#Headers],[Worksheet]],1,0)&\"!Header\"),0)-1,1,1))))","v":22}]
[null,{"$f":"ROWS(Data.13)","v":89},{"$f":"COLUMNS(Data.13)","v":21},null,null,null,null,null,null,null,null,null,null,null,null,null,null,null,null,null,null,null,null,null,{"$f":"MATCH(Y4,OFFSET(EEBACS,2,0,1,EEBACS.cols),0)","v":2},{"$f":"MATCH(Z4,OFFSET(EEBACS,2,0,1,EEBACS.cols),0)","v":4},{"$f":"\"Maximum \"&COLUMNS(AA2:BF2)&\" words in Pay Item Description.\"","v":"Maximum 32 words in Pay Item Description."},null,null,null,null,null,null,null,null,null,null,null,null,null,null,null,null,null,null,null,null,null,null,null,null,null,null,null,null,null,null,null,{"$f":"COLUMNS(BG2:BN2)","v":8},null,null,null,null,null,null,null,null,{"$f":"MATCH(BP4,OFFSET(EEBACS,2,0,1,EEBACS.cols),0)","v":20},{"$f":"\"Maximum \"&COLUMNS(BQ2:CV2)&\" words in Remarks.\"","v":"Maximum 32 words in Remarks."},null,null,null,null,null,null,null,null,null,null,null,null,null,null,null,null,null,null,null,null,null,null,null,null,null,null,null,null,null,null,null,{"$f":"COLUMNS(CW2:DD2)","v":8}]
["Data from EEBACS",null,null,null,null,null,null,null,null,null,null,null,null,null,null,null,null,null,null,null,null,"Sched.","Calcs",null,{"$f":"COLUMN(Y3)-COLUMN(Calcs)+1","v":3},{"$f":"COLUMN(Z4)-COLUMN(Calcs)+1","v":4},null,null,null,null,null,null,null,null,null,null,null,null,null,null,null,null,null,null,null,null,null,null,null,null,null,null,null,null,null,null,null,null,{"$f":"COLUMN(BG4)-COLUMN(Calcs)+1","v":37},null,null,null,null,null,null,null,null,{"$f":"COLUMN(BP4)-COLUMN(Calcs)+1","v":46},null,null,null,null,null,null,null,null,null,null,null,null,null,null,null,null,null,null,null,null,null,null,null,null,null,null,null,null,null,null,null,null,{"$f":"COLUMN(CW4)-COLUMN(Calcs)+1","v":79},null,null,null,null,null,null,null,null,{"$f":"MATCH(DF4,OFFSET(EEBACS,2,0,1,EEBACS.cols),0)","v":5}]
["MileStone: PIH, Date Completed: In Progress, Report Date: 12/15/10",null,null,null,null,null,null,null,null,null,null,null,null,null,null,null,null,null,null,null,null,0,"Counter",{"$f":"OFFSET(X4,1,0)","v":0},"Line Item No.","Pay Item Description",null,null,null,null,null,null,null,null,null,null,null,null,null,null,null,null,null,null,null,null,null,null,null,null,null,null,null,null,null,null,null,null,"D",null,null,null,null,null,null,null,null,"Remarks and/or Determination of Estimated Quantity",null,null,null,null,null,null,null,null,null,null,null,null,null,null,null,null,null,null,null,null,null,null,null,null,null,null,null,null,null,null,null,null,"R",null,null,null,null,null,null,null,null,"Unit"]
["Amendment No.","Line Item No.","Pay Item Number","Pay Item Description","Unit","C: Typical Section","D: Plan, Roadway","E: Layout, Parking Area","F: Drainage","G: Walls","M: Temp. Erosion Control","P: Perm. Traffic Control","***: Column 8","B.66-B.85`: Column 9","-: Column 10","Plan: Allow- ance","C12: Column 12","C13: Column 13","Estimated Quantities\\Bid Schedule","Remarks and/or Determination of Estimated Quantity","Deleted",{"$f":"OFFSET(V5,-1,0)+IF(X5=OFFSET(X5,1,0),0,1)","v":1},{"$f":"IF(OFFSET(W5,0,col_Unit-COLUMN(W5))=\"Unit\",0,OFFSET(W5,-1,0)+IF(Y5=Y$4,0,MAX(1,BO5,DE5)))","v":0},{"$f":"IF(OR(Y5=Y$4,OFFSET(Y5,-1,0)=Y$4,LEFT(Y5,1)<>LEFT(OFFSET(Y5,-1,0),1)),W5,OFFSET(X5,-1,0))","v":0},{"$f":"OFFSET(Y5,0,-COLUMN(Y$2)+Y$2)","v":"Line Item No."},{"$f":"SUBSTITUTE(TRIM(OFFSET(Z5,0,-COLUMN(Z$2)+Z$2)),\" , \",\", \")","v":"Pay Item Description"},{"$f":"IFERROR(FIND(\" \",$Z5,IFERROR(OFFSET(AA5,0,-1)+1,1)),LEN($Z5))","v":4},9,20,20,20,20,20,20,20,20,{"$f":"IFERROR(FIND(\" \",$Z5,IFERROR(OFFSET(AK5,0,-1)+1,1)),LEN($Z5))","v":20},20,20,20,20,20,20,20,20,20,{"$f":"IFERROR(FIND(\" \",$Z5,IFERROR(OFFSET(AU5,0,-1)+1,1)),LEN($Z5))","v":20},20,20,20,20,20,20,20,20,20,20,20,{"$f":"HLOOKUP(IF(COLUMN(BG5)-COLUMN($BG$4)=0,0,OFFSET(BG5,0,-1))+width_Pay.item,$AA5:$BF5,1)","v":20},20,20,20,20,20,20,20,{"$f":"IF(LEN(DF5)>0,COUNTIF(BG5:BN5,\"<\"&MAX(BG5:BN5))+1,0)","v":0},{"$f":"TRIM(OFFSET(BP5,0,-COLUMN(BP$2)+BP$2))","v":"Remarks and/or Determination of Estimated Quantity"},{"$f":"IFERROR(FIND(\" \",$BP5,IFERROR(OFFSET(BQ5,0,-1)+1,1)),LEN($BP5))","v":8},15,29,32,42,50,50,50,50,50,{"$f":"IFERROR(FIND(\" \",$BP5,IFERROR(OFFSET(CA5,0,-1)+1,1)),LEN($BP5))","v":50},50,50,50,50,50,50,50,50,50,{"$f":"IFERROR(FIND(\" \",$BP5,IFERROR(OFFSET(CK5,0,-1)+1,1)),LEN($BP5))","v":50},50,50,50,50,50,50,50,50,50,50,50,{"$f":"HLOOKUP(IF(COLUMN(CW5)-COLUMN($CW$4)=0,0,OFFSET(CW5,0,-1))+width_Remarks,$BQ5:$CV5,1)","v":15},32,50,50,50,50,50,50,{"$f":"IF(LEN(DF5)>0,COUNTIF(CW5:DD5,\"<\"&MAX(CW5:DD5))+1,0)","v":0},{"$f":"IFERROR(VLOOKUP(OFFSET(DF5,0,col_Unit-COLUMN(DF$3)),Units[],2,0),\"\")","v":""}]
[null,"A0010","15101-0000","Mobilization   ","LPSM","All|||","All|||","All|||","All|||","All|||","All|||","All|||","All|||","All|||","All|||","All|||","All|||","All|||","All|ALL||",null,null,{"$f":"OFFSET(V6,-1,0)+IF(X6=OFFSET(X6,1,0),0,1)","v":1},{"$f":"IF(OFFSET(W6,0,col_Unit-COLUMN(W6))=\"Unit\",0,OFFSET(W6,-1,0)+IF(Y6=Y$4,0,MAX(1,BO6,DE6)))","v":1},{"$f":"IF(OR(Y6=Y$4,OFFSET(Y6,-1,0)=Y$4,LEFT(Y6,1)<>LEFT(OFFSET(Y6,-1,0),1)),W6,OFFSET(X6,-1,0))","v":1},"A0010","Mobilization",12,12,12,12,12,12,12,12,12,12,12,12,12,12,12,12,12,12,12,12,12,12,12,12,12,12,12,12,12,12,12,12,12,12,12,12,12,12,12,12,{"$f":"IF(LEN(DF6)>0,COUNTIF(BG6:BN6,\"<\"&MAX(BG6:BN6))+1,0)","v":1},"",0,0,0,0,0,0,0,0,0,0,0,0,0,0,0,0,0,0,0,0,0,0,0,0,0,0,0,0,0,0,0,0,0,0,0,0,0,0,0,0,{"$f":"IF(LEN(DF6)>0,COUNTIF(CW6:DD6,\"<\"&MAX(CW6:DD6))+1,0)","v":1},{"$f":"IFERROR(VLOOKUP(OFFSET(DF6,0,col_Unit-COLUMN(DF$3)),Units[],2,0),\"\")","v":"Dual"}]
[null,"A0020","15201-0000","Construction survey and staking   ","LPSM","All|||","All|All||","All|||","All|||","All|||","All|||","All|||","All|||","All|||","All|||","All|||","All|||","All|||","All|ALL||",null,null,1,2,1,"A0020","Construction survey and staking",13,20,24,31,31,31,31,31,31,31,31,31,31,31,31,31,31,31,31,31,31,31,31,31,31,31,31,31,31,31,31,31,31,31,31,31,31,31,31,31,1,"",0,0,0,0,0,0,0,0,0,0,0,0,0,0,0,0,0,0,0,0,0,0,0,0,0,0,0,0,0,0,0,0,0,0,0,0,0,0,0,0,1,{"$f":"IFERROR(VLOOKUP(OFFSET(DF7,0,col_Unit-COLUMN(DF$3)),Units[],2,0),\"\")","v":"Dual"}]
[null,"A0030","15301-0010","Contractor quality control and assurance   ","LPSM","All|||","All|||","All|||","All|||","All|||","All|||","All|||","All|||","All|||","All|||","All|||","All|||","All|||","All|ALL||",null,null,1,4,1,"A0030","Contractor quality control and assurance",11,19,27,31,40,40,40,40,40,40,40,40,40,40,40,40,40,40,40,40,40,40,40,40,40,40,40,40,40,40,40,40,31,40,40,40,40,40,40,40,2,"",0,0,0,0,0,0,0,0,0,0,0,0,0,0,0,0,0,0,0,0,0,0,0,0,0,0,0,0,0,0,0,0,0,0,0,0,0,0,0,0,1,{"$f":"IFERROR(VLOOKUP(OFFSET(DF8,0,col_Unit-COLUMN(DF$3)),Units[],2,0),\"\")","v":"Dual"}]
[null,"A0040","15401-0000","Contractor testing   ","LPSM","All|||","All|||","All|||","All|||","All|||","All|||","All|||","All|||","All|||","All|||","All|||","All|||","All|||","All|ALL||",null,null,1,5,1,"A0040","Contractor testing",11,18,18,18,18,18,18,18,18,18,18,18,18,18,18,18,18,18,18,18,18,18,18,18,18,18,18,18,18,18,18,18,18,18,18,18,18,18,18,18,1,"",0,0,0,0,0,0,0,0,0,0,0,0,0,0,0,0,0,0,0,0,0,0,0,0,0,0,0,0,0,0,0,0,0,0,0,0,0,0,0,0,1,{"$f":"IFERROR(VLOOKUP(OFFSET(DF9,0,col_Unit-COLUMN(DF$3)),Units[],2,0),\"\")","v":"Dual"}]
[null,"A0050","15501-0000","Construction schedule   ","LPSM","All|||","All|||","All|||","All|||","All|||","All|||","All|||","All|||","All|||","All|||","All|||","All|||","All|||","All|ALL||",null,null,1,6,1,"A0050","Construction schedule",13,21,21,21,21,21,21,21,21,21,21,21,21,21,21,21,21,21,21,21,21,21,21,21,21,21,21,21,21,21,21,21,21,21,21,21,21,21,21,21,1,"",0,0,0,0,0,0,0,0,0,0,0,0,0,0,0,0,0,0,0,0,0,0,0,0,0,0,0,0,0,0,0,0,0,0,0,0,0,0,0,0,1,{"$f":"IFERROR(VLOOKUP(OFFSET(DF10,0,col_Unit-COLUMN(DF$3)),Units[],2,0),\"\")","v":"Dual"}]
{"$rows_left_out":83}
{"sheet":"Variables","index":3,"n_rows":58,"n_cols":11,"rows_kept":58,"cut":false,"hidden":false,"merged":[[41,9,45,10]]}
["Variables"]
[null,"Base sheet name:","Sheet",null,null,"Prefix:",{"$f":"LEFT(Sheet,MIN(FIND({0,1,2,3,4,5,6,7,8,9},Sheet&\"0123456789\"))-1)","v":"B."}]
[null,"Min. rows/sheet:",5,null,null,"Sheets needed:",{"$f":"MATCH(MAX(SheetNames[Begins]),SheetNames[Begins],0)-1","v":4}]
[null,"Max. row/sheet:",40,null,null,"Current sheets:",{"$f":"COUNTIF(SheetNames[Sheet num],\">0\")","v":1}]
[null,"Metric?",{"$f":"ISNUMBER(MATCH(\"Metric\",Units.check,0))","v":true},null,null,"Description truncated?",{"$f":"MAX(OFFSET(Calcs,0,col_D-1+lines_D,ROWS(Calcs),1))=lines_D","v":false}]
[null,null,null,null,null,"Remarks truncated?",{"$f":"MAX(OFFSET(Calcs,0,col_R-1+lines_R,ROWS(Calcs),1))=lines_R","v":false}]
["SheetNames",null,null,null,null,null,null,null,null,"Units"]
["Sheet num","Worksheet","Sheet","Begins","Draft","Lines","Adjust","Sect",null,"Symbol","Unit"]
[{"$f":"IFERROR(IF(ISREF(INDIRECT(\"'\"&SheetNames[[#This Row],[Worksheet]]&\"'!A1\")),1,-1)*(ABS(OFFSET(SheetNames[[#This Row],[Sheet num]],-1,0))+1),VALUE(SUBSTITUTE(Sheet,Prefix,\"\")))","v":1},{"$f":"Base&IF(ROW()=ROW(SheetNames[]),\"\",\" (\"&ROW()-ROW(SheetNames[#Headers])&\")\")","v":"Sheet"},{"$f":"IF(ISREF(INDIRECT(\"'\"&SheetNames[[#This Row],[Worksheet]]&\"'!A1\")),Prefix&SheetNames[[#This Row],[Sheet num]],\"Undefined\")","v":"B.1"},{"$f":"IF(SheetNames[[#This Row],[Sect]]=OFFSET(SheetNames[[#This Row],[Sect]],-1,0),IF(OFFSET(SheetNames[[#This Row],[Begins]],-1,0)=TotalLines,TotalLines,VLOOKUP(OFFSET(SheetNames[[#This Row],[Begins]],-1,0)+maxRows-SheetNames[[#This Row],[Adjust]],Calcs,1)),INDEX(Calcs,MATCH(SheetNames[[#This Row],[Sect]],OFFSET(Calcs,0,-1,ROWS(Calcs),1),0),1))","v":0},{"$f":"IF(SheetNames[[#This Row],[Sect]]=OFFSET(SheetNames[[#This Row],[Sect]],-1,0),IF(OFFSET(SheetNames[[#This Row],[Draft]],-1,0)=TotalLines,TotalLines,VLOOKUP(OFFSET(SheetNames[[#This Row],[Draft]],-1,0)+maxRows,Calcs,1)),INDEX(Calcs,MATCH(SheetNames[[#This Row],[Sect]],OFFSET(Calcs,0,-1,ROWS(Calcs),1),0),1))","v":0},{"$f":"MAX(OFFSET(SheetNames[[#This Row],[Draft]],1,0)-SheetNames[[#This Row],[Draft]],0)","v":40},{"$f":"CEILING(IF(SUMIFS(SheetNames[Lines],SheetNames[Lines],\"<\"&minRows,SheetNames[Sect],SheetNames[[#This Row],[Sect]])>0,minRows-SUMIFS(SheetNames[Lines],SheetNames[Lines],\"<\"&minRows,SheetNames[Sect],SheetNames[[#This Row],[Sect]]),0)/(0.49*COUNTIFS(SheetNames[Sect],SheetNames[[#This Row],[Sect]])),1)","v":2},{"$f":"MIN(OFFSET(Calcs,MATCH(IFERROR(OFFSET(SheetNames[[#This Row],[Draft]],-1,0)+maxRows,0),OFFSET(Calcs,0,0,ROWS(Calcs),1),1)-1,-1,1,1),IFERROR(OFFSET(SheetNames[[#This Row],[Sect]],-1,0)+1,1))","v":1},null,"ACRE","US Customary"]
[{"$f":"IFERROR(IF(ISREF(INDIRECT(\"'\"&SheetNames[[#This Row],[Worksheet]]&\"'!A1\")),1,-1)*(ABS(OFFSET(SheetNames[[#This Row],[Sheet num]],-1,0))+1),VALUE(SUBSTITUTE(Sheet,Prefix,\"\")))","v":-2},{"$f":"Base&IF(ROW()=ROW(SheetNames[]),\"\",\" (\"&ROW()-ROW(SheetNames[#Headers])&\")\")","v":"Sheet (2)"},{"$f":"IF(ISREF(INDIRECT(\"'\"&SheetNames[[#This Row],[Worksheet]]&\"'!A1\")),Prefix&SheetNames[[#This Row],[Sheet num]],\"Undefined\")","v":"Undefined"},{"$f":"IF(SheetNames[[#This Row],[Sect]]=OFFSET(SheetNames[[#This Row],[Sect]],-1,0),IF(OFFSET(SheetNames[[#This Row],[Begins]],-1,0)=TotalLines,TotalLines,VLOOKUP(OFFSET(SheetNames[[#This Row],[Begins]],-1,0)+maxRows-SheetNames[[#This Row],[Adjust]],Calcs,1)),INDEX(Calcs,MATCH(SheetNames[[#This Row],[Sect]],OFFSET(Calcs,0,-1,ROWS(Calcs),1),0),1))","v":38},{"$f":"IF(SheetNames[[#This Row],[Sect]]=OFFSET(SheetNames[[#This Row],[Sect]],-1,0),IF(OFFSET(SheetNames[[#This Row],[Draft]],-1,0)=TotalLines,TotalLines,VLOOKUP(OFFSET(SheetNames[[#This Row],[Draft]],-1,0)+maxRows,Calcs,1)),INDEX(Calcs,MATCH(SheetNames[[#This Row],[Sect]],OFFSET(Calcs,0,-1,ROWS(Calcs),1),0),1))","v":40},{"$f":"MAX(OFFSET(SheetNames[[#This Row],[Draft]],1,0)-SheetNames[[#This Row],[Draft]],0)","v":39},{"$f":"CEILING(IF(SUMIFS(SheetNames[Lines],SheetNames[Lines],\"<\"&minRows,SheetNames[Sect],SheetNames[[#This Row],[Sect]])>0,minRows-SUMIFS(SheetNames[Lines],SheetNames[Lines],\"<\"&minRows,SheetNames[Sect],SheetNames[[#This Row],[Sect]]),0)/(0.49*COUNTIFS(SheetNames[Sect],SheetNames[[#This Row],[Sect]])),1)","v":2},{"$f":"MIN(OFFSET(Calcs,MATCH(IFERROR(OFFSET(SheetNames[[#This Row],[Draft]],-1,0)+maxRows,0),OFFSET(Calcs,0,0,ROWS(Calcs),1),1)-1,-1,1,1),IFERROR(OFFSET(SheetNames[[#This Row],[Sect]],-1,0)+1,1))","v":1},null,"CTSM","Dual"]
{"$rows_left_out":48}