{"text_format":"1","workbook":"xlsx","n_sheets":5,"sheets":["Instructions","Summary","Data","Sheet1","Sheet2"],"not_rendered":{"charts":0,"images":2,"macros":1,"external_links":1,"defined_names":21,"comments":0,"pivot_tables":0},"unopened":[],"bounds":{"document_bytes":16777216,"sheet_cells":100000,"rows_first":2000,"rows_last":500,"rows_between":2000,"halvings":0,"cell_chars":16384,"cell_head_chars":4096},"cells_cut":0,"cells_raw":0,"read":"whole","date_system":"1900"}

{"sheet":"Instructions","index":0,"n_rows":24,"n_cols":7,"rows_kept":24,"cut":false,"hidden":false,"merged":[]}
[null,null,null,null,null,null,{"$f":"Summary!PayItemFile","v":"N:\\CFL-DPIT\\Excel\\payitems24.csv"}]
[null,"Instructions"]
[null,1,"On the Summary Tab, click the \"Browse for Pay Item\" button, hit the \"Browse for Pay Item File\" in the dialog box and browse to N:\\CFL-DPIT\\Excel\\PayItems14.csv and select \"Open\" or if you downloaded the file off the network browse to the location to where it was saved."]
[null,null,"Click the \"Return to Excel\" button."]
[]
[null,2,"On the Summary Tab, click the \"Add/Remove Pay Items\" button."]
[null,null,"Pay items are broken out by pay item categories.  Choose the desired pay item category."]
[null,null,"Select the desired pay item and select \"Add Item\".  Repeat for all required pay items."]
[null,null,"To remove pay items click the \"Delete a pay item already placed in sheet\" button and select the desired pay item and click the \"delete item\" button.  Click the \"Close\" button to close the dialog box."]
[null,null,"When all desired pay items have been added click the \"Close\" button."]
[]
[null,3,"Add station,side, MUTCD reference, quantities and road classification.  If a special sign description is needed click on the Data tab and add description and sign size.  Add and remove schedules to tables using the buttons at the top of the Summary tab.  Hide and unhide rows to tables using the buttons at the top of the Summary tab.  Merge and center title over the entire table width."]
[]
[null,4,"Using the Engineer's Estimate Manual (https://highways.dot.gov/federal-lands/estimates/cfl-estimate-manual), determine the correct rounding % and round up values for each item."]
[]
[]
[]
[]
[]
[]
{"$rows_left_out":5}
{"sheet":"Summary","index":1,"n_rows":117,"n_cols":14,"rows_kept":117,"cut":false,"hidden":false,"merged":[[6,3,8,3],[6,7,8,7],[2,12,2,15],[6,2,8,2],[6,12,7,12],[6,8,7,8],[5,9,7,9],[5,3,5,7],[6,6,8,6],[6,4,8,4],[4,3,4,7],[6,5,7,5],[113,0,113,2],[108,0,108,2],[103,0,103,2],[39,2,39,7],[101,2,101,7],[70,2,70,7]]}
[null,null,null,null,null,null,null,"N:\\CFL-DPIT\\Excel\\payitems24.csv"]
[null,null,null,null,null,null,null,null,"Leave this column HIDDEN!!! Do not delete",null,null,null,null,"Leave this column HIDDEN!!! Do not delete"]
["Check Column - do not delete",null,null,null,null,null,null,null,{"$f":"IF(ISERROR(VLOOKUP(I2,Data!$A:$C,2,FALSE)),\"\",VLOOKUP(I2,Data!$A:$C,2,FALSE))","v":""},null,null,null,"Do not manually add columns to the spreadsheet.  The macro will become inoperable if columns are added to the left of the quantity column."]
[]
[null,null,null,"CONSTRUCTION SIGN SUMMARY",null,null,null,null,null,null,null,null,"*Remember to Merge and Center the Title over the entire table"]
[null,null,null,"Item Number",null,null,null,null,{"$f":"I2","v":"Leave this column HIDDEN!!! Do not delete"},"Remarks",null,null,null,{"$f":"N2","v":"Leave this column HIDDEN!!! Do not delete"}]
[null,null,"Schedule","MUTCD Reference","Description","Sign Panel","Area","Quantity",{"$f":"IF(ISBLANK(I2),\"\",LOOKUP(I2,'[1]FP24 Pay Items'!$B$1:$B$65536,'[1]FP24 Pay Items'!$E$1:$E$65536))","v":"FUNDING RECLASSIFICATION"},null,null,null,"Road Classification\n(Conventional Road, Freeway or Expressway, Minimum)\nSee Tables 6G-1/6H-1 in the MUTCD"]
[]
[null,null,null,null,null,"in x in",null,null,{"$f":"IF(ISBLANK(I2),\"\",LOOKUP(I2,'[1]FP24 Pay Items'!$B$1:$B$65536,'[1]FP24 Pay Items'!$F$1:$F$65536))","v":"LPSM"}]
[]
[null,null,null,null,{"$f":"IF(D11=\"\",\"\",VLOOKUP($D11,Data!I:J,2,FALSE))","v":""},{"$f":"IF(D11=\"\",\"\",HLOOKUP($M11,Data!$I$2:$M$199,MATCH($D11,Data!$I$2:$I$199,0),FALSE))","v":""},{"$f":"IF(D11=\"\",\"\",HLOOKUP($N11,Data!$N$2:$P$199,MATCH($D11,Data!$I$2:$I$199,0),FALSE))","v":""},null,null,null,null,null,null,{"$f":"IF(M11=\"Conventional Road\",\"Conventional Road2\",IF(M11=\"Freeway or Expressway\",\"Freeway or Expressway3\",IF(M11=\"Minimum\",\"Minimum4\",\"\")))","v":""}]
[null,null,null,null,{"$f":"IF(D12=\"\",\"\",VLOOKUP($D12,Data!I:J,2,FALSE))","v":""},{"$f":"IF(D12=\"\",\"\",HLOOKUP($M12,Data!$I$2:$M$199,MATCH($D12,Data!$I$2:$I$199,0),FALSE))","v":""},{"$f":"IF(D12=\"\",\"\",HLOOKUP($N12,Data!$N$2:$P$199,MATCH($D12,Data!$I$2:$I$199,0),FALSE))","v":""},null,null,null,null,null,null,{"$f":"IF(M12=\"Conventional Road\",\"Conventional Road2\",IF(M12=\"Freeway or Expressway\",\"Freeway or Expressway3\",IF(M12=\"Minimum\",\"Minimum4\",\"\")))","v":""}]
[null,null,null,null,{"$f":"IF(D13=\"\",\"\",VLOOKUP($D13,Data!I:J,2,FALSE))","v":""},{"$f":"IF(D13=\"\",\"\",HLOOKUP($M13,Data!$I$2:$M$199,MATCH($D13,Data!$I$2:$I$199,0),FALSE))","v":""},{"$f":"IF(D13=\"\",\"\",HLOOKUP($N13,Data!$N$2:$P$199,MATCH($D13,Data!$I$2:$I$199,0),FALSE))","v":""},null,null,null,null,null,null,""]
[null,null,null,null,{"$f":"IF(D14=\"\",\"\",VLOOKUP($D14,Data!I:J,2,FALSE))","v":""},{"$f":"IF(D14=\"\",\"\",HLOOKUP($M14,Data!$I$2:$M$199,MATCH($D14,Data!$I$2:$I$199,0),FALSE))","v":""},{"$f":"IF(D14=\"\",\"\",HLOOKUP($N14,Data!$N$2:$P$199,MATCH($D14,Data!$I$2:$I$199,0),FALSE))","v":""},null,null,null,null,null,null,""]
[null,null,null,null,{"$f":"IF(D15=\"\",\"\",VLOOKUP($D15,Data!I:J,2,FALSE))","v":""},{"$f":"IF(D15=\"\",\"\",HLOOKUP($M15,Data!$I$2:$M$199,MATCH($D15,Data!$I$2:$I$199,0),FALSE))","v":""},{"$f":"IF(D15=\"\",\"\",HLOOKUP($N15,Data!$N$2:$P$199,MATCH($D15,Data!$I$2:$I$199,0),FALSE))","v":""},null,null,null,null,null,null,""]
[null,null,null,null,{"$f":"IF(D16=\"\",\"\",VLOOKUP($D16,Data!I:J,2,FALSE))","v":""},{"$f":"IF(D16=\"\",\"\",HLOOKUP($M16,Data!$I$2:$M$199,MATCH($D16,Data!$I$2:$I$199,0),FALSE))","v":""},{"$f":"IF(D16=\"\",\"\",HLOOKUP($N16,Data!$N$2:$P$199,MATCH($D16,Data!$I$2:$I$199,0),FALSE))","v":""},null,null,null,null,null,null,""]
[null,null,null,null,{"$f":"IF(D17=\"\",\"\",VLOOKUP($D17,Data!I:J,2,FALSE))","v":""},{"$f":"IF(D17=\"\",\"\",HLOOKUP($M17,Data!$I$2:$M$199,MATCH($D17,Data!$I$2:$I$199,0),FALSE))","v":""},{"$f":"IF(D17=\"\",\"\",HLOOKUP($N17,Data!$N$2:$P$199,MATCH($D17,Data!$I$2:$I$199,0),FALSE))","v":""},null,null,null,null,null,null,""]
[null,null,null,null,{"$f":"IF(D18=\"\",\"\",VLOOKUP($D18,Data!I:J,2,FALSE))","v":""},{"$f":"IF(D18=\"\",\"\",HLOOKUP($M18,Data!$I$2:$M$199,MATCH($D18,Data!$I$2:$I$199,0),FALSE))","v":""},{"$f":"IF(D18=\"\",\"\",HLOOKUP($N18,Data!$N$2:$P$199,MATCH($D18,Data!$I$2:$I$199,0),FALSE))","v":""},null,null,null,null,null,null,""]
[null,null,null,null,{"$f":"IF(D19=\"\",\"\",VLOOKUP($D19,Data!I:J,2,FALSE))","v":""},{"$f":"IF(D19=\"\",\"\",HLOOKUP($M19,Data!$I$2:$M$199,MATCH($D19,Data!$I$2:$I$199,0),FALSE))","v":""},{"$f":"IF(D19=\"\",\"\",HLOOKUP($N19,Data!$N$2:$P$199,MATCH($D19,Data!$I$2:$I$199,0),FALSE))","v":""},null,null,null,null,null,null,""]
[null,null,null,null,{"$f":"IF(D20=\"\",\"\",VLOOKUP($D20,Data!I:J,2,FALSE))","v":""},{"$f":"IF(D20=\"\",\"\",HLOOKUP($M20,Data!$I$2:$M$199,MATCH($D20,Data!$I$2:$I$199,0),FALSE))","v":""},{"$f":"IF(D20=\"\",\"\",HLOOKUP($N20,Data!$N$2:$P$199,MATCH($D20,Data!$I$2:$I$199,0),FALSE))","v":""},null,null,null,null,null,null,""]
{"$rows_left_out":98}
{"sheet":"Data","index":2,"n_rows":199,"n_cols":28,"rows_kept":199,"cut":false,"hidden":false,"merged":[[0,10,0,12],[0,16,0,19],[0,20,0,22]]}
["Pay Item Number","Description","Unit","Num Items",null,"Sides","Schedules",null,null,null,"Sign Sizes",null,null,"Area",null,null,"Conventional",null,null,null,"Freeway",null,null,null,"Minimum"]
[null,null,null,{"$f":"COUNTA(A:A)-1","v":0},null,"RT",1,null,"Sign","Description","Conventional Road","Freeway or Expressway","Minimum","Conventional Road2","Freeway or Expressway3","Minimum2","a_c","b_c","c_c","s_c","a_f","b_f","c_f","s_f","a_m","b_m","c_m","s_m"]
[null,null,null,null,null,"LT",null,null,"Special 1",null,null,null,null,{"$f":"LEFT(K3,2)*(RIGHT(K3,2)/144)","v":{"$error":"#VALUE!"}},{"$f":"LEFT(L3,2)*(RIGHT(L3,2)/144)","v":{"$error":"#VALUE!"}},{"$error":"#VALUE!"},{"$f":"LEFT(Table1[[#This Row],[Conventional Road]],2)","v":""},{"$f":"MID(Table1[[#This Row],[Conventional Road]],6,2)","v":""},{"$f":"RIGHT(Table1[[#This Row],[Conventional Road]],2)","v":""},{"$f":"36*3/2","v":54},{"$f":"LEFT(Table1[[#This Row],[Freeway or Expressway]],2)","v":""},{"$f":"MID(Table1[[#This Row],[Freeway or Expressway]],6,2)","v":""},{"$f":"RIGHT(Table1[[#This Row],[Freeway or Expressway]],2)","v":""},{"$f":"(Table1[[#This Row],[a_f]]+Table1[[#This Row],[b_f]]+Table1[[#This Row],[c_f]])/2","v":{"$error":"#VALUE!"}},{"$f":"LEFT(Table1[[#This Row],[Minimum]],2)","v":""},{"$f":"30*3/2","v":45},{"$f":"RIGHT(Table1[[#This Row],[Minimum]],2)","v":""},{"$f":"(64+64+48)/2","v":88}]
[null,null,null,null,null,"LT/RT",null,null,"Special 2",null,null,null,null,{"$error":"#VALUE!"},{"$error":"#VALUE!"},{"$f":"SQRT(AB4*(AB4-Y4)*(AB4-Z4)*(AB4-AA4))","v":{"$error":"#VALUE!"}},{"$f":"LEFT(Table1[[#This Row],[Conventional Road]],2)","v":""},{"$f":"MID(Table1[[#This Row],[Conventional Road]],6,2)","v":""},{"$f":"RIGHT(Table1[[#This Row],[Conventional Road]],2)","v":""},54,{"$f":"LEFT(Table1[[#This Row],[Freeway or Expressway]],2)","v":""},{"$f":"MID(Table1[[#This Row],[Freeway or Expressway]],6,2)","v":""},{"$f":"RIGHT(Table1[[#This Row],[Freeway or Expressway]],2)","v":""},{"$f":"(Table1[[#This Row],[a_f]]+Table1[[#This Row],[b_f]]+Table1[[#This Row],[c_f]])/2","v":{"$error":"#VALUE!"}},{"$f":"LEFT(Table1[[#This Row],[Minimum]],2)","v":""},45,{"$f":"RIGHT(Table1[[#This Row],[Minimum]],2)","v":""},88]
[null,null,null,null,null,null,null,null,"Special 3",null,null,null,null,{"$error":"#VALUE!"},{"$error":"#VALUE!"},{"$error":"#VALUE!"},{"$f":"LEFT(Table1[[#This Row],[Conventional Road]],2)","v":""},{"$f":"MID(Table1[[#This Row],[Conventional Road]],6,2)","v":""},{"$f":"RIGHT(Table1[[#This Row],[Conventional Road]],2)","v":""},54,{"$f":"LEFT(Table1[[#This Row],[Freeway or Expressway]],2)","v":""},{"$f":"MID(Table1[[#This Row],[Freeway or Expressway]],6,2)","v":""},{"$f":"RIGHT(Table1[[#This Row],[Freeway or Expressway]],2)","v":""},{"$f":"(Table1[[#This Row],[a_f]]+Table1[[#This Row],[b_f]]+Table1[[#This Row],[c_f]])/2","v":{"$error":"#VALUE!"}},{"$f":"LEFT(Table1[[#This Row],[Minimum]],2)","v":""},45,{"$f":"RIGHT(Table1[[#This Row],[Minimum]],2)","v":""},88]
[null,null,null,null,null,null,null,null,"Special 4",null,null,null,null,{"$error":"#VALUE!"},{"$error":"#VALUE!"},{"$error":"#VALUE!"},{"$f":"LEFT(Table1[[#This Row],[Conventional Road]],2)","v":""},{"$f":"MID(Table1[[#This Row],[Conventional Road]],6,2)","v":""},{"$f":"RIGHT(Table1[[#This Row],[Conventional Road]],2)","v":""},54,{"$f":"LEFT(Table1[[#This Row],[Freeway or Expressway]],2)","v":""},{"$f":"MID(Table1[[#This Row],[Freeway or Expressway]],6,2)","v":""},{"$f":"RIGHT(Table1[[#This Row],[Freeway or Expressway]],2)","v":""},{"$f":"(Table1[[#This Row],[a_f]]+Table1[[#This Row],[b_f]]+Table1[[#This Row],[c_f]])/2","v":{"$error":"#VALUE!"}},{"$f":"LEFT(Table1[[#This Row],[Minimum]],2)","v":""},45,{"$f":"RIGHT(Table1[[#This Row],[Minimum]],2)","v":""},88]
[null,null,null,null,null,null,null,null,"Special 5",null,null,null,null,{"$error":"#VALUE!"},{"$error":"#VALUE!"},{"$error":"#VALUE!"},{"$f":"LEFT(Table1[[#This Row],[Conventional Road]],2)","v":""},{"$f":"MID(Table1[[#This Row],[Conventional Road]],6,2)","v":""},{"$f":"RIGHT(Table1[[#This Row],[Conventional Road]],2)","v":""},54,{"$f":"LEFT(Table1[[#This Row],[Freeway or Expressway]],2)","v":""},{"$f":"MID(Table1[[#This Row],[Freeway or Expressway]],6,2)","v":""},{"$f":"RIGHT(Table1[[#This Row],[Freeway or Expressway]],2)","v":""},{"$f":"(Table1[[#This Row],[a_f]]+Table1[[#This Row],[b_f]]+Table1[[#This Row],[c_f]])/2","v":{"$error":"#VALUE!"}},{"$f":"LEFT(Table1[[#This Row],[Minimum]],2)","v":""},45,{"$f":"RIGHT(Table1[[#This Row],[Minimum]],2)","v":""},88]
[null,null,null,null,null,null,null,null,"G20-1","Road Work Next XX Miles","36 x 18","48 x 24","—",{"$f":"LEFT(K8,2)*(RIGHT(K8,2)/144)","v":4.5},{"$f":"LEFT(L8,2)*(RIGHT(L8,2)/144)","v":8},"—",{"$f":"LEFT(Table1[[#This Row],[Conventional Road]],2)","v":"36"},{"$f":"MID(Table1[[#This Row],[Conventional Road]],6,2)","v":"18"},{"$f":"RIGHT(Table1[[#This Row],[Conventional Road]],2)","v":"18"},54,{"$f":"LEFT(Table1[[#This Row],[Freeway or Expressway]],2)","v":"48"},{"$f":"MID(Table1[[#This Row],[Freeway or Expressway]],6,2)","v":"24"},{"$f":"RIGHT(Table1[[#This Row],[Freeway or Expressway]],2)","v":"24"},{"$f":"(Table1[[#This Row],[a_f]]+Table1[[#This Row],[b_f]]+Table1[[#This Row],[c_f]])/2","v":48},{"$f":"LEFT(Table1[[#This Row],[Minimum]],2)","v":"—"},45,{"$f":"RIGHT(Table1[[#This Row],[Minimum]],2)","v":"—"},88]
[null,null,null,null,null,null,null,null,"G20-2","End Road Work","36 x 18","48 x 24","—",{"$f":"LEFT(K9,2)*(RIGHT(K9,2)/144)","v":4.5},8,"—",{"$f":"LEFT(Table1[[#This Row],[Conventional Road]],2)","v":"36"},{"$f":"MID(Table1[[#This Row],[Conventional Road]],6,2)","v":"18"},{"$f":"RIGHT(Table1[[#This Row],[Conventional Road]],2)","v":"18"},54,{"$f":"LEFT(Table1[[#This Row],[Freeway or Expressway]],2)","v":"48"},{"$f":"MID(Table1[[#This Row],[Freeway or Expressway]],6,2)","v":"24"},{"$f":"RIGHT(Table1[[#This Row],[Freeway or Expressway]],2)","v":"24"},{"$f":"(Table1[[#This Row],[a_f]]+Table1[[#This Row],[b_f]]+Table1[[#This Row],[c_f]])/2","v":48},{"$f":"LEFT(Table1[[#This Row],[Minimum]],2)","v":"—"},45,{"$f":"RIGHT(Table1[[#This Row],[Minimum]],2)","v":"—"},88]
[null,null,null,null,null,null,null,null,"G20-4","Pilot Car Follow Me","36 x 18","—","—",4.5,"—","—",{"$f":"LEFT(Table1[[#This Row],[Conventional Road]],2)","v":"36"},{"$f":"MID(Table1[[#This Row],[Conventional Road]],6,2)","v":"18"},{"$f":"RIGHT(Table1[[#This Row],[Conventional Road]],2)","v":"18"},54,{"$f":"LEFT(Table1[[#This Row],[Freeway or Expressway]],2)","v":"—"},{"$f":"MID(Table1[[#This Row],[Freeway or Expressway]],6,2)","v":""},{"$f":"RIGHT(Table1[[#This Row],[Freeway or Expressway]],2)","v":"—"},{"$f":"(Table1[[#This Row],[a_f]]+Table1[[#This Row],[b_f]]+Table1[[#This Row],[c_f]])/2","v":{"$error":"#VALUE!"}},{"$f":"LEFT(Table1[[#This Row],[Minimum]],2)","v":"—"},45,{"$f":"RIGHT(Table1[[#This Row],[Minimum]],2)","v":"—"},88]
[null,null,null,null,null,null,null,null,"G20-5aP","Work Zone (plaque)","24 x 18","36 x 24","—",3,6,"—",{"$f":"LEFT(Table1[[#This Row],[Conventional Road]],2)","v":"24"},{"$f":"MID(Table1[[#This Row],[Conventional Road]],6,2)","v":"18"},{"$f":"RIGHT(Table1[[#This Row],[Conventional Road]],2)","v":"18"},54,{"$f":"LEFT(Table1[[#This Row],[Freeway or Expressway]],2)","v":"36"},{"$f":"MID(Table1[[#This Row],[Freeway or Expressway]],6,2)","v":"24"},{"$f":"RIGHT(Table1[[#This Row],[Freeway or Expressway]],2)","v":"24"},{"$f":"(Table1[[#This Row],[a_f]]+Table1[[#This Row],[b_f]]+Table1[[#This Row],[c_f]])/2","v":42},{"$f":"LEFT(Table1[[#This Row],[Minimum]],2)","v":"—"},45,{"$f":"RIGHT(Table1[[#This Row],[Minimum]],2)","v":"—"},88]
[null,null,null,null,null,null,null,null,"E5-2","Exit Open","48 x 36","48 x 36","—",12,12,"—",{"$f":"LEFT(Table1[[#This Row],[Conventional Road]],2)","v":"48"},{"$f":"MID(Table1[[#This Row],[Conventional Road]],6,2)","v":"36"},{"$f":"RIGHT(Table1[[#This Row],[Conventional Road]],2)","v":"36"},54,{"$f":"LEFT(Table1[[#This Row],[Freeway or Expressway]],2)","v":"48"},{"$f":"MID(Table1[[#This Row],[Freeway or Expressway]],6,2)","v":"36"},{"$f":"RIGHT(Table1[[#This Row],[Freeway or Expressway]],2)","v":"36"},{"$f":"(Table1[[#This Row],[a_f]]+Table1[[#This Row],[b_f]]+Table1[[#This Row],[c_f]])/2","v":60},{"$f":"LEFT(Table1[[#This Row],[Minimum]],2)","v":"—"},45,{"$f":"RIGHT(Table1[[#This Row],[Minimum]],2)","v":"—"},88]
[null,null,null,null,null,null,null,null,"E5-2a","Exit Closed","48 x 36","48 x 36","—",12,12,"—",{"$f":"LEFT(Table1[[#This Row],[Conventional Road]],2)","v":"48"},{"$f":"MID(Table1[[#This Row],[Conventional Road]],6,2)","v":"36"},{"$f":"RIGHT(Table1[[#This Row],[Conventional Road]],2)","v":"36"},54,{"$f":"LEFT(Table1[[#This Row],[Freeway or Expressway]],2)","v":"48"},{"$f":"MID(Table1[[#This Row],[Freeway or Expressway]],6,2)","v":"36"},{"$f":"RIGHT(Table1[[#This Row],[Freeway or Expressway]],2)","v":"36"},{"$f":"(Table1[[#This Row],[a_f]]+Table1[[#This Row],[b_f]]+Table1[[#This Row],[c_f]])/2","v":60},{"$f":"LEFT(Table1[[#This Row],[Minimum]],2)","v":"—"},45,{"$f":"RIGHT(Table1[[#This Row],[Minimum]],2)","v":"—"},88]
[null,null,null,null,null,null,null,null,"E5-3","Exit Only","48 x 36","48 x 36","—",12,12,"—",{"$f":"LEFT(Table1[[#This Row],[Conventional Road]],2)","v":"48"},{"$f":"MID(Table1[[#This Row],[Conventional Road]],6,2)","v":"36"},{"$f":"RIGHT(Table1[[#This Row],[Conventional Road]],2)","v":"36"},54,{"$f":"LEFT(Table1[[#This Row],[Freeway or Expressway]],2)","v":"48"},{"$f":"MID(Table1[[#This Row],[Freeway or Expressway]],6,2)","v":"36"},{"$f":"RIGHT(Table1[[#This Row],[Freeway or Expressway]],2)","v":"36"},{"$f":"(Table1[[#This Row],[a_f]]+Table1[[#This Row],[b_f]]+Table1[[#This Row],[c_f]])/2","v":60},{"$f":"LEFT(Table1[[#This Row],[Minimum]],2)","v":"—"},45,{"$f":"RIGHT(Table1[[#This Row],[Minimum]],2)","v":"—"},88]
[null,null,null,null,null,null,null,null,"M4-8","Detour","24 x 12","30 x 15","—",2,3.125,"—",{"$f":"LEFT(Table1[[#This Row],[Conventional Road]],2)","v":"24"},{"$f":"MID(Table1[[#This Row],[Conventional Road]],6,2)","v":"12"},{"$f":"RIGHT(Table1[[#This Row],[Conventional Road]],2)","v":"12"},54,{"$f":"LEFT(Table1[[#This Row],[Freeway or Expressway]],2)","v":"30"},{"$f":"MID(Table1[[#This Row],[Freeway or Expressway]],6,2)","v":"15"},{"$f":"RIGHT(Table1[[#This Row],[Freeway or Expressway]],2)","v":"15"},{"$f":"(Table1[[#This Row],[a_f]]+Table1[[#This Row],[b_f]]+Table1[[#This Row],[c_f]])/2","v":30},{"$f":"LEFT(Table1[[#This Row],[Minimum]],2)","v":"—"},45,{"$f":"RIGHT(Table1[[#This Row],[Minimum]],2)","v":"—"},88]
[null,null,null,null,null,null,null,null,"M4-8a","End Detour","24 x 18","24 x 18","—",3,3,"—",{"$f":"LEFT(Table1[[#This Row],[Conventional Road]],2)","v":"24"},{"$f":"MID(Table1[[#This Row],[Conventional Road]],6,2)","v":"18"},{"$f":"RIGHT(Table1[[#This Row],[Conventional Road]],2)","v":"18"},54,{"$f":"LEFT(Table1[[#This Row],[Freeway or Expressway]],2)","v":"24"},{"$f":"MID(Table1[[#This Row],[Freeway or Expressway]],6,2)","v":"18"},{"$f":"RIGHT(Table1[[#This Row],[Freeway or Expressway]],2)","v":"18"},{"$f":"(Table1[[#This Row],[a_f]]+Table1[[#This Row],[b_f]]+Table1[[#This Row],[c_f]])/2","v":30},{"$f":"LEFT(Table1[[#This Row],[Minimum]],2)","v":"—"},45,{"$f":"RIGHT(Table1[[#This Row],[Minimum]],2)","v":"—"},88]
[null,null,null,null,null,null,null,null,"M4-8b","End","24 x 12","24 x 12","—",2,2,"—",{"$f":"LEFT(Table1[[#This Row],[Conventional Road]],2)","v":"24"},{"$f":"MID(Table1[[#This Row],[Conventional Road]],6,2)","v":"12"},{"$f":"RIGHT(Table1[[#This Row],[Conventional Road]],2)","v":"12"},54,{"$f":"LEFT(Table1[[#This Row],[Freeway or Expressway]],2)","v":"24"},{"$f":"MID(Table1[[#This Row],[Freeway or Expressway]],6,2)","v":"12"},{"$f":"RIGHT(Table1[[#This Row],[Freeway or Expressway]],2)","v":"12"},{"$f":"(Table1[[#This Row],[a_f]]+Table1[[#This Row],[b_f]]+Table1[[#This Row],[c_f]])/2","v":24},{"$f":"LEFT(Table1[[#This Row],[Minimum]],2)","v":"—"},45,{"$f":"RIGHT(Table1[[#This Row],[Minimum]],2)","v":"—"},88]
[null,null,null,null,null,null,null,null,"M4-9","Detour","30 x 24","48 x 36","—",5,12,"—",{"$f":"LEFT(Table1[[#This Row],[Conventional Road]],2)","v":"30"},{"$f":"MID(Table1[[#This Row],[Conventional Road]],6,2)","v":"24"},{"$f":"RIGHT(Table1[[#This Row],[Conventional Road]],2)","v":"24"},54,{"$f":"LEFT(Table1[[#This Row],[Freeway or Expressway]],2)","v":"48"},{"$f":"MID(Table1[[#This Row],[Freeway or Expressway]],6,2)","v":"36"},{"$f":"RIGHT(Table1[[#This Row],[Freeway or Expressway]],2)","v":"36"},{"$f":"(Table1[[#This Row],[a_f]]+Table1[[#This Row],[b_f]]+Table1[[#This Row],[c_f]])/2","v":60},{"$f":"LEFT(Table1[[#This Row],[Minimum]],2)","v":"—"},45,{"$f":"RIGHT(Table1[[#This Row],[Minimum]],2)","v":"—"},88]
[null,null,null,null,null,null,null,null,"M4-9a","Bike/Pedestrian Detour","30 x 24","—","—",5,"—","—",{"$f":"LEFT(Table1[[#This Row],[Conventional Road]],2)","v":"30"},{"$f":"MID(Table1[[#This Row],[Conventional Road]],6,2)","v":"24"},{"$f":"RIGHT(Table1[[#This Row],[Conventional Road]],2)","v":"24"},54,{"$f":"LEFT(Table1[[#This Row],[Freeway or Expressway]],2)","v":"—"},{"$f":"MID(Table1[[#This Row],[Freeway or Expressway]],6,2)","v":""},{"$f":"RIGHT(Table1[[#This Row],[Freeway or Expressway]],2)","v":"—"},{"$f":"(Table1[[#This Row],[a_f]]+Table1[[#This Row],[b_f]]+Table1[[#This Row],[c_f]])/2","v":{"$error":"#VALUE!"}},{"$f":"LEFT(Table1[[#This Row],[Minimum]],2)","v":"—"},45,{"$f":"RIGHT(Table1[[#This Row],[Minimum]],2)","v":"—"},88]
[null,null,null,null,null,null,null,null,"M4-9b","Pedestrian Detour","30 x 24","—","—",5,"—","—",{"$f":"LEFT(Table1[[#This Row],[Conventional Road]],2)","v":"30"},{"$f":"MID(Table1[[#This Row],[Conventional Road]],6,2)","v":"24"},{"$f":"RIGHT(Table1[[#This Row],[Conventional Road]],2)","v":"24"},54,{"$f":"LEFT(Table1[[#This Row],[Freeway or Expressway]],2)","v":"—"},{"$f":"MID(Table1[[#This Row],[Freeway or Expressway]],6,2)","v":""},{"$f":"RIGHT(Table1[[#This Row],[Freeway or Expressway]],2)","v":"—"},{"$f":"(Table1[[#This Row],[a_f]]+Table1[[#This Row],[b_f]]+Table1[[#This Row],[c_f]])/2","v":{"$error":"#VALUE!"}},{"$f":"LEFT(Table1[[#This Row],[Minimum]],2)","v":"—"},45,{"$f":"RIGHT(Table1[[#This Row],[Minimum]],2)","v":"—"},88]
{"$rows_left_out":180}
{"sheet":"Sheet1","index":3,"n_rows":56,"n_cols":10,"rows_kept":56,"cut":false,"hidden":false,"merged":[]}
[]
[null,null,null,null,null,"D5-1","Rest Area XX Miles","66 x 36*","96 x 54*"]
[null,null,null,null,null,"D5-1a","Rest Area Next Right","78 x 36*","120 x 60* (F)","114 x 48* (E)"]
[null,null,null,null,null,"D5-2","Rest Area (with arrow)","66 x 36*","96 x 54*"]
[null,null,null,null,null,"D5-2a","Rest Area Gore","42 x 48*","78 x 78* (F)","66 x 72* (E)"]
[null,null,null,null,null,"D5-5","Rest Area (with horizontal arrow)","42 x 48*","—"]
[null,null,null,null,null,"D5-6","Next Rest Area XX Miles","60 x 48*","90 x 72*"]
[null,null,null,null,null,"D5-7","Rest Area Tourist Info Center XX Miles","90 x 72*","114 x 102* (F)","132 x 96* (E)"]
[null,null,null,null,null,"D5-8","Rest Area Tourist Info Center (with arrow)","84 x 72*","120 x 102* (F)","120 x 96* (E)"]
[null,null,null,null,null,"D5-11","Rest Area Tourist Info Center Next Right","90 x 72*","144 x 102* (F)","132 x 96* (E)"]
[null,null,null,null,null,"D5-12","Interstate Oasis","—","156 x 78"]
[null,null,null,null,null,"D5-12P","Interstate Oasis (plaque)","—","114 x 48"]
[null,null,null,null,null,"D5-13","Brake Check Area XX Miles","84 x 48","126 x 72"]
[null,null,null,null,null,"D5-14","Brake Check Area (with arrow)","78 x 60","96 x 72"]
[null,null,null,null,null,"D5-15","Chain-Up Area XX Miles","66 x 48","96 x 72"]
[null,null,null,null,null,"D5-16","Chain-Up Area (with arrow)","72 x 54","96 x 66"]
[null,null,null,null,null,"D9-1","Telephone","24 x 24","30 x 30"]
[null,null,null,null,null,"D9-2","Hospital","24 x 24","30 x 30"]
[null,null,null,null,null,"D9-3","Camping","24 x 24","30 x 30"]
[null,null,null,null,null,"D9-3a","Trailer Camping","24 x 24","30 x 30"]
{"$rows_left_out":37}
{"sheet":"Sheet2","index":4,"n_rows":5,"n_cols":6,"rows_kept":5,"cut":false,"hidden":false,"merged":[]}
[]
[]
[null,null,"Standard 635-1 Typical Sign layout",null,"Signs Needed"]
[null,null,"G20-1","Road Work Next xx Miles",2,"Only if work zone is longer than 2 miles"]
[null,null,"W20+-1","Road Work XXXX",4,"Plus one for each major approach road"]