{"text_format":"1","workbook":"xlsx","n_sheets":4,"sheets":["Instructions","Summary","Data","Sheet1"],"not_rendered":{"charts":0,"images":2,"macros":1,"external_links":1,"defined_names":37,"comments":0,"pivot_tables":0},"unopened":[],"bounds":{"document_bytes":16777216,"sheet_cells":100000,"rows_first":2000,"rows_last":500,"rows_between":2000,"halvings":0,"cell_chars":16384,"cell_head_chars":4096},"cells_cut":0,"cells_raw":0,"read":"whole","date_system":"1900"}

{"sheet":"Instructions","index":0,"n_rows":24,"n_cols":7,"rows_kept":24,"cut":false,"hidden":false,"merged":[]}
[null,null,null,null,null,null,{"$f":"Summary!PayItemFile","v":"N:\\CFL-DPIT\\Excel\\PayItems24.csv"}]
[null,"Instructions"]
[null,1,"On the Summary Tab, click the \"Browse for Pay Item\" button, hit the \"Browse for Pay Item File\" in the dialog box and browse to N:\\CFL-DPIT\\Excel\\PayItems24.csv and select \"Open\" or if you downloaded the file off the network browse to the location to where it was saved."]
[null,null,"Click the \"Return to Excel\" button."]
[]
[null,2,"On the Summary Tab, click the \"Add/Remove Pay Items\" button."]
[null,null,"Pay items are broken out by pay item categories.  Choose the desired pay item category."]
[null,null,"Select the desired pay item and select \"Add Item\".  Repeat for all required pay items."]
[null,null,"To remove pay items click the \"Delete a pay item already placed in sheet\" button and select the desired pay item and click the \"delete item\" button.  Click the \"Close\" button to close the dialog box."]
[null,null,"When all desired pay items have been added click the \"Close\" button."]
[]
[null,3,"Add station,side, MUTCD reference, quantities and road classification.  If a special sign description is needed click on the Data tab and add description and sign size.  Add and remove schedules to tables using the buttons at the top of the Summary tab.  Hide and unhide rows to tables using the buttons at the top of the Summary tab.  Merge and center title over the entire table width."]
[]
[null,4,"Using the Engineer's Estimate Manual (https://highways.dot.gov/federal-lands/estimates/cfl-estimate-manual), determine the correct rounding % and round up values for each item."]
[]
[]
[]
[]
[]
[]
[]
[]
[null,null,"The Bid schedule and allowance quantities will be automatically calculated at the bottom but should not be included in tabulation sheets."]
[null,5,"DO NOT MANUALLY ADD ANY COLUMNS TO THE SPREADSHEET."]

{"sheet":"Summary","index":1,"n_rows":117,"n_cols":13,"rows_kept":117,"cut":false,"hidden":false,"merged":[[4,3,4,7],[6,3,8,3],[6,4,8,4],[2,12,2,15],[6,2,8,2],[6,12,7,12],[6,8,7,8],[5,9,7,9],[5,3,5,7],[6,5,8,5],[6,6,8,6],[6,7,7,7],[113,0,113,2],[108,0,108,2],[103,0,103,2],[39,2,39,7],[101,2,101,7],[70,2,70,7]]}
[null,null,null,null,"N:\\CFL-DPIT\\Excel\\PayItems24.csv"]
[null,null,null,null,null,null,null,null,"Leave this column HIDDEN!!! Do not delete"]
["Check Column - do not delete",null,null,null,null,null,null,null,{"$f":"IF(ISERROR(VLOOKUP(I2,Data!$A:$C,2,FALSE)),\"\",VLOOKUP(I2,Data!$A:$C,2,FALSE))","v":""},null,null,null,"Do not manually add columns to the spreadsheet.  The macro will become inoperable if columns are added to the left of the remarks column."]
[]
[null,null,null,"PERMANENT SIGN SUMMARY",null,null,null,null,null,null,null,null,"<-------------Remember to Merge and Center the Title over the entire table"]
[null,null,null,"Item Number",null,null,null,null,{"$f":"I2","v":"Leave this column HIDDEN!!! Do not delete"},"Remarks"]
[null,null,"Schedule","Station","Side","MUTCD Reference","Description","Sign Panel",{"$f":"IF(ISBLANK(I2),\"\",LOOKUP(I2,'[1]FP24 Pay Items'!$B$1:$B$65536,'[1]FP24 Pay Items'!$E$1:$E$65536))","v":"FUNDING RECLASSIFICATION"},null,null,null,"Road Classification            (Single Lane, Multi-lane, Expressway, Freeway, Minimum, Oversized, Shared Use Path)"]
[]
[null,null,null,null,null,null,null,"in x in",{"$f":"IF(ISBLANK(I2),\"\",LOOKUP(I2,'[1]FP24 Pay Items'!$B$1:$B$65536,'[1]FP24 Pay Items'!$F$1:$F$65536))","v":"LPSM"}]
[]
[null,null,null,null,null,null,{"$f":"IF(F11=\"\",\"\",VLOOKUP(F11,Data!I:J,2,FALSE))","v":""},{"$f":"IF(F11=\"\",\"\",HLOOKUP($M11,Data!$I$2:$Q$781,MATCH($F11,Data!$I$2:$I$781,0),FALSE))","v":""}]
[null,null,null,null,null,null,{"$f":"IF(F12=\"\",\"\",VLOOKUP(F12,Data!I:J,2,FALSE))","v":""},{"$f":"IF(F12=\"\",\"\",HLOOKUP($M12,Data!$I$2:$Q$781,MATCH($F12,Data!$I$2:$I$781,0),FALSE))","v":""}]
[null,null,null,null,null,null,{"$f":"IF(F13=\"\",\"\",VLOOKUP(F13,Data!I:J,2,FALSE))","v":""},{"$f":"IF(F13=\"\",\"\",HLOOKUP($M13,Data!$I$2:$Q$781,MATCH($F13,Data!$I$2:$I$781,0),FALSE))","v":""}]
[null,null,null,null,null,null,{"$f":"IF(F14=\"\",\"\",VLOOKUP(F14,Data!I:J,2,FALSE))","v":""},{"$f":"IF(F14=\"\",\"\",HLOOKUP($M14,Data!$I$2:$Q$781,MATCH($F14,Data!$I$2:$I$781,0),FALSE))","v":""}]
[null,null,null,null,null,null,{"$f":"IF(F15=\"\",\"\",VLOOKUP(F15,Data!I:J,2,FALSE))","v":""},{"$f":"IF(F15=\"\",\"\",HLOOKUP($M15,Data!$I$2:$Q$781,MATCH($F15,Data!$I$2:$I$781,0),FALSE))","v":""}]
[null,null,null,null,null,null,{"$f":"IF(F16=\"\",\"\",VLOOKUP(F16,Data!I:J,2,FALSE))","v":""},{"$f":"IF(F16=\"\",\"\",HLOOKUP($M16,Data!$I$2:$Q$781,MATCH($F16,Data!$I$2:$I$781,0),FALSE))","v":""}]
[null,null,null,null,null,null,{"$f":"IF(F17=\"\",\"\",VLOOKUP(F17,Data!I:J,2,FALSE))","v":""},{"$f":"IF(F17=\"\",\"\",HLOOKUP($M17,Data!$I$2:$Q$781,MATCH($F17,Data!$I$2:$I$781,0),FALSE))","v":""}]
[null,null,null,null,null,null,{"$f":"IF(F18=\"\",\"\",VLOOKUP(F18,Data!I:J,2,FALSE))","v":""},{"$f":"IF(F18=\"\",\"\",HLOOKUP($M18,Data!$I$2:$Q$781,MATCH($F18,Data!$I$2:$I$781,0),FALSE))","v":""}]
[null,null,null,null,null,null,{"$f":"IF(F19=\"\",\"\",VLOOKUP(F19,Data!I:J,2,FALSE))","v":""},{"$f":"IF(F19=\"\",\"\",HLOOKUP($M19,Data!$I$2:$Q$781,MATCH($F19,Data!$I$2:$I$781,0),FALSE))","v":""}]
[null,null,null,null,null,null,{"$f":"IF(F20=\"\",\"\",VLOOKUP(F20,Data!I:J,2,FALSE))","v":""},{"$f":"IF(F20=\"\",\"\",HLOOKUP($M20,Data!$I$2:$Q$781,MATCH($F20,Data!$I$2:$I$781,0),FALSE))","v":""}]
[null,null,null,null,null,null,{"$f":"IF(F21=\"\",\"\",VLOOKUP(F21,Data!I:J,2,FALSE))","v":""},{"$f":"IF(F21=\"\",\"\",HLOOKUP($M21,Data!$I$2:$Q$781,MATCH($F21,Data!$I$2:$I$781,0),FALSE))","v":""}]
[null,null,null,null,null,null,{"$f":"IF(F22=\"\",\"\",VLOOKUP(F22,Data!I:J,2,FALSE))","v":""},{"$f":"IF(F22=\"\",\"\",HLOOKUP($M22,Data!$I$2:$Q$781,MATCH($F22,Data!$I$2:$I$781,0),FALSE))","v":""}]
[null,null,null,null,null,null,{"$f":"IF(F23=\"\",\"\",VLOOKUP(F23,Data!I:J,2,FALSE))","v":""},{"$f":"IF(F23=\"\",\"\",HLOOKUP($M23,Data!$I$2:$Q$781,MATCH($F23,Data!$I$2:$I$781,0),FALSE))","v":""}]
[null,null,null,null,null,null,{"$f":"IF(F24=\"\",\"\",VLOOKUP(F24,Data!I:J,2,FALSE))","v":""},{"$f":"IF(F24=\"\",\"\",HLOOKUP($M24,Data!$I$2:$Q$781,MATCH($F24,Data!$I$2:$I$781,0),FALSE))","v":""}]
[null,null,null,null,null,null,{"$f":"IF(F25=\"\",\"\",VLOOKUP(F25,Data!I:J,2,FALSE))","v":""},{"$f":"IF(F25=\"\",\"\",HLOOKUP($M25,Data!$I$2:$Q$781,MATCH($F25,Data!$I$2:$I$781,0),FALSE))","v":""}]
[null,null,null,null,null,null,{"$f":"IF(F26=\"\",\"\",VLOOKUP(F26,Data!I:J,2,FALSE))","v":""},{"$f":"IF(F26=\"\",\"\",HLOOKUP($M26,Data!$I$2:$Q$781,MATCH($F26,Data!$I$2:$I$781,0),FALSE))","v":""}]
[null,null,null,null,null,null,{"$f":"IF(F27=\"\",\"\",VLOOKUP(F27,Data!I:J,2,FALSE))","v":""},{"$f":"IF(F27=\"\",\"\",HLOOKUP($M27,Data!$I$2:$Q$781,MATCH($F27,Data!$I$2:$I$781,0),FALSE))","v":""}]
[null,null,null,null,null,null,{"$f":"IF(F28=\"\",\"\",VLOOKUP(F28,Data!I:J,2,FALSE))","v":""},{"$f":"IF(F28=\"\",\"\",HLOOKUP($M28,Data!$I$2:$Q$781,MATCH($F28,Data!$I$2:$I$781,0),FALSE))","v":""}]
[null,null,null,null,null,null,{"$f":"IF(F29=\"\",\"\",VLOOKUP(F29,Data!I:J,2,FALSE))","v":""},{"$f":"IF(F29=\"\",\"\",HLOOKUP($M29,Data!$I$2:$Q$781,MATCH($F29,Data!$I$2:$I$781,0),FALSE))","v":""}]
[null,null,null,null,null,null,{"$f":"IF(F30=\"\",\"\",VLOOKUP(F30,Data!I:J,2,FALSE))","v":""},{"$f":"IF(F30=\"\",\"\",HLOOKUP($M30,Data!$I$2:$Q$781,MATCH($F30,Data!$I$2:$I$781,0),FALSE))","v":""}]
[null,null,null,null,null,null,{"$f":"IF(F31=\"\",\"\",VLOOKUP(F31,Data!I:J,2,FALSE))","v":""},{"$f":"IF(F31=\"\",\"\",HLOOKUP($M31,Data!$I$2:$Q$781,MATCH($F31,Data!$I$2:$I$781,0),FALSE))","v":""}]
[null,null,null,null,null,null,{"$f":"IF(F32=\"\",\"\",VLOOKUP(F32,Data!I:J,2,FALSE))","v":""},{"$f":"IF(F32=\"\",\"\",HLOOKUP($M32,Data!$I$2:$Q$781,MATCH($F32,Data!$I$2:$I$781,0),FALSE))","v":""}]
[null,null,null,null,null,null,{"$f":"IF(F33=\"\",\"\",VLOOKUP(F33,Data!I:J,2,FALSE))","v":""},{"$f":"IF(F33=\"\",\"\",HLOOKUP($M33,Data!$I$2:$Q$781,MATCH($F33,Data!$I$2:$I$781,0),FALSE))","v":""}]
[null,null,null,null,null,null,{"$f":"IF(F34=\"\",\"\",VLOOKUP(F34,Data!I:J,2,FALSE))","v":""},{"$f":"IF(F34=\"\",\"\",HLOOKUP($M34,Data!$I$2:$Q$781,MATCH($F34,Data!$I$2:$I$781,0),FALSE))","v":""}]
[null,null,null,null,null,null,{"$f":"IF(F35=\"\",\"\",VLOOKUP(F35,Data!I:J,2,FALSE))","v":""},{"$f":"IF(F35=\"\",\"\",HLOOKUP($M35,Data!$I$2:$Q$781,MATCH($F35,Data!$I$2:$I$781,0),FALSE))","v":""}]
[null,null,null,null,null,null,{"$f":"IF(F36=\"\",\"\",VLOOKUP(F36,Data!I:J,2,FALSE))","v":""},{"$f":"IF(F36=\"\",\"\",HLOOKUP($M36,Data!$I$2:$Q$781,MATCH($F36,Data!$I$2:$I$781,0),FALSE))","v":""}]
[null,null,null,null,null,null,{"$f":"IF(F37=\"\",\"\",VLOOKUP(F37,Data!I:J,2,FALSE))","v":""},{"$f":"IF(F37=\"\",\"\",HLOOKUP($M37,Data!$I$2:$Q$781,MATCH($F37,Data!$I$2:$I$781,0),FALSE))","v":""}]
[null,null,null,null,null,null,{"$f":"IF(F38=\"\",\"\",VLOOKUP(F38,Data!I:J,2,FALSE))","v":""},{"$f":"IF(F38=\"\",\"\",HLOOKUP($M38,Data!$I$2:$Q$781,MATCH($F38,Data!$I$2:$I$781,0),FALSE))","v":""}]
[]
[null,null,{"$f":"IF(AND(Data!$D$2<=1,Data!$G$2=1),\"TOTAL\",IF(AND(Data!$D$2<=1,Data!$G$2>1),\"SCHEDULE A TOTAL\",IF(AND(Data!$D$2>1,Data!$G$2=1),\"TOTALS\",IF(AND(Data!$D$2=2,Data!$G$2>=2),\"SCHEDULE A TOTALS\"))))","v":"TOTAL"},null,null,null,null,null,{"$f":"IF(I$9=\"LPSM\",\"ALL\",SUM(I$10:I$39))","v":"ALL"}]
{"$rows_left_out":78}
{"sheet":"Data","index":2,"n_rows":810,"n_cols":17,"rows_kept":810,"cut":false,"hidden":false,"merged":[[0,10,0,15]]}
["Pay Item Number","Description","Unit","Num Items",null,"Sides","Schedules",null,null,null,"Sign Sizes"]
[null,null,null,{"$f":"COUNTA(A:A)-1","v":0},null,"RT",1,null,"Sign","Description","Single Lane","Multi-lane","Expressway","Freeway","Mininum","Oversized","Shared Use Path"]
[null,null,null,null,null,"LT",null,null,"D10-1","Reference Location (1 digit)","10 x 18","10 x 18","12 x 24","12 x 24","—","—","6 x 9"]
[null,null,null,null,null,"LT/RT",null,null,"D10-1a","Intermediate Reference Location (2 digits)","10 x 27","10 x 27","12 x 36","12 x 36","—","—","6 x 15"]
[null,null,null,null,null,null,null,null,"D10-2","Reference Location (2 digits)","10 x 27","10 x 27","12 x 36","12 x 36","—","—","6 x 15"]
[null,null,null,null,null,null,null,null,"D10-2a","Intermediate Reference Location (3 digits)","10 x 36","10 x 36","12 x 48","12 x 48","—","—","6 x 21"]
[null,null,null,null,null,null,null,null,"D10-3","Reference Location (3 digits)","10 x 36","10 x 36","12 x 48","12 x 48","—","—","6 x 21"]
[null,null,null,null,null,null,null,null,"D10-3a","Intermediate Reference Location (4 digits)","10 x 48","10 x 48","12 x 60","12 x 60","—","—","6 x 24"]
[null,null,null,null,null,null,null,null,"D10-4","Enhanced Reference Location","18 x 54","18 x 54","18 x 54","18 x 54","—","—","—"]
[null,null,null,null,null,null,null,null,"D10-5","Intermediate Enhanced Reference Location","18 x 60","18 x 60","18 x 60","18 x 60","—","—","—"]
[null,null,null,null,null,null,null,null,"D1-1","Destination (1 line)","varies x 18","varies x 18","varies x 24","varies x 24","—","—","varies x 6"]
[null,null,null,null,null,null,null,null,"D1-1a","Destination and Distance (1 line)","varies x 18","varies x 18","varies x 24","varies x 24","—","—","varies x 6"]
[null,null,null,null,null,null,null,null,"D1-1b","Bicycle Destination (1 line)","varies x 6","varies x 6","—","—","—","—","varies x 6"]
[null,null,null,null,null,null,null,null,"D1-1c","Bicycle Destination (1 line)","varies x 6","varies x 6","—","—","—","—","varies x 6"]
[null,null,null,null,null,null,null,null,"D1-1d","Circular Intersection Destination (1 line)","varies x 18","varies x 18","varies x 24","varies x 24","—","—"]
[null,null,null,null,null,null,null,null,"D1-1e","Circular Intersection Departure Guide","varies x 42","varies x 42","—","—","—","—"]
[null,null,null,null,null,null,null,null,"D1-2","Destination (2 lines)","varies x 30","varies x 30","varies x 42","varies x 42","—","—","varies x 12"]
[null,null,null,null,null,null,null,null,"D11-1","Bike Route","24 x 18","24 x 18","—","—","—","—","24 x 18"]
[null,null,null,null,null,null,null,null,"D11-1bP","Bike Route (plaque)","18 x 6","18 x 6","—","—","—","—","18 x 6"]
[null,null,null,null,null,null,null,null,"D11-1c","Bike Route with Destination","24 x 18","24 x 18","—","—","—","—","24 x 18"]
[null,null,null,null,null,null,null,null,"D11-10a","Shared-Use Path Destination (1 line)","—","—","—","—","—","—","varies x 6"]
[null,null,null,null,null,null,null,null,"D11-10b","Shared-Use Path Destination (2 lines)","—","—","—","—","—","—","varies x 12"]
[null,null,null,null,null,null,null,null,"D11-10c","Shared-Use Path Destination (3 lines)","—","—","—","—","—","—","varies x 18"]
[null,null,null,null,null,null,null,null,"D11-10d","Shared-Use Path Destination and Distance (1 line)","—","—","—","—","—","—","varies x 6"]
[null,null,null,null,null,null,null,null,"D11-10e","Shared-Use Path Destination and Distance (2 lines)","—","—","—","—","—","—","varies x 12"]
[null,null,null,null,null,null,null,null,"D11-10f","Shared-Use Path Destination and Distance (3 lines)","—","—","—","—","—","—","varies x 18"]
[null,null,null,null,null,null,null,null,"D11-11","Bicycle Directional","—","—","—","—","—","—","18 x 18"]
[null,null,null,null,null,null,null,null,"D11-12","Pedestrians Directional","—","—","—","—","—","—","18 x 18"]
[null,null,null,null,null,null,null,null,"D11-13","Skaters Directional","—","—","—","—","—","—","18 x 18"]
[null,null,null,null,null,null,null,null,"D11-14","Equestrians Directional","—","—","—","—","—","—","18 x 18"]
[null,null,null,null,null,null,null,null,"D11-20","Bicycle Turn Box Guide Signs","—","—","—","—","—","—","12 x 18"]
[null,null,null,null,null,null,null,null,"D11-20a","Bicycle Turn Box Guide Signs","—","—","—","—","—","—","12 x 18"]
[null,null,null,null,null,null,null,null,"D12-1","Weather Information","84 x 48","132 x 84","—","—","—","—","—"]
[null,null,null,null,null,null,null,null,"D12-2","Carpool Information","60 x 42","96 x 66","—","—","—","—","—"]
[null,null,null,null,null,null,null,null,"D12-3","Channel 9 Monitored","84 x 48","132 x 84","—","—","—","—","—"]
[null,null,null,null,null,null,null,null,"D12-4","Emergency Call 911","66 x 30","96 x 48","—","—","—","—","—"]
[null,null,null,null,null,null,null,null,"D12-5","Travel Info Call 511 (pictograph)","42 x 60","66 x 78","—","—","—","—","—"]
[null,null,null,null,null,null,null,null,"D12-5a","Travel Info Call 511","48 x 36","66 x 48","—","—","—","—","—"]
[null,null,null,null,null,null,null,null,"D1-2a","Destination and Distance (2 lines)","varies x 30","varies x 30","varies x 42","varies x 42","—","—","varies x 12"]
[null,null,null,null,null,null,null,null,"D1-2b","Bicycle Destination (2 lines)","varies x 12","varies x 30","—","—","—","—","varies x 12"]
{"$rows_left_out":771}
{"sheet":"Sheet1","index":3,"n_rows":56,"n_cols":10,"rows_kept":56,"cut":false,"hidden":false,"merged":[]}
[]
[null,null,null,null,null,"D5-1","Rest Area XX Miles","66 x 36*","96 x 54*"]
[null,null,null,null,null,"D5-1a","Rest Area Next Right","78 x 36*","120 x 60* (F)","114 x 48* (E)"]
[null,null,null,null,null,"D5-2","Rest Area (with arrow)","66 x 36*","96 x 54*"]
[null,null,null,null,null,"D5-2a","Rest Area Gore","42 x 48*","78 x 78* (F)","66 x 72* (E)"]
[null,null,null,null,null,"D5-5","Rest Area (with horizontal arrow)","42 x 48*","—"]
[null,null,null,null,null,"D5-6","Next Rest Area XX Miles","60 x 48*","90 x 72*"]
[null,null,null,null,null,"D5-7","Rest Area Tourist Info Center XX Miles","90 x 72*","114 x 102* (F)","132 x 96* (E)"]
[null,null,null,null,null,"D5-8","Rest Area Tourist Info Center (with arrow)","84 x 72*","120 x 102* (F)","120 x 96* (E)"]
[null,null,null,null,null,"D5-11","Rest Area Tourist Info Center Next Right","90 x 72*","144 x 102* (F)","132 x 96* (E)"]
[null,null,null,null,null,"D5-12","Interstate Oasis","—","156 x 78"]
[null,null,null,null,null,"D5-12P","Interstate Oasis (plaque)","—","114 x 48"]
[null,null,null,null,null,"D5-13","Brake Check Area XX Miles","84 x 48","126 x 72"]
[null,null,null,null,null,"D5-14","Brake Check Area (with arrow)","78 x 60","96 x 72"]
[null,null,null,null,null,"D5-15","Chain-Up Area XX Miles","66 x 48","96 x 72"]
[null,null,null,null,null,"D5-16","Chain-Up Area (with arrow)","72 x 54","96 x 66"]
[null,null,null,null,null,"D9-1","Telephone","24 x 24","30 x 30"]
[null,null,null,null,null,"D9-2","Hospital","24 x 24","30 x 30"]
[null,null,null,null,null,"D9-3","Camping","24 x 24","30 x 30"]
[null,null,null,null,null,"D9-3a","Trailer Camping","24 x 24","30 x 30"]
[null,null,null,null,null,"D9-4","Litter Container","24 x 30","36 x 48"]
[null,null,null,null,null,"D9-6","Handicapped","24 x 24","30 x 30"]
[null,null,null,null,null,"D9-6P","Van Accessible (plaque)","18 x 9","—"]
[null,null,null,null,null,"D9-7","Gas","24 x 24","30 x 30"]
[null,null,null,null,null,"D9-8","Food","24 x 24","30 x 30"]
[null,null,null,null,null,"D9-9","Lodging","24 x 24","30 x 30"]
[null,null,null,null,null,"D9-10","Tourist Information","24 x 24","30 x 30"]
[null,null,null,null,null,"D9-11","Diesel Fuel","24 x 24","30 x 30"]
[null,null,null,null,null,"D9-11a","Alternative Fuel - Compressed Natural Gas","24 x 24","30 x 30"]
[null,null,null,null,null,"D9-11b","Electric Vehicle Charging","24 x 24","30 x 30"]
[null,null,null,null,null,"D9-11bP","Electric Vehicle Charging (plaque)","24 x 18","30 x 24"]
[null,null,null,null,null,"D9-11c","Alternative Fuel - Ethanol","24 x 24","30 x 30"]
[null,null,null,null,null,"D9-12","RV Sanitatary Station","24 x 24","30 x 30"]
[null,null,null,null,null,"D9-13","Emergency Medical Services","24 x 24","30 x 30"]
[null,null,null,null,null,"D9-13aP","Hospital (plaque)","24 x 12","30 x 12"]
[null,null,null,null,null,"D9-13bP","Ambulance Station (plaque)","24 x 12","30 x 15"]
[null,null,null,null,null,"D9-13cP","Emergency Medical Care (plaque)","24 x 18","30 x 24"]
[null,null,null,null,null,"D9-13dP","Trauma Center (plaque)","24 x 12","30 x 15"]
[null,null,null,null,null,"D9-14","Police","24 x 24","30 x 30"]
[null,null,null,null,null,"D9-15","Propane Gas","24 x 24","30 x 30"]
{"$rows_left_out":16}