{"text_format":"1","workbook":"xlsx","n_sheets":11,"sheets":["Instructions","quantities report","Totals - QA_QC","manual inputs","Surfacing","Surfacing Summary","quantities report_secondary","manual inputs_secondary","Surfacing_secondary","calc wrksht-rdwy exc Secondary","calc wrksht-emb const Secondary"],"not_rendered":{"charts":0,"images":5,"macros":1,"external_links":1,"defined_names":2,"comments":0,"pivot_tables":0},"unopened":[],"bounds":{"document_bytes":16777216,"sheet_cells":100000,"rows_first":2000,"rows_last":500,"rows_between":2000,"halvings":0,"cell_chars":16384,"cell_head_chars":4096},"cells_cut":0,"cells_raw":0,"read":"whole","date_system":"1900"}

{"sheet":"Instructions","index":0,"n_rows":43,"n_cols":3,"rows_kept":43,"cut":false,"hidden":false,"merged":[[1,1,1,2],[36,2,40,2],[7,2,29,2]]}
[" "]
[null,"Instructions:"]
[null,1,"Add cut and fill volumes to the corridor"]
[null,2,"Run Quantities by Named boundary report and save file in excel format."]
[null,3,"Select the volumes report"]
[]
[null,4,"The report should be in the following format:"]
[]
[]
[]
[]
[]
[]
[]
[]
[]
[]
[]
[]
[]
[]
[]
[]
[]
[]
[]
[]
[]
[]
[]
[null,5,"Right click on the report in ORD and select Export to Excel"]
[]
[null,6,"Select entire sheet in the volumes excel spreadsheet.  (CTRL-A or select the select all button)"]
[null,7,"Paste data in the quantities report tab in the grading summary spreadsheet."]
[null,8,"Select the rows that contain the whole project totals and cut and paste to the Totals - QA_QC tab."]
[null,9,"Go to the \"Manual Inputs\" page and click on the \"Click Here to Format Worksheet\" button."]
[]
[]
[]
[]
[]
[null,10,"Input layer thickness and types, existing pavement thickness, and whether cutbacks or emulsion are being used. [EDIT all yellow cells in the Manual Input Tab.]"]
[null,11,"For major secondary roads use the secondary report tabs."]

{"sheet":"quantities report","index":1,"n_rows":0,"n_cols":0,"rows_kept":0,"cut":false,"hidden":false,"merged":[]}

{"sheet":"Totals - QA_QC","index":2,"n_rows":0,"n_cols":0,"rows_kept":0,"cut":false,"hidden":false,"merged":[]}

{"sheet":"manual inputs","index":3,"n_rows":27,"n_cols":14,"rows_kept":27,"cut":false,"hidden":false,"merged":[[0,1,0,4],[6,3,6,4],[8,3,8,4],[7,3,7,4],[9,3,9,4],[10,3,10,4],[16,3,16,4],[15,3,15,4],[13,3,13,4],[1,1,1,4],[2,3,2,4],[4,3,4,4],[3,3,3,4],[5,3,5,4],[19,3,19,4],[11,3,11,4],[27,3,27,4],[18,3,18,4],[17,3,17,4],[20,3,20,4],[21,3,21,4],[14,3,14,4],[12,3,12,4]]}
[null,"Manually update any YELLOW cells"]
[null,"Conversion Factors",null,null,null,null,null,null,null,"Station Range",null,null,null,"Number of Rows"]
[null,"Material","Factor",null,null,null,null,null,"Add Starting Station",null,null,null,null,{"$f":"LOOKUP(2,1/('quantities report'!A:A<>\"\"),ROW('quantities report'!A:A))","v":{"$error":"#N/A"}}]
[null,"Aggregate Base",139,"lb/ft3"]
[null,"Asphalt Concrete Pavement",145.19999999999999,"lb/ft3"]
[null,"AntiStrip",0.01,null,null,null,null,null,null,null,null,null,null,"Aggregate Base"]
[null,"Prime Coat - Asphalt Cutbacks",0.33,"gal/yd2",null,null,null,null,null,null,null,null,null,"Asphalt Concrete Pavement"]
[null,"Prime Coat - Asphalt Cutbacks",251,"gal/ton",null,null,null,null,null,null,null,null,null,"N/A"]
[null,"Prime Coat - Asphalt Emulsion",0.27,"gal/yd2"]
[null,"Prime Coat - Asphalt Emulsion",233,"gal/ton",null,null,null,null,null,null,null,null,null,"Asphalt Cutbacks"]
[null,"Blotter",14.75,"lb/yd2",null,null,null,null,null,null,null,null,null,"Asphalt Emulsion"]
[null,"Blotter",0.2,"of total area"]
[null,"Tack Coat - Asphalt Emulsion",0.1,"gal/yd2",null,null,null,null,null,null,null,null,null,"Asphalt Cutbacks"]
[null,"Tack Coat - Asphalt Emulsion",233,"gal/ton",null,null,null,null,null,null,null,null,null,"Asphalt Emulsion"]
[null,"Fog Seal - Asphalt Emulsion",0.1,"gal/yd2"]
[null,"Fog Seal - Asphalt Emulsion",233,"gal/ton"]
[null,null,2000,"lb/ton"]
[]
[null,"Using Cutbacks or Emulsion","Asphalt Emulsion"]
[]
[null,"Existing Pavement",null,"inches"]
[]
[null,"Layer 1","N/A",null,"inches"]
[null,"Layer 2","N/A",null,"inches"]
[null,"Layer 3","N/A",null,"inches"]
[null,"Layer 4","N/A",null,"inches"]
[null,"Layer 5","N/A",null,"inches"]

{"sheet":"Surfacing","index":4,"n_rows":33,"n_cols":47,"rows_kept":33,"cut":false,"hidden":false,"merged":[[2,44,3,45],[4,44,4,46],[5,44,5,46],[2,30,3,31],[2,33,3,34],[4,30,4,35],[5,30,5,35],[1,0,1,1],[0,37,0,39],[2,0,3,1],[2,2,3,3],[2,9,3,10],[2,16,3,17],[2,23,3,24],[2,5,3,6],[2,19,3,20],[4,2,4,7],[2,12,3,13],[4,9,4,14],[5,2,5,7],[5,9,5,14],[4,16,4,21],[2,26,3,27],[4,23,4,28],[5,16,5,21],[5,23,5,28]]}
[null,null,null,null,null,null,null,null,null,null,null,null,null,null,null,null,null,null,null,null,null,null,null,null,null,null,null,null,null,null,null,null,null,null,null,null,null,"PAY COLUMNS",null,null,null,null,"(20% of area)"]
["TOTALS",null,{"$f":"SUM(C9:C33)","v":0},0,0,{"$f":"SUM(F9:F33)","v":0},0,0,null,0,0,0,{"$f":"SUM(M9:M33)","v":0},0,0,null,0,0,0,{"$f":"SUM(T9:T33)","v":0},0,0,null,0,0,0,{"$f":"SUM(AA9:AA33)","v":0},0,0,null,0,0,0,{"$f":"SUM(AH9:AH33)","v":0},0,0,null,0,0,0,0,0,0,0,{"$f":"SUM(AS9:AS33)","v":0},0,0]
["ORD Component Name",null,"Pavement Layer 1: ",null,{"$f":"VLOOKUP(C5,'manual inputs'!B2:E28,2,FALSE)","v":{"$error":"#N/A"}},"Shoulder Layer 1: ",null,{"$f":"VLOOKUP(C5,'manual inputs'!B2:E28,2,FALSE)","v":{"$error":"#N/A"}},null,"Pavement Layer 2: ",null,{"$f":"VLOOKUP(J5,'manual inputs'!$B$2:$E$28,2,FALSE)","v":{"$error":"#N/A"}},"Shoulder Layer 2: ",null,{"$f":"VLOOKUP(J5,'manual inputs'!$B$2:$E$28,2,FALSE)","v":{"$error":"#N/A"}},null,"Pavement Layer 3: ",null,{"$f":"VLOOKUP($Q$5,'manual inputs'!$B$2:$E$28,2,FALSE)","v":{"$error":"#N/A"}},"Shoulder Layer 3: ",null,{"$f":"VLOOKUP($Q$5,'manual inputs'!$B$2:$E$28,2,FALSE)","v":{"$error":"#N/A"}},null,"Pavement Layer 4: ",null,{"$f":"VLOOKUP($X$5,'manual inputs'!$B$2:$E$28,2,FALSE)","v":{"$error":"#N/A"}},"Shoulder Layer 4: ",null,{"$f":"VLOOKUP($X$5,'manual inputs'!$B$2:$E$28,2,FALSE)","v":{"$error":"#N/A"}},null,"Pavement Layer 5: ",null,{"$f":"VLOOKUP($AE$5,'manual inputs'!$B$2:$E$28,2,FALSE)","v":{"$error":"#N/A"}},"Shoulder Layer 5: ",null,{"$f":"VLOOKUP($AE$5,'manual inputs'!$B$2:$E$28,2,FALSE)","v":{"$error":"#N/A"}},null,null,null,null,{"$f":"VLOOKUP(AO5,'manual inputs'!$B$2:$E$28,2,FALSE)","v":0.1},{"$f":"VLOOKUP(AP5,'manual inputs'!$B$2:$E$28,2,FALSE)","v":0.27},{"$f":"VLOOKUP(AQ5,'manual inputs'!$B$2:$E$28,2,FALSE)","v":14.75},{"$f":"VLOOKUP(AR5,'manual inputs'!$B$2:$E$28,2,FALSE)","v":0.1},"Total Exist Pvmt Layer 1: ",null,{"$f":"VLOOKUP(AS5,'manual inputs'!$B$2:$E$28,2,FALSE)","v":0}]
[null,null,null,null,{"$f":"VLOOKUP(C5,'manual inputs'!B2:E270,3,FALSE)","v":{"$error":"#N/A"}},null,null,{"$f":"VLOOKUP(C5,'manual inputs'!B2:E270,3,FALSE)","v":{"$error":"#N/A"}},null,null,null,{"$f":"VLOOKUP(J5,'manual inputs'!$B$2:$E$28,3,FALSE)","v":{"$error":"#N/A"}},null,null,{"$f":"VLOOKUP(J5,'manual inputs'!$B$2:$E$28,3,FALSE)","v":{"$error":"#N/A"}},null,null,null,{"$f":"VLOOKUP($Q$5,'manual inputs'!$B$2:$E$28,3,FALSE)","v":{"$error":"#N/A"}},null,null,{"$f":"VLOOKUP($Q$5,'manual inputs'!$B$2:$E$28,3,FALSE)","v":{"$error":"#N/A"}},null,null,null,{"$f":"VLOOKUP($X$5,'manual inputs'!$B$2:$E$28,3,FALSE)","v":{"$error":"#N/A"}},null,null,{"$f":"VLOOKUP($X$5,'manual inputs'!$B$2:$E$28,3,FALSE)","v":{"$error":"#N/A"}},null,null,null,{"$f":"VLOOKUP($AE$5,'manual inputs'!$B$2:$E$28,3,FALSE)","v":{"$error":"#N/A"}},null,null,{"$f":"VLOOKUP($AE$5,'manual inputs'!$B$2:$E$28,3,FALSE)","v":{"$error":"#N/A"}},null,null,null,null,{"$f":"VLOOKUP(AO5,'manual inputs'!$B$2:$E$28,3,FALSE)","v":"gal/yd2"},{"$f":"VLOOKUP(AP5,'manual inputs'!$B$2:$E$28,3,FALSE)","v":"gal/yd2"},{"$f":"VLOOKUP(AQ5,'manual inputs'!$B$2:$E$28,3,FALSE)","v":"lb/yd2"},{"$f":"VLOOKUP(AR5,'manual inputs'!$B$2:$E$28,3,FALSE)","v":"gal/yd2"},null,null,{"$f":"VLOOKUP(AS5,'manual inputs'!$B$2:$E$28,3,FALSE)","v":"inches"}]
[null,null,{"$f":"LOOKUP(C6,'manual inputs'!$B$23:$B$27,'manual inputs'!C23:C27)","v":"N/A"},null,null,null,null,null,"Layer 1 Total",{"$f":"LOOKUP(J6,'manual inputs'!$B$23:$B$27,'manual inputs'!C23:C27)","v":"N/A"},null,null,null,null,null,"Layer 2 Total",{"$f":"LOOKUP(Q6,'manual inputs'!B23:B27,'manual inputs'!C23:C27)","v":"N/A"},null,null,null,null,null,"Layer 3 Total",{"$f":"LOOKUP(X6,'manual inputs'!B23:B27,'manual inputs'!C23:C27)","v":"N/A"},null,null,null,null,null,"Layer 4 Total",{"$f":"LOOKUP(AE6,'manual inputs'!B23:B27,'manual inputs'!C23:C27)","v":"N/A"},null,null,null,null,null,"Layer 5 Total","Total Aggregate Base","Total Asphalt Concrete Pavement","ANTISTRIP","Fog Seal - Asphalt Emulsion",{"$f":"IF('manual inputs'!C19=\"Asphalt Emulsion\",'manual inputs'!B9,'manual inputs'!B7)","v":"Prime Coat - Asphalt Emulsion"},"Blotter","Tack Coat - Asphalt Emulsion","Existing Pavement"]
[null,null,"Layer 1",null,null,null,null,null,null,"Layer 2",null,null,null,null,null,null,"Layer 3",null,null,null,null,null,null,"Layer 4",null,null,null,null,null,null,"Layer 5"]
[null,null,"CUYD","CUFT","TON","CUYD","CUFT","TON","TON","CUYD","CUFT","TON","CUYD","CUFT","TON","TON","CUYD","CUFT","TON","CUYD","CUFT","TON","TON","CUYD","CUFT","TON","CUYD","CUFT","TON","TON","CUYD","CUFT","TON","CUYD","CUFT","TON","TON","TON","TON","TON","TON","SQYD","TON","TON","CUYD","CUFT","SQYD"]
[null,{"$f":"IFERROR(INDEX('manual inputs'!J:J,SMALL(IF('manual inputs'!J:J<>\"\",ROW('manual inputs'!J:J)),ROW('manual inputs'!2:2))),\"\")","v":""}]
[null,{"$f":"IFERROR(INDEX('manual inputs'!J:J,SMALL(IF('manual inputs'!J:J<>\"\",ROW('manual inputs'!J:J)),ROW('manual inputs'!3:3))),\"\")","v":""},{"$f":"IF($C$5=\"n/a\",\"\",IF(B9=\"\",\"\",IFERROR(INDEX('quantities report'!$D$2:$D$9877,SMALL(IF('quantities report'!$A$2:$A$9877=C$3,ROW('quantities report'!$A$2:$A$9877)-1,\"\"),ROWS($B$9:$B9))),\"0\")))","v":""},{"$f":"IF($C9=\"\",\" \",(C9*27))","v":" "},{"$f":"IF($C9=\"\",\" \",(D9*$E$3/'manual inputs'!$C$17))","v":" "},{"$f":"IF($C$5=\"n/a\",\"\",IF(B9=\"\",\"\",IFERROR(INDEX('quantities report'!$D$2:$D$9877,SMALL(IF('quantities report'!$A$2:$A$9877=F$3,ROW('quantities report'!$A$2:$A$9877)-1,\"\"),ROWS($B$9:$B9))),\"0\")))","v":""},{"$f":"IF($F9=\"\",\" \",(F9*27))","v":" "},{"$f":"IF($F9=\"\",\" \",(G9*$H$3/'manual inputs'!$C$17))","v":" "},{"$f":"IF($C$5=\"N/A\",\"\",IF($B9=\"\",\"\",($H9+$E9)))","v":""},{"$f":"IF($J$5=\"n/a\",\"\",IF(B9=\"\",\"\",IFERROR(INDEX('quantities report'!$D$2:$D$9877,SMALL(IF('quantities report'!$A$2:$A$9877=J$3,ROW('quantities report'!$A$2:$A$9877)-1,\"\"),ROWS($B$9:$B9))),\"0\")))","v":""},{"$f":"IF($J9=\"\",\" \",(J9*27))","v":" "},{"$f":"IF($J9=\"\",\" \",(K9*$L$3/'manual inputs'!$C$17))","v":" "},{"$f":"IF($J$5=\"n/a\",\"\",IF(B9=\"\",\"\",IFERROR(INDEX('quantities report'!$D$2:$D$9877,SMALL(IF('quantities report'!$A$2:$A$9877=M$3,ROW('quantities report'!$A$2:$A$9877)-1,\"\"),ROWS($B$9:$B9))),\"0\")))","v":""},{"$f":"IF($M9=\"\",\" \",(M9*27))","v":" "},{"$f":"IF($M9=\"\",\" \",(N9*$O$3/'manual inputs'!$C$17))","v":" "},{"$f":"IF($J$5=\"N/A\",\"\",IF($B9=\"\",\"\",($O9+$L9)))","v":""},{"$f":"IF($Q$5=\"n/a\",\"\",IF(B9=\"\",\"\",IFERROR(INDEX('quantities report'!$D$2:$D$9877,SMALL(IF('quantities report'!$A$2:$A$9877=Q$3,ROW('quantities report'!$A$2:$A$9877)-1,\"\"),ROWS($B$9:$B9))),\"0\")))","v":""},{"$f":"IF($Q9=\"\",\" \",(Q9*27))","v":" "},{"$f":"IF($Q9=\"\",\" \",(R9*$S$3/'manual inputs'!$C$17))","v":" "},{"$f":"IF($Q$5=\"n/a\",\"\",IF(I9=\"\",\"\",IFERROR(INDEX('quantities report'!$D$2:$D$9877,SMALL(IF('quantities report'!$A$2:$A$9877=T$3,ROW('quantities report'!$A$2:$A$9877)-1,\"\"),ROWS($B$9:$B9))),\"0\")))","v":""},{"$f":"IF($T9=\"\",\" \",(T9*27))","v":" "},{"$f":"IF($T9=\"\",\" \",(U9*$V$3/'manual inputs'!$C$17))","v":" "},{"$f":"IF($Q$5=\"N/A\",\"\",IF($B9=\"\",\"\",($V9+$S9)))","v":""},{"$f":"IF($X$5=\"n/a\",\"\",IF(B9=\"\",\"\",IFERROR(INDEX('quantities report'!$D$2:$D$9877,SMALL(IF('quantities report'!$A$2:$A$9877=X$3,ROW('quantities report'!$A$2:$A$9877)-1,\"\"),ROWS($B$9:$B9))),\"0\")))","v":""},{"$f":"IF($X9=\"\",\" \",(X9*27))","v":" "},{"$f":"IF($X9=\"\",\" \",(Y9*$Z$3/'manual inputs'!$C$17))","v":" "},{"$f":"IF($X$5=\"n/a\",\"\",IF(B9=\"\",\"\",IFERROR(INDEX('quantities report'!$D$2:$D$9877,SMALL(IF('quantities report'!$A$2:$A$9877=AA$3,ROW('quantities report'!$A$2:$A$9877)-1,\"\"),ROWS($B$9:$B9))),\"0\")))","v":""},{"$f":"IF($AA9=\"\",\" \",(AA9*27))","v":" "},{"$f":"IF($AA9=\"\",\" \",(AB9*$AC$3/'manual inputs'!$C$17))","v":" "},{"$f":"IF($X$5=\"N/A\",\"\",IF($B9=\"\",\"\",($AC9+$Z9)))","v":""},{"$f":"IF($AE$5=\"n/a\",\"\",IF(B9=\"\",\"\",IFERROR(INDEX('quantities report'!$D$2:$D$9877,SMALL(IF('quantities report'!$A$2:$A$9877=AE$3,ROW('quantities report'!$A$2:$A$9877)-1,\"\"),ROWS($B$9:$B9))),\"0\")))","v":""},{"$f":"IF($AE9=\"\",\" \",(AE9*27))","v":" "},{"$f":"IF($AE9=\"\",\" \",(AF9*$AG$3/'manual inputs'!$C$17))","v":" "},{"$f":"IF($AE$5=\"n/a\",\"\",IF(B9=\"\",\"\",IFERROR(INDEX('quantities report'!$D$2:$D$9877,SMALL(IF('quantities report'!$A$2:$A$9877=AH$3,ROW('quantities report'!$A$2:$A$9877)-1,\"\"),ROWS($B$9:$B9))),\"0\")))","v":""},{"$f":"IF($AE9=\"\",\" \",(AH9*27))","v":" "},{"$f":"IF($AE9=\"\",\" \",(AI9*$AJ$3/'manual inputs'!$C$17))","v":" "},{"$f":"IF($AE$5=\"N/A\",\"\",IF($B9=\"\",\"\",($AJ9+$AG9)))","v":""},{"$f":"IF(B9=\"\",\" \",IF($C$5=\"Aggregate Base\",I9)+IF($Q$5=\"Aggregate Base\",W9)+IF($J$5=\"Aggregate Base\",P9)+IF($X$5=\"Aggregate Base\",AD9)+IF($AE$5=\"Aggregate Base\",AK9))","v":" "},{"$f":"IF(B9=\"\",\" \",IF($C$5=\"Asphalt Concrete Pavement\",I9)+IF($Q$5=\"Asphalt Concrete Pavement\",$W$9)+IF($J$5=\"Asphalt Concrete Pavement\",P9)+IF($X$5=\"Asphalt Concrete Pavement\",AD9)+IF($AE$5=\"Asphalt Concrete Pavement\",AK9))","v":" "},{"$f":"IF(B9=\"\",\"\",(AM9*'manual inputs'!$C$6))","v":""},{"$f":"IF($B9=\"\",\"\",(((($AM9*'manual inputs'!$C$17/Surfacing!$E$3)/('manual inputs'!$D$23/12))/9)*$AO$3)/'manual inputs'!$C$16)","v":""},{"$f":"IF($B9=\"\",\"\",(((($AM9*'manual inputs'!$C$17/Surfacing!$E$3)/('manual inputs'!$D$23/12))/9)))","v":""},{"$f":"IF($B9=\"\",\"\",((((($AM9*'manual inputs'!$C$17/Surfacing!$E$3)/('manual inputs'!$D$23/12))/9)*$AQ$3)/'manual inputs'!$C$17)*'manual inputs'!$C$12)","v":""},{"$f":"IF($B9=\"\",\"\",(((($AM9*'manual inputs'!$C$17/Surfacing!$E$3)/('manual inputs'!$D$23/12))/9)*$AO$3)/'manual inputs'!$C$16)","v":""},{"$f":"IF($C$5=\"n/a\",\"\",IF(B9=\"\",\"\",IFERROR(INDEX('quantities report'!$D$2:$D$9877,SMALL(IF('quantities report'!$A$2:$A$9877=AS$3,ROW('quantities report'!$A$2:$A$9877)-1,\"\"),ROWS($B$9:$B9))),\"0\")))","v":""},{"$f":"IF($C9=\"\",\" \",(AS9*27))","v":" "},{"$f":"IF($C9=\"\",\" \",(AT9/('manual inputs'!$C$21/12)/9))","v":" "}]
[null,{"$f":"IFERROR(INDEX('manual inputs'!J:J,SMALL(IF('manual inputs'!J:J<>\"\",ROW('manual inputs'!J:J)),ROW('manual inputs'!4:4))),\"\")","v":""},{"$f":"IF($C$5=\"n/a\",\"\",IF(B10=\"\",\"\",IFERROR(INDEX('quantities report'!$D$2:$D$9877,SMALL(IF('quantities report'!$A$2:$A$9877=C$3,ROW('quantities report'!$A$2:$A$9877)-1,\"\"),ROWS($B$9:$B10))),\"0\")))","v":""},{"$f":"IF($C10=\"\",\" \",(C10*27))","v":" "},{"$f":"IF($C10=\"\",\" \",(D10*$E$3/'manual inputs'!$C$17))","v":" "},{"$f":"IF($C$5=\"n/a\",\"\",IF(B10=\"\",\"\",IFERROR(INDEX('quantities report'!$D$2:$D$9877,SMALL(IF('quantities report'!$A$2:$A$9877=F$3,ROW('quantities report'!$A$2:$A$9877)-1,\"\"),ROWS($B$9:$B10))),\"0\")))","v":""},{"$f":"IF($F10=\"\",\" \",(F10*27))","v":" "},{"$f":"IF($F10=\"\",\" \",(G10*$E$3/'manual inputs'!$C$17))","v":" "},{"$f":"IF($C$5=\"N/A\",\"\",IF(B10=\"\",\"\",($H10+$E10)))","v":""},{"$f":"IF($J$5=\"n/a\",\"\",IF(B10=\"\",\"\",IFERROR(INDEX('quantities report'!$D$2:$D$9877,SMALL(IF('quantities report'!$A$2:$A$9877=J$3,ROW('quantities report'!$A$2:$A$9877)-1,\"\"),ROWS($B$9:$B10))),\"0\")))","v":""},{"$f":"IF($J10=\"\",\" \",(J10*27))","v":" "},{"$f":"IF($J10=\"\",\" \",(K10*$L$3/'manual inputs'!$C$17))","v":" "},{"$f":"IF($J$5=\"n/a\",\"\",IF(B10=\"\",\"\",IFERROR(INDEX('quantities report'!$D$2:$D$9877,SMALL(IF('quantities report'!$A$2:$A$9877=M$3,ROW('quantities report'!$A$2:$A$9877)-1,\"\"),ROWS($B$9:$B10))),\"0\")))","v":""},{"$f":"IF($M10=\"\",\" \",(M10*27))","v":" "},{"$f":"IF($M10=\"\",\" \",(N10*$O$3/'manual inputs'!$C$17))","v":" "},"",{"$f":"IF($Q$5=\"n/a\",\"\",IF(B10=\"\",\"\",IFERROR(INDEX('quantities report'!$D$2:$D$9877,SMALL(IF('quantities report'!$A$2:$A$9877=Q$3,ROW('quantities report'!$A$2:$A$9877)-1,\"\"),ROWS($B$9:$B10))),\"0\")))","v":""},{"$f":"IF($Q10=\"\",\" \",(Q10*27))","v":" "},{"$f":"IF($Q10=\"\",\" \",(R10*$S$3/'manual inputs'!$C$17))","v":" "},{"$f":"IF($Q$5=\"n/a\",\"\",IF(I10=\"\",\"\",IFERROR(INDEX('quantities report'!$D$2:$D$9877,SMALL(IF('quantities report'!$A$2:$A$9877=T$3,ROW('quantities report'!$A$2:$A$9877)-1,\"\"),ROWS($B$9:$B10))),\"0\")))","v":""},{"$f":"IF($T10=\"\",\" \",(T10*27))","v":" "},{"$f":"IF($T10=\"\",\" \",(U10*$V$3/'manual inputs'!$C$17))","v":" "},"",{"$f":"IF($X$5=\"n/a\",\"\",IF(B10=\"\",\"\",IFERROR(INDEX('quantities report'!$D$2:$D$9877,SMALL(IF('quantities report'!$A$2:$A$9877=X$3,ROW('quantities report'!$A$2:$A$9877)-1,\"\"),ROWS($B$9:$B10))),\"0\")))","v":""},{"$f":"IF($X10=\"\",\" \",(X10*27))","v":" "},{"$f":"IF($X10=\"\",\" \",(Y10*$Z$3/'manual inputs'!$C$17))","v":" "},{"$f":"IF($X$5=\"n/a\",\"\",IF(B10=\"\",\"\",IFERROR(INDEX('quantities report'!$D$2:$D$9877,SMALL(IF('quantities report'!$A$2:$A$9877=AA$3,ROW('quantities report'!$A$2:$A$9877)-1,\"\"),ROWS($B$9:$B10))),\"0\")))","v":""},{"$f":"IF($AA10=\"\",\" \",(AA10*27))","v":" "},{"$f":"IF($AA10=\"\",\" \",(AB10*$AC$3/'manual inputs'!$C$17))","v":" "},"",{"$f":"IF($AE$5=\"n/a\",\"\",IF(B10=\"\",\"\",IFERROR(INDEX('quantities report'!$D$2:$D$9877,SMALL(IF('quantities report'!$A$2:$A$9877=AE$3,ROW('quantities report'!$A$2:$A$9877)-1,\"\"),ROWS($B$9:$B10))),\"0\")))","v":""},{"$f":"IF($AE10=\"\",\" \",(AE10*27))","v":" "},{"$f":"IF($AE10=\"\",\" \",(AF10*$AG$3/'manual inputs'!$C$17))","v":" "},{"$f":"IF($AE$5=\"n/a\",\"\",IF(B10=\"\",\"\",IFERROR(INDEX('quantities report'!$D$2:$D$9877,SMALL(IF('quantities report'!$A$2:$A$9877=AH$3,ROW('quantities report'!$A$2:$A$9877)-1,\"\"),ROWS($B$9:$B10))),\"0\")))","v":""},{"$f":"IF($AE10=\"\",\" \",(AH10*27))","v":" "},{"$f":"IF($AE10=\"\",\" \",(AI10*$AJ$3/'manual inputs'!$C$17))","v":" "},"",{"$f":"IF(B10=\"\",\" \",IF($C$5=\"Aggregate Base\",I10)+IF($Q$5=\"Aggregate Base\",W10)+IF($J$5=\"Aggregate Base\",P10)+IF($X$5=\"Aggregate Base\",AD10)+IF($AE$5=\"Aggregate Base\",AK10))","v":" "},{"$f":"IF(B10=\"\",\" \",IF($C$5=\"Asphalt Concrete Pavement\",I10)+IF($Q$5=\"Asphalt Concrete Pavement\",$W$9)+IF($J$5=\"Asphalt Concrete Pavement\",P10)+IF($X$5=\"Asphalt Concrete Pavement\",AD10)+IF($AE$5=\"Asphalt Concrete Pavement\",AK10))","v":" "},{"$f":"IF(B10=\"\",\"\",(AM10*'manual inputs'!$C$6))","v":""},{"$f":"IF($B10=\"\",\"\",(((($AM10*'manual inputs'!$C$17/Surfacing!$E$3)/('manual inputs'!$D$23/12))/9)*$AO$3)/'manual inputs'!$C$16)","v":""},{"$f":"IF($B10=\"\",\"\",(((($AM10*'manual inputs'!$C$17/Surfacing!$E$3)/('manual inputs'!$D$23/12))/9)))","v":""},{"$f":"IF($B10=\"\",\"\",((((($AM10*'manual inputs'!$C$17/Surfacing!$E$3)/('manual inputs'!$D$23/12))/9)*$AQ$3)/'manual inputs'!$C$17)*'manual inputs'!$C$12)","v":""},{"$f":"IF($B10=\"\",\"\",(((($AM10*'manual inputs'!$C$17/Surfacing!$E$3)/('manual inputs'!$D$23/12))/9)*$AO$3)/'manual inputs'!$C$16)","v":""},{"$f":"IF($C$5=\"n/a\",\"\",IF(B10=\"\",\"\",IFERROR(INDEX('quantities report'!$D$2:$D$9877,SMALL(IF('quantities report'!$A$2:$A$9877=AS$3,ROW('quantities report'!$A$2:$A$9877)-1,\"\"),ROWS($B$9:$B10))),\"0\")))","v":""},{"$f":"IF($C10=\"\",\" \",(AS10*27))","v":" "},{"$f":"IF($C10=\"\",\" \",(AT10/('manual inputs'!$C$21/12)/9))","v":" "}]
[null,{"$f":"IFERROR(INDEX('manual inputs'!J:J,SMALL(IF('manual inputs'!J:J<>\"\",ROW('manual inputs'!J:J)),ROW('manual inputs'!5:5))),\"\")","v":""},{"$f":"IF($C$5=\"n/a\",\"\",IF(B11=\"\",\"\",IFERROR(INDEX('quantities report'!$D$2:$D$9877,SMALL(IF('quantities report'!$A$2:$A$9877=C$3,ROW('quantities report'!$A$2:$A$9877)-1,\"\"),ROWS($B$9:$B11))),\"0\")))","v":""}," ",{"$f":"IF($C11=\"\",\" \",(D11*$E$3/'manual inputs'!$C$17))","v":" "},{"$f":"IF($C$5=\"n/a\",\"\",IF(B11=\"\",\"\",IFERROR(INDEX('quantities report'!$D$2:$D$9877,SMALL(IF('quantities report'!$A$2:$A$9877=F$3,ROW('quantities report'!$A$2:$A$9877)-1,\"\"),ROWS($B$9:$B11))),\"0\")))","v":""}," ",{"$f":"IF($F11=\"\",\" \",(G11*$E$3/'manual inputs'!$C$17))","v":" "},"",{"$f":"IF($J$5=\"n/a\",\"\",IF(B11=\"\",\"\",IFERROR(INDEX('quantities report'!$D$2:$D$9877,SMALL(IF('quantities report'!$A$2:$A$9877=J$3,ROW('quantities report'!$A$2:$A$9877)-1,\"\"),ROWS($B$9:$B11))),\"0\")))","v":""}," ",{"$f":"IF($J11=\"\",\" \",(K11*$L$3/'manual inputs'!$C$17))","v":" "},{"$f":"IF($J$5=\"n/a\",\"\",IF(B11=\"\",\"\",IFERROR(INDEX('quantities report'!$D$2:$D$9877,SMALL(IF('quantities report'!$A$2:$A$9877=M$3,ROW('quantities report'!$A$2:$A$9877)-1,\"\"),ROWS($B$9:$B11))),\"0\")))","v":""}," ",{"$f":"IF($M11=\"\",\" \",(N11*$O$3/'manual inputs'!$C$17))","v":" "},"",{"$f":"IF($Q$5=\"n/a\",\"\",IF(B11=\"\",\"\",IFERROR(INDEX('quantities report'!$D$2:$D$9877,SMALL(IF('quantities report'!$A$2:$A$9877=Q$3,ROW('quantities report'!$A$2:$A$9877)-1,\"\"),ROWS($B$9:$B11))),\"0\")))","v":""}," ",{"$f":"IF($Q11=\"\",\" \",(R11*$S$3/'manual inputs'!$C$17))","v":" "},{"$f":"IF($Q$5=\"n/a\",\"\",IF(I11=\"\",\"\",IFERROR(INDEX('quantities report'!$D$2:$D$9877,SMALL(IF('quantities report'!$A$2:$A$9877=T$3,ROW('quantities report'!$A$2:$A$9877)-1,\"\"),ROWS($B$9:$B11))),\"0\")))","v":""}," ",{"$f":"IF($T11=\"\",\" \",(U11*$V$3/'manual inputs'!$C$17))","v":" "},"",{"$f":"IF($X$5=\"n/a\",\"\",IF(B11=\"\",\"\",IFERROR(INDEX('quantities report'!$D$2:$D$9877,SMALL(IF('quantities report'!$A$2:$A$9877=X$3,ROW('quantities report'!$A$2:$A$9877)-1,\"\"),ROWS($B$9:$B11))),\"0\")))","v":""}," ",{"$f":"IF($X11=\"\",\" \",(Y11*$Z$3/'manual inputs'!$C$17))","v":" "},{"$f":"IF($X$5=\"n/a\",\"\",IF(B11=\"\",\"\",IFERROR(INDEX('quantities report'!$D$2:$D$9877,SMALL(IF('quantities report'!$A$2:$A$9877=AA$3,ROW('quantities report'!$A$2:$A$9877)-1,\"\"),ROWS($B$9:$B11))),\"0\")))","v":""}," ",{"$f":"IF($AA11=\"\",\" \",(AB11*$AC$3/'manual inputs'!$C$17))","v":" "},"",{"$f":"IF($AE$5=\"n/a\",\"\",IF(B11=\"\",\"\",IFERROR(INDEX('quantities report'!$D$2:$D$9877,SMALL(IF('quantities report'!$A$2:$A$9877=AE$3,ROW('quantities report'!$A$2:$A$9877)-1,\"\"),ROWS($B$9:$B11))),\"0\")))","v":""}," ",{"$f":"IF($AE11=\"\",\" \",(AF11*$AG$3/'manual inputs'!$C$17))","v":" "},{"$f":"IF($AE$5=\"n/a\",\"\",IF(B11=\"\",\"\",IFERROR(INDEX('quantities report'!$D$2:$D$9877,SMALL(IF('quantities report'!$A$2:$A$9877=AH$3,ROW('quantities report'!$A$2:$A$9877)-1,\"\"),ROWS($B$9:$B11))),\"0\")))","v":""}," ",{"$f":"IF($AE11=\"\",\" \",(AI11*$AJ$3/'manual inputs'!$C$17))","v":" "},""," "," ",{"$f":"IF(B11=\"\",\"\",(AM11*'manual inputs'!$C$6))","v":""},{"$f":"IF($B11=\"\",\"\",(((($AM11*'manual inputs'!$C$17/Surfacing!$E$3)/('manual inputs'!$D$23/12))/9)*$AO$3)/'manual inputs'!$C$16)","v":""},{"$f":"IF($B11=\"\",\"\",(((($AM11*'manual inputs'!$C$17/Surfacing!$E$3)/('manual inputs'!$D$23/12))/9)))","v":""},{"$f":"IF($B11=\"\",\"\",((((($AM11*'manual inputs'!$C$17/Surfacing!$E$3)/('manual inputs'!$D$23/12))/9)*$AQ$3)/'manual inputs'!$C$17)*'manual inputs'!$C$12)","v":""},{"$f":"IF($B11=\"\",\"\",(((($AM11*'manual inputs'!$C$17/Surfacing!$E$3)/('manual inputs'!$D$23/12))/9)*$AO$3)/'manual inputs'!$C$16)","v":""},{"$f":"IF($C$5=\"n/a\",\"\",IF(B11=\"\",\"\",IFERROR(INDEX('quantities report'!$D$2:$D$9877,SMALL(IF('quantities report'!$A$2:$A$9877=AS$3,ROW('quantities report'!$A$2:$A$9877)-1,\"\"),ROWS($B$9:$B11))),\"0\")))","v":""}," ",{"$f":"IF($C11=\"\",\" \",(AT11/('manual inputs'!$C$21/12)/9))","v":" "}]
[null,{"$f":"IFERROR(INDEX('manual inputs'!J:J,SMALL(IF('manual inputs'!J:J<>\"\",ROW('manual inputs'!J:J)),ROW('manual inputs'!6:6))),\"\")","v":""},{"$f":"IF($C$5=\"n/a\",\"\",IF(B12=\"\",\"\",IFERROR(INDEX('quantities report'!$D$2:$D$9877,SMALL(IF('quantities report'!$A$2:$A$9877=C$3,ROW('quantities report'!$A$2:$A$9877)-1,\"\"),ROWS($B$9:$B12))),\"0\")))","v":""}," ",{"$f":"IF($C12=\"\",\" \",(D12*$E$3/'manual inputs'!$C$17))","v":" "},{"$f":"IF($C$5=\"n/a\",\"\",IF(B12=\"\",\"\",IFERROR(INDEX('quantities report'!$D$2:$D$9877,SMALL(IF('quantities report'!$A$2:$A$9877=F$3,ROW('quantities report'!$A$2:$A$9877)-1,\"\"),ROWS($B$9:$B12))),\"0\")))","v":""}," ",{"$f":"IF($F12=\"\",\" \",(G12*$E$3/'manual inputs'!$C$17))","v":" "},"",{"$f":"IF($J$5=\"n/a\",\"\",IF(B12=\"\",\"\",IFERROR(INDEX('quantities report'!$D$2:$D$9877,SMALL(IF('quantities report'!$A$2:$A$9877=J$3,ROW('quantities report'!$A$2:$A$9877)-1,\"\"),ROWS($B$9:$B12))),\"0\")))","v":""}," ",{"$f":"IF($J12=\"\",\" \",(K12*$L$3/'manual inputs'!$C$17))","v":" "},{"$f":"IF($J$5=\"n/a\",\"\",IF(B12=\"\",\"\",IFERROR(INDEX('quantities report'!$D$2:$D$9877,SMALL(IF('quantities report'!$A$2:$A$9877=M$3,ROW('quantities report'!$A$2:$A$9877)-1,\"\"),ROWS($B$9:$B12))),\"0\")))","v":""}," ",{"$f":"IF($M12=\"\",\" \",(N12*$O$3/'manual inputs'!$C$17))","v":" "},"",{"$f":"IF($Q$5=\"n/a\",\"\",IF(B12=\"\",\"\",IFERROR(INDEX('quantities report'!$D$2:$D$9877,SMALL(IF('quantities report'!$A$2:$A$9877=Q$3,ROW('quantities report'!$A$2:$A$9877)-1,\"\"),ROWS($B$9:$B12))),\"0\")))","v":""}," ",{"$f":"IF($Q12=\"\",\" \",(R12*$S$3/'manual inputs'!$C$17))","v":" "},{"$f":"IF($Q$5=\"n/a\",\"\",IF(I12=\"\",\"\",IFERROR(INDEX('quantities report'!$D$2:$D$9877,SMALL(IF('quantities report'!$A$2:$A$9877=T$3,ROW('quantities report'!$A$2:$A$9877)-1,\"\"),ROWS($B$9:$B12))),\"0\")))","v":""}," ",{"$f":"IF($T12=\"\",\" \",(U12*$V$3/'manual inputs'!$C$17))","v":" "},"",{"$f":"IF($X$5=\"n/a\",\"\",IF(B12=\"\",\"\",IFERROR(INDEX('quantities report'!$D$2:$D$9877,SMALL(IF('quantities report'!$A$2:$A$9877=X$3,ROW('quantities report'!$A$2:$A$9877)-1,\"\"),ROWS($B$9:$B12))),\"0\")))","v":""}," ",{"$f":"IF($X12=\"\",\" \",(Y12*$Z$3/'manual inputs'!$C$17))","v":" "},{"$f":"IF($X$5=\"n/a\",\"\",IF(B12=\"\",\"\",IFERROR(INDEX('quantities report'!$D$2:$D$9877,SMALL(IF('quantities report'!$A$2:$A$9877=AA$3,ROW('quantities report'!$A$2:$A$9877)-1,\"\"),ROWS($B$9:$B12))),\"0\")))","v":""}," ",{"$f":"IF($AA12=\"\",\" \",(AB12*$AC$3/'manual inputs'!$C$17))","v":" "},"",{"$f":"IF($AE$5=\"n/a\",\"\",IF(B12=\"\",\"\",IFERROR(INDEX('quantities report'!$D$2:$D$9877,SMALL(IF('quantities report'!$A$2:$A$9877=AE$3,ROW('quantities report'!$A$2:$A$9877)-1,\"\"),ROWS($B$9:$B12))),\"0\")))","v":""}," ",{"$f":"IF($AE12=\"\",\" \",(AF12*$AG$3/'manual inputs'!$C$17))","v":" "},{"$f":"IF($AE$5=\"n/a\",\"\",IF(B12=\"\",\"\",IFERROR(INDEX('quantities report'!$D$2:$D$9877,SMALL(IF('quantities report'!$A$2:$A$9877=AH$3,ROW('quantities report'!$A$2:$A$9877)-1,\"\"),ROWS($B$9:$B12))),\"0\")))","v":""}," ",{"$f":"IF($AE12=\"\",\" \",(AI12*$AJ$3/'manual inputs'!$C$17))","v":" "},""," "," ",{"$f":"IF(B12=\"\",\"\",(AM12*'manual inputs'!$C$6))","v":""},{"$f":"IF($B12=\"\",\"\",(((($AM12*'manual inputs'!$C$17/Surfacing!$E$3)/('manual inputs'!$D$23/12))/9)*$AO$3)/'manual inputs'!$C$16)","v":""},{"$f":"IF($B12=\"\",\"\",(((($AM12*'manual inputs'!$C$17/Surfacing!$E$3)/('manual inputs'!$D$23/12))/9)))","v":""},{"$f":"IF($B12=\"\",\"\",((((($AM12*'manual inputs'!$C$17/Surfacing!$E$3)/('manual inputs'!$D$23/12))/9)*$AQ$3)/'manual inputs'!$C$17)*'manual inputs'!$C$12)","v":""},{"$f":"IF($B12=\"\",\"\",(((($AM12*'manual inputs'!$C$17/Surfacing!$E$3)/('manual inputs'!$D$23/12))/9)*$AO$3)/'manual inputs'!$C$16)","v":""},{"$f":"IF($C$5=\"n/a\",\"\",IF(B12=\"\",\"\",IFERROR(INDEX('quantities report'!$D$2:$D$9877,SMALL(IF('quantities report'!$A$2:$A$9877=AS$3,ROW('quantities report'!$A$2:$A$9877)-1,\"\"),ROWS($B$9:$B12))),\"0\")))","v":""}," ",{"$f":"IF($C12=\"\",\" \",(AT12/('manual inputs'!$C$21/12)/9))","v":" "}]
[null,{"$f":"IFERROR(INDEX('manual inputs'!J:J,SMALL(IF('manual inputs'!J:J<>\"\",ROW('manual inputs'!J:J)),ROW('manual inputs'!7:7))),\"\")","v":""},{"$f":"IF($C$5=\"n/a\",\"\",IF(B13=\"\",\"\",IFERROR(INDEX('quantities report'!$D$2:$D$9877,SMALL(IF('quantities report'!$A$2:$A$9877=C$3,ROW('quantities report'!$A$2:$A$9877)-1,\"\"),ROWS($B$9:$B13))),\"0\")))","v":""}," ",{"$f":"IF($C13=\"\",\" \",(D13*$E$3/'manual inputs'!$C$17))","v":" "},{"$f":"IF($C$5=\"n/a\",\"\",IF(B13=\"\",\"\",IFERROR(INDEX('quantities report'!$D$2:$D$9877,SMALL(IF('quantities report'!$A$2:$A$9877=F$3,ROW('quantities report'!$A$2:$A$9877)-1,\"\"),ROWS($B$9:$B13))),\"0\")))","v":""}," ",{"$f":"IF($F13=\"\",\" \",(G13*$E$3/'manual inputs'!$C$17))","v":" "},"",{"$f":"IF($J$5=\"n/a\",\"\",IF(B13=\"\",\"\",IFERROR(INDEX('quantities report'!$D$2:$D$9877,SMALL(IF('quantities report'!$A$2:$A$9877=J$3,ROW('quantities report'!$A$2:$A$9877)-1,\"\"),ROWS($B$9:$B13))),\"0\")))","v":""}," ",{"$f":"IF($J13=\"\",\" \",(K13*$L$3/'manual inputs'!$C$17))","v":" "},{"$f":"IF($J$5=\"n/a\",\"\",IF(B13=\"\",\"\",IFERROR(INDEX('quantities report'!$D$2:$D$9877,SMALL(IF('quantities report'!$A$2:$A$9877=M$3,ROW('quantities report'!$A$2:$A$9877)-1,\"\"),ROWS($B$9:$B13))),\"0\")))","v":""}," ",{"$f":"IF($M13=\"\",\" \",(N13*$O$3/'manual inputs'!$C$17))","v":" "},"",{"$f":"IF($Q$5=\"n/a\",\"\",IF(B13=\"\",\"\",IFERROR(INDEX('quantities report'!$D$2:$D$9877,SMALL(IF('quantities report'!$A$2:$A$9877=Q$3,ROW('quantities report'!$A$2:$A$9877)-1,\"\"),ROWS($B$9:$B13))),\"0\")))","v":""}," ",{"$f":"IF($Q13=\"\",\" \",(R13*$S$3/'manual inputs'!$C$17))","v":" "},{"$f":"IF($Q$5=\"n/a\",\"\",IF(I13=\"\",\"\",IFERROR(INDEX('quantities report'!$D$2:$D$9877,SMALL(IF('quantities report'!$A$2:$A$9877=T$3,ROW('quantities report'!$A$2:$A$9877)-1,\"\"),ROWS($B$9:$B13))),\"0\")))","v":""}," ",{"$f":"IF($T13=\"\",\" \",(U13*$V$3/'manual inputs'!$C$17))","v":" "},"",{"$f":"IF($X$5=\"n/a\",\"\",IF(B13=\"\",\"\",IFERROR(INDEX('quantities report'!$D$2:$D$9877,SMALL(IF('quantities report'!$A$2:$A$9877=X$3,ROW('quantities report'!$A$2:$A$9877)-1,\"\"),ROWS($B$9:$B13))),\"0\")))","v":""}," ",{"$f":"IF($X13=\"\",\" \",(Y13*$Z$3/'manual inputs'!$C$17))","v":" "},{"$f":"IF($X$5=\"n/a\",\"\",IF(B13=\"\",\"\",IFERROR(INDEX('quantities report'!$D$2:$D$9877,SMALL(IF('quantities report'!$A$2:$A$9877=AA$3,ROW('quantities report'!$A$2:$A$9877)-1,\"\"),ROWS($B$9:$B13))),\"0\")))","v":""}," ",{"$f":"IF($AA13=\"\",\" \",(AB13*$AC$3/'manual inputs'!$C$17))","v":" "},"",{"$f":"IF($AE$5=\"n/a\",\"\",IF(B13=\"\",\"\",IFERROR(INDEX('quantities report'!$D$2:$D$9877,SMALL(IF('quantities report'!$A$2:$A$9877=AE$3,ROW('quantities report'!$A$2:$A$9877)-1,\"\"),ROWS($B$9:$B13))),\"0\")))","v":""}," ",{"$f":"IF($AE13=\"\",\" \",(AF13*$AG$3/'manual inputs'!$C$17))","v":" "},{"$f":"IF($AE$5=\"n/a\",\"\",IF(B13=\"\",\"\",IFERROR(INDEX('quantities report'!$D$2:$D$9877,SMALL(IF('quantities report'!$A$2:$A$9877=AH$3,ROW('quantities report'!$A$2:$A$9877)-1,\"\"),ROWS($B$9:$B13))),\"0\")))","v":""}," ",{"$f":"IF($AE13=\"\",\" \",(AI13*$AJ$3/'manual inputs'!$C$17))","v":" "},""," "," ",{"$f":"IF(B13=\"\",\"\",(AM13*'manual inputs'!$C$6))","v":""},{"$f":"IF($B13=\"\",\"\",(((($AM13*'manual inputs'!$C$17/Surfacing!$E$3)/('manual inputs'!$D$23/12))/9)*$AO$3)/'manual inputs'!$C$16)","v":""},{"$f":"IF($B13=\"\",\"\",(((($AM13*'manual inputs'!$C$17/Surfacing!$E$3)/('manual inputs'!$D$23/12))/9)))","v":""},{"$f":"IF($B13=\"\",\"\",((((($AM13*'manual inputs'!$C$17/Surfacing!$E$3)/('manual inputs'!$D$23/12))/9)*$AQ$3)/'manual inputs'!$C$17)*'manual inputs'!$C$12)","v":""},{"$f":"IF($B13=\"\",\"\",(((($AM13*'manual inputs'!$C$17/Surfacing!$E$3)/('manual inputs'!$D$23/12))/9)*$AO$3)/'manual inputs'!$C$16)","v":""},{"$f":"IF($C$5=\"n/a\",\"\",IF(B13=\"\",\"\",IFERROR(INDEX('quantities report'!$D$2:$D$9877,SMALL(IF('quantities report'!$A$2:$A$9877=AS$3,ROW('quantities report'!$A$2:$A$9877)-1,\"\"),ROWS($B$9:$B13))),\"0\")))","v":""}," ",{"$f":"IF($C13=\"\",\" \",(AT13/('manual inputs'!$C$21/12)/9))","v":" "}]
[null,{"$f":"IFERROR(INDEX('manual inputs'!J:J,SMALL(IF('manual inputs'!J:J<>\"\",ROW('manual inputs'!J:J)),ROW('manual inputs'!8:8))),\"\")","v":""},{"$f":"IF($C$5=\"n/a\",\"\",IF(B14=\"\",\"\",IFERROR(INDEX('quantities report'!$D$2:$D$9877,SMALL(IF('quantities report'!$A$2:$A$9877=C$3,ROW('quantities report'!$A$2:$A$9877)-1,\"\"),ROWS($B$9:$B14))),\"0\")))","v":""}," ",{"$f":"IF($C14=\"\",\" \",(D14*$E$3/'manual inputs'!$C$17))","v":" "},{"$f":"IF($C$5=\"n/a\",\"\",IF(B14=\"\",\"\",IFERROR(INDEX('quantities report'!$D$2:$D$9877,SMALL(IF('quantities report'!$A$2:$A$9877=F$3,ROW('quantities report'!$A$2:$A$9877)-1,\"\"),ROWS($B$9:$B14))),\"0\")))","v":""}," ",{"$f":"IF($F14=\"\",\" \",(G14*$E$3/'manual inputs'!$C$17))","v":" "},"",{"$f":"IF($J$5=\"n/a\",\"\",IF(B14=\"\",\"\",IFERROR(INDEX('quantities report'!$D$2:$D$9877,SMALL(IF('quantities report'!$A$2:$A$9877=J$3,ROW('quantities report'!$A$2:$A$9877)-1,\"\"),ROWS($B$9:$B14))),\"0\")))","v":""}," ",{"$f":"IF($J14=\"\",\" \",(K14*$L$3/'manual inputs'!$C$17))","v":" "},{"$f":"IF($J$5=\"n/a\",\"\",IF(B14=\"\",\"\",IFERROR(INDEX('quantities report'!$D$2:$D$9877,SMALL(IF('quantities report'!$A$2:$A$9877=M$3,ROW('quantities report'!$A$2:$A$9877)-1,\"\"),ROWS($B$9:$B14))),\"0\")))","v":""}," ",{"$f":"IF($M14=\"\",\" \",(N14*$O$3/'manual inputs'!$C$17))","v":" "},"",{"$f":"IF($Q$5=\"n/a\",\"\",IF(B14=\"\",\"\",IFERROR(INDEX('quantities report'!$D$2:$D$9877,SMALL(IF('quantities report'!$A$2:$A$9877=Q$3,ROW('quantities report'!$A$2:$A$9877)-1,\"\"),ROWS($B$9:$B14))),\"0\")))","v":""}," ",{"$f":"IF($Q14=\"\",\" \",(R14*$S$3/'manual inputs'!$C$17))","v":" "},{"$f":"IF($Q$5=\"n/a\",\"\",IF(I14=\"\",\"\",IFERROR(INDEX('quantities report'!$D$2:$D$9877,SMALL(IF('quantities report'!$A$2:$A$9877=T$3,ROW('quantities report'!$A$2:$A$9877)-1,\"\"),ROWS($B$9:$B14))),\"0\")))","v":""}," ",{"$f":"IF($T14=\"\",\" \",(U14*$V$3/'manual inputs'!$C$17))","v":" "},"",{"$f":"IF($X$5=\"n/a\",\"\",IF(B14=\"\",\"\",IFERROR(INDEX('quantities report'!$D$2:$D$9877,SMALL(IF('quantities report'!$A$2:$A$9877=X$3,ROW('quantities report'!$A$2:$A$9877)-1,\"\"),ROWS($B$9:$B14))),\"0\")))","v":""}," ",{"$f":"IF($X14=\"\",\" \",(Y14*$Z$3/'manual inputs'!$C$17))","v":" "},{"$f":"IF($X$5=\"n/a\",\"\",IF(B14=\"\",\"\",IFERROR(INDEX('quantities report'!$D$2:$D$9877,SMALL(IF('quantities report'!$A$2:$A$9877=AA$3,ROW('quantities report'!$A$2:$A$9877)-1,\"\"),ROWS($B$9:$B14))),\"0\")))","v":""}," ",{"$f":"IF($AA14=\"\",\" \",(AB14*$AC$3/'manual inputs'!$C$17))","v":" "},"",{"$f":"IF($AE$5=\"n/a\",\"\",IF(B14=\"\",\"\",IFERROR(INDEX('quantities report'!$D$2:$D$9877,SMALL(IF('quantities report'!$A$2:$A$9877=AE$3,ROW('quantities report'!$A$2:$A$9877)-1,\"\"),ROWS($B$9:$B14))),\"0\")))","v":""}," ",{"$f":"IF($AE14=\"\",\" \",(AF14*$AG$3/'manual inputs'!$C$17))","v":" "},{"$f":"IF($AE$5=\"n/a\",\"\",IF(B14=\"\",\"\",IFERROR(INDEX('quantities report'!$D$2:$D$9877,SMALL(IF('quantities report'!$A$2:$A$9877=AH$3,ROW('quantities report'!$A$2:$A$9877)-1,\"\"),ROWS($B$9:$B14))),\"0\")))","v":""}," ",{"$f":"IF($AE14=\"\",\" \",(AI14*$AJ$3/'manual inputs'!$C$17))","v":" "},""," "," ",{"$f":"IF(B14=\"\",\"\",(AM14*'manual inputs'!$C$6))","v":""},{"$f":"IF($B14=\"\",\"\",(((($AM14*'manual inputs'!$C$17/Surfacing!$E$3)/('manual inputs'!$D$23/12))/9)*$AO$3)/'manual inputs'!$C$16)","v":""},{"$f":"IF($B14=\"\",\"\",(((($AM14*'manual inputs'!$C$17/Surfacing!$E$3)/('manual inputs'!$D$23/12))/9)))","v":""},{"$f":"IF($B14=\"\",\"\",((((($AM14*'manual inputs'!$C$17/Surfacing!$E$3)/('manual inputs'!$D$23/12))/9)*$AQ$3)/'manual inputs'!$C$17)*'manual inputs'!$C$12)","v":""},{"$f":"IF($B14=\"\",\"\",(((($AM14*'manual inputs'!$C$17/Surfacing!$E$3)/('manual inputs'!$D$23/12))/9)*$AO$3)/'manual inputs'!$C$16)","v":""},{"$f":"IF($C$5=\"n/a\",\"\",IF(B14=\"\",\"\",IFERROR(INDEX('quantities report'!$D$2:$D$9877,SMALL(IF('quantities report'!$A$2:$A$9877=AS$3,ROW('quantities report'!$A$2:$A$9877)-1,\"\"),ROWS($B$9:$B14))),\"0\")))","v":""}," ",{"$f":"IF($C14=\"\",\" \",(AT14/('manual inputs'!$C$21/12)/9))","v":" "}]
[null,{"$f":"IFERROR(INDEX('manual inputs'!J:J,SMALL(IF('manual inputs'!J:J<>\"\",ROW('manual inputs'!J:J)),ROW('manual inputs'!9:9))),\"\")","v":""},{"$f":"IF($C$5=\"n/a\",\"\",IF(B15=\"\",\"\",IFERROR(INDEX('quantities report'!$D$2:$D$9877,SMALL(IF('quantities report'!$A$2:$A$9877=C$3,ROW('quantities report'!$A$2:$A$9877)-1,\"\"),ROWS($B$9:$B15))),\"0\")))","v":""}," ",{"$f":"IF($C15=\"\",\" \",(D15*$E$3/'manual inputs'!$C$17))","v":" "},{"$f":"IF($C$5=\"n/a\",\"\",IF(B15=\"\",\"\",IFERROR(INDEX('quantities report'!$D$2:$D$9877,SMALL(IF('quantities report'!$A$2:$A$9877=F$3,ROW('quantities report'!$A$2:$A$9877)-1,\"\"),ROWS($B$9:$B15))),\"0\")))","v":""}," ",{"$f":"IF($F15=\"\",\" \",(G15*$E$3/'manual inputs'!$C$17))","v":" "},"",{"$f":"IF($J$5=\"n/a\",\"\",IF(B15=\"\",\"\",IFERROR(INDEX('quantities report'!$D$2:$D$9877,SMALL(IF('quantities report'!$A$2:$A$9877=J$3,ROW('quantities report'!$A$2:$A$9877)-1,\"\"),ROWS($B$9:$B15))),\"0\")))","v":""}," ",{"$f":"IF($J15=\"\",\" \",(K15*$L$3/'manual inputs'!$C$17))","v":" "},{"$f":"IF($J$5=\"n/a\",\"\",IF(B15=\"\",\"\",IFERROR(INDEX('quantities report'!$D$2:$D$9877,SMALL(IF('quantities report'!$A$2:$A$9877=M$3,ROW('quantities report'!$A$2:$A$9877)-1,\"\"),ROWS($B$9:$B15))),\"0\")))","v":""}," ",{"$f":"IF($M15=\"\",\" \",(N15*$O$3/'manual inputs'!$C$17))","v":" "},"",{"$f":"IF($Q$5=\"n/a\",\"\",IF(B15=\"\",\"\",IFERROR(INDEX('quantities report'!$D$2:$D$9877,SMALL(IF('quantities report'!$A$2:$A$9877=Q$3,ROW('quantities report'!$A$2:$A$9877)-1,\"\"),ROWS($B$9:$B15))),\"0\")))","v":""}," ",{"$f":"IF($Q15=\"\",\" \",(R15*$S$3/'manual inputs'!$C$17))","v":" "},{"$f":"IF($Q$5=\"n/a\",\"\",IF(I15=\"\",\"\",IFERROR(INDEX('quantities report'!$D$2:$D$9877,SMALL(IF('quantities report'!$A$2:$A$9877=T$3,ROW('quantities report'!$A$2:$A$9877)-1,\"\"),ROWS($B$9:$B15))),\"0\")))","v":""}," ",{"$f":"IF($T15=\"\",\" \",(U15*$V$3/'manual inputs'!$C$17))","v":" "},"",{"$f":"IF($X$5=\"n/a\",\"\",IF(B15=\"\",\"\",IFERROR(INDEX('quantities report'!$D$2:$D$9877,SMALL(IF('quantities report'!$A$2:$A$9877=X$3,ROW('quantities report'!$A$2:$A$9877)-1,\"\"),ROWS($B$9:$B15))),\"0\")))","v":""}," ",{"$f":"IF($X15=\"\",\" \",(Y15*$Z$3/'manual inputs'!$C$17))","v":" "},{"$f":"IF($X$5=\"n/a\",\"\",IF(B15=\"\",\"\",IFERROR(INDEX('quantities report'!$D$2:$D$9877,SMALL(IF('quantities report'!$A$2:$A$9877=AA$3,ROW('quantities report'!$A$2:$A$9877)-1,\"\"),ROWS($B$9:$B15))),\"0\")))","v":""}," ",{"$f":"IF($AA15=\"\",\" \",(AB15*$AC$3/'manual inputs'!$C$17))","v":" "},"",{"$f":"IF($AE$5=\"n/a\",\"\",IF(B15=\"\",\"\",IFERROR(INDEX('quantities report'!$D$2:$D$9877,SMALL(IF('quantities report'!$A$2:$A$9877=AE$3,ROW('quantities report'!$A$2:$A$9877)-1,\"\"),ROWS($B$9:$B15))),\"0\")))","v":""}," ",{"$f":"IF($AE15=\"\",\" \",(AF15*$AG$3/'manual inputs'!$C$17))","v":" "},{"$f":"IF($AE$5=\"n/a\",\"\",IF(B15=\"\",\"\",IFERROR(INDEX('quantities report'!$D$2:$D$9877,SMALL(IF('quantities report'!$A$2:$A$9877=AH$3,ROW('quantities report'!$A$2:$A$9877)-1,\"\"),ROWS($B$9:$B15))),\"0\")))","v":""}," ",{"$f":"IF($AE15=\"\",\" \",(AI15*$AJ$3/'manual inputs'!$C$17))","v":" "},""," "," ",{"$f":"IF(B15=\"\",\"\",(AM15*'manual inputs'!$C$6))","v":""},{"$f":"IF($B15=\"\",\"\",(((($AM15*'manual inputs'!$C$17/Surfacing!$E$3)/('manual inputs'!$D$23/12))/9)*$AO$3)/'manual inputs'!$C$16)","v":""},{"$f":"IF($B15=\"\",\"\",(((($AM15*'manual inputs'!$C$17/Surfacing!$E$3)/('manual inputs'!$D$23/12))/9)))","v":""},{"$f":"IF($B15=\"\",\"\",((((($AM15*'manual inputs'!$C$17/Surfacing!$E$3)/('manual inputs'!$D$23/12))/9)*$AQ$3)/'manual inputs'!$C$17)*'manual inputs'!$C$12)","v":""},{"$f":"IF($B15=\"\",\"\",(((($AM15*'manual inputs'!$C$17/Surfacing!$E$3)/('manual inputs'!$D$23/12))/9)*$AO$3)/'manual inputs'!$C$16)","v":""},{"$f":"IF($C$5=\"n/a\",\"\",IF(B15=\"\",\"\",IFERROR(INDEX('quantities report'!$D$2:$D$9877,SMALL(IF('quantities report'!$A$2:$A$9877=AS$3,ROW('quantities report'!$A$2:$A$9877)-1,\"\"),ROWS($B$9:$B15))),\"0\")))","v":""}," ",{"$f":"IF($C15=\"\",\" \",(AT15/('manual inputs'!$C$21/12)/9))","v":" "}]
[null,{"$f":"IFERROR(INDEX('manual inputs'!J:J,SMALL(IF('manual inputs'!J:J<>\"\",ROW('manual inputs'!J:J)),ROW('manual inputs'!10:10))),\"\")","v":""},{"$f":"IF($C$5=\"n/a\",\"\",IF(B16=\"\",\"\",IFERROR(INDEX('quantities report'!$D$2:$D$9877,SMALL(IF('quantities report'!$A$2:$A$9877=C$3,ROW('quantities report'!$A$2:$A$9877)-1,\"\"),ROWS($B$9:$B16))),\"0\")))","v":""}," ",{"$f":"IF($C16=\"\",\" \",(D16*$E$3/'manual inputs'!$C$17))","v":" "},{"$f":"IF($C$5=\"n/a\",\"\",IF(B16=\"\",\"\",IFERROR(INDEX('quantities report'!$D$2:$D$9877,SMALL(IF('quantities report'!$A$2:$A$9877=F$3,ROW('quantities report'!$A$2:$A$9877)-1,\"\"),ROWS($B$9:$B16))),\"0\")))","v":""}," ",{"$f":"IF($F16=\"\",\" \",(G16*$E$3/'manual inputs'!$C$17))","v":" "},"",{"$f":"IF($J$5=\"n/a\",\"\",IF(B16=\"\",\"\",IFERROR(INDEX('quantities report'!$D$2:$D$9877,SMALL(IF('quantities report'!$A$2:$A$9877=J$3,ROW('quantities report'!$A$2:$A$9877)-1,\"\"),ROWS($B$9:$B16))),\"0\")))","v":""}," ",{"$f":"IF($J16=\"\",\" \",(K16*$L$3/'manual inputs'!$C$17))","v":" "},{"$f":"IF($J$5=\"n/a\",\"\",IF(B16=\"\",\"\",IFERROR(INDEX('quantities report'!$D$2:$D$9877,SMALL(IF('quantities report'!$A$2:$A$9877=M$3,ROW('quantities report'!$A$2:$A$9877)-1,\"\"),ROWS($B$9:$B16))),\"0\")))","v":""}," ",{"$f":"IF($M16=\"\",\" \",(N16*$O$3/'manual inputs'!$C$17))","v":" "},"",{"$f":"IF($Q$5=\"n/a\",\"\",IF(B16=\"\",\"\",IFERROR(INDEX('quantities report'!$D$2:$D$9877,SMALL(IF('quantities report'!$A$2:$A$9877=Q$3,ROW('quantities report'!$A$2:$A$9877)-1,\"\"),ROWS($B$9:$B16))),\"0\")))","v":""}," ",{"$f":"IF($Q16=\"\",\" \",(R16*$S$3/'manual inputs'!$C$17))","v":" "},{"$f":"IF($Q$5=\"n/a\",\"\",IF(I16=\"\",\"\",IFERROR(INDEX('quantities report'!$D$2:$D$9877,SMALL(IF('quantities report'!$A$2:$A$9877=T$3,ROW('quantities report'!$A$2:$A$9877)-1,\"\"),ROWS($B$9:$B16))),\"0\")))","v":""}," ",{"$f":"IF($T16=\"\",\" \",(U16*$V$3/'manual inputs'!$C$17))","v":" "},"",{"$f":"IF($X$5=\"n/a\",\"\",IF(B16=\"\",\"\",IFERROR(INDEX('quantities report'!$D$2:$D$9877,SMALL(IF('quantities report'!$A$2:$A$9877=X$3,ROW('quantities report'!$A$2:$A$9877)-1,\"\"),ROWS($B$9:$B16))),\"0\")))","v":""}," ",{"$f":"IF($X16=\"\",\" \",(Y16*$Z$3/'manual inputs'!$C$17))","v":" "},{"$f":"IF($X$5=\"n/a\",\"\",IF(B16=\"\",\"\",IFERROR(INDEX('quantities report'!$D$2:$D$9877,SMALL(IF('quantities report'!$A$2:$A$9877=AA$3,ROW('quantities report'!$A$2:$A$9877)-1,\"\"),ROWS($B$9:$B16))),\"0\")))","v":""}," ",{"$f":"IF($AA16=\"\",\" \",(AB16*$AC$3/'manual inputs'!$C$17))","v":" "},"",{"$f":"IF($AE$5=\"n/a\",\"\",IF(B16=\"\",\"\",IFERROR(INDEX('quantities report'!$D$2:$D$9877,SMALL(IF('quantities report'!$A$2:$A$9877=AE$3,ROW('quantities report'!$A$2:$A$9877)-1,\"\"),ROWS($B$9:$B16))),\"0\")))","v":""}," ",{"$f":"IF($AE16=\"\",\" \",(AF16*$AG$3/'manual inputs'!$C$17))","v":" "},{"$f":"IF($AE$5=\"n/a\",\"\",IF(B16=\"\",\"\",IFERROR(INDEX('quantities report'!$D$2:$D$9877,SMALL(IF('quantities report'!$A$2:$A$9877=AH$3,ROW('quantities report'!$A$2:$A$9877)-1,\"\"),ROWS($B$9:$B16))),\"0\")))","v":""}," ",{"$f":"IF($AE16=\"\",\" \",(AI16*$AJ$3/'manual inputs'!$C$17))","v":" "},""," "," ",{"$f":"IF(B16=\"\",\"\",(AM16*'manual inputs'!$C$6))","v":""},{"$f":"IF($B16=\"\",\"\",(((($AM16*'manual inputs'!$C$17/Surfacing!$E$3)/('manual inputs'!$D$23/12))/9)*$AO$3)/'manual inputs'!$C$16)","v":""},{"$f":"IF($B16=\"\",\"\",(((($AM16*'manual inputs'!$C$17/Surfacing!$E$3)/('manual inputs'!$D$23/12))/9)))","v":""},{"$f":"IF($B16=\"\",\"\",((((($AM16*'manual inputs'!$C$17/Surfacing!$E$3)/('manual inputs'!$D$23/12))/9)*$AQ$3)/'manual inputs'!$C$17)*'manual inputs'!$C$12)","v":""},{"$f":"IF($B16=\"\",\"\",(((($AM16*'manual inputs'!$C$17/Surfacing!$E$3)/('manual inputs'!$D$23/12))/9)*$AO$3)/'manual inputs'!$C$16)","v":""},{"$f":"IF($C$5=\"n/a\",\"\",IF(B16=\"\",\"\",IFERROR(INDEX('quantities report'!$D$2:$D$9877,SMALL(IF('quantities report'!$A$2:$A$9877=AS$3,ROW('quantities report'!$A$2:$A$9877)-1,\"\"),ROWS($B$9:$B16))),\"0\")))","v":""}," ",{"$f":"IF($C16=\"\",\" \",(AT16/('manual inputs'!$C$21/12)/9))","v":" "}]
[null,{"$f":"IFERROR(INDEX('manual inputs'!J:J,SMALL(IF('manual inputs'!J:J<>\"\",ROW('manual inputs'!J:J)),ROW('manual inputs'!11:11))),\"\")","v":""},{"$f":"IF($C$5=\"n/a\",\"\",IF(B17=\"\",\"\",IFERROR(INDEX('quantities report'!$D$2:$D$9877,SMALL(IF('quantities report'!$A$2:$A$9877=C$3,ROW('quantities report'!$A$2:$A$9877)-1,\"\"),ROWS($B$9:$B17))),\"0\")))","v":""}," ",{"$f":"IF($C17=\"\",\" \",(D17*$E$3/'manual inputs'!$C$17))","v":" "},{"$f":"IF($C$5=\"n/a\",\"\",IF(B17=\"\",\"\",IFERROR(INDEX('quantities report'!$D$2:$D$9877,SMALL(IF('quantities report'!$A$2:$A$9877=F$3,ROW('quantities report'!$A$2:$A$9877)-1,\"\"),ROWS($B$9:$B17))),\"0\")))","v":""}," ",{"$f":"IF($F17=\"\",\" \",(G17*$E$3/'manual inputs'!$C$17))","v":" "},"",{"$f":"IF($J$5=\"n/a\",\"\",IF(B17=\"\",\"\",IFERROR(INDEX('quantities report'!$D$2:$D$9877,SMALL(IF('quantities report'!$A$2:$A$9877=J$3,ROW('quantities report'!$A$2:$A$9877)-1,\"\"),ROWS($B$9:$B17))),\"0\")))","v":""}," ",{"$f":"IF($J17=\"\",\" \",(K17*$L$3/'manual inputs'!$C$17))","v":" "},{"$f":"IF($J$5=\"n/a\",\"\",IF(B17=\"\",\"\",IFERROR(INDEX('quantities report'!$D$2:$D$9877,SMALL(IF('quantities report'!$A$2:$A$9877=M$3,ROW('quantities report'!$A$2:$A$9877)-1,\"\"),ROWS($B$9:$B17))),\"0\")))","v":""}," ",{"$f":"IF($M17=\"\",\" \",(N17*$O$3/'manual inputs'!$C$17))","v":" "},"",{"$f":"IF($Q$5=\"n/a\",\"\",IF(B17=\"\",\"\",IFERROR(INDEX('quantities report'!$D$2:$D$9877,SMALL(IF('quantities report'!$A$2:$A$9877=Q$3,ROW('quantities report'!$A$2:$A$9877)-1,\"\"),ROWS($B$9:$B17))),\"0\")))","v":""}," ",{"$f":"IF($Q17=\"\",\" \",(R17*$S$3/'manual inputs'!$C$17))","v":" "},{"$f":"IF($Q$5=\"n/a\",\"\",IF(I17=\"\",\"\",IFERROR(INDEX('quantities report'!$D$2:$D$9877,SMALL(IF('quantities report'!$A$2:$A$9877=T$3,ROW('quantities report'!$A$2:$A$9877)-1,\"\"),ROWS($B$9:$B17))),\"0\")))","v":""}," ",{"$f":"IF($T17=\"\",\" \",(U17*$V$3/'manual inputs'!$C$17))","v":" "},"",{"$f":"IF($X$5=\"n/a\",\"\",IF(B17=\"\",\"\",IFERROR(INDEX('quantities report'!$D$2:$D$9877,SMALL(IF('quantities report'!$A$2:$A$9877=X$3,ROW('quantities report'!$A$2:$A$9877)-1,\"\"),ROWS($B$9:$B17))),\"0\")))","v":""}," ",{"$f":"IF($X17=\"\",\" \",(Y17*$Z$3/'manual inputs'!$C$17))","v":" "},{"$f":"IF($X$5=\"n/a\",\"\",IF(B17=\"\",\"\",IFERROR(INDEX('quantities report'!$D$2:$D$9877,SMALL(IF('quantities report'!$A$2:$A$9877=AA$3,ROW('quantities report'!$A$2:$A$9877)-1,\"\"),ROWS($B$9:$B17))),\"0\")))","v":""}," ",{"$f":"IF($AA17=\"\",\" \",(AB17*$AC$3/'manual inputs'!$C$17))","v":" "},"",{"$f":"IF($AE$5=\"n/a\",\"\",IF(B17=\"\",\"\",IFERROR(INDEX('quantities report'!$D$2:$D$9877,SMALL(IF('quantities report'!$A$2:$A$9877=AE$3,ROW('quantities report'!$A$2:$A$9877)-1,\"\"),ROWS($B$9:$B17))),\"0\")))","v":""}," ",{"$f":"IF($AE17=\"\",\" \",(AF17*$AG$3/'manual inputs'!$C$17))","v":" "},{"$f":"IF($AE$5=\"n/a\",\"\",IF(B17=\"\",\"\",IFERROR(INDEX('quantities report'!$D$2:$D$9877,SMALL(IF('quantities report'!$A$2:$A$9877=AH$3,ROW('quantities report'!$A$2:$A$9877)-1,\"\"),ROWS($B$9:$B17))),\"0\")))","v":""}," ",{"$f":"IF($AE17=\"\",\" \",(AI17*$AJ$3/'manual inputs'!$C$17))","v":" "},""," "," ",{"$f":"IF(B17=\"\",\"\",(AM17*'manual inputs'!$C$6))","v":""},{"$f":"IF($B17=\"\",\"\",(((($AM17*'manual inputs'!$C$17/Surfacing!$E$3)/('manual inputs'!$D$23/12))/9)*$AO$3)/'manual inputs'!$C$16)","v":""},{"$f":"IF($B17=\"\",\"\",(((($AM17*'manual inputs'!$C$17/Surfacing!$E$3)/('manual inputs'!$D$23/12))/9)))","v":""},{"$f":"IF($B17=\"\",\"\",((((($AM17*'manual inputs'!$C$17/Surfacing!$E$3)/('manual inputs'!$D$23/12))/9)*$AQ$3)/'manual inputs'!$C$17)*'manual inputs'!$C$12)","v":""},{"$f":"IF($B17=\"\",\"\",(((($AM17*'manual inputs'!$C$17/Surfacing!$E$3)/('manual inputs'!$D$23/12))/9)*$AO$3)/'manual inputs'!$C$16)","v":""},{"$f":"IF($C$5=\"n/a\",\"\",IF(B17=\"\",\"\",IFERROR(INDEX('quantities report'!$D$2:$D$9877,SMALL(IF('quantities report'!$A$2:$A$9877=AS$3,ROW('quantities report'!$A$2:$A$9877)-1,\"\"),ROWS($B$9:$B17))),\"0\")))","v":""}," ",{"$f":"IF($C17=\"\",\" \",(AT17/('manual inputs'!$C$21/12)/9))","v":" "}]
[null,{"$f":"IFERROR(INDEX('manual inputs'!J:J,SMALL(IF('manual inputs'!J:J<>\"\",ROW('manual inputs'!J:J)),ROW('manual inputs'!12:12))),\"\")","v":""},{"$f":"IF($C$5=\"n/a\",\"\",IF(B18=\"\",\"\",IFERROR(INDEX('quantities report'!$D$2:$D$9877,SMALL(IF('quantities report'!$A$2:$A$9877=C$3,ROW('quantities report'!$A$2:$A$9877)-1,\"\"),ROWS($B$9:$B18))),\"0\")))","v":""}," ",{"$f":"IF($C18=\"\",\" \",(D18*$E$3/'manual inputs'!$C$17))","v":" "},{"$f":"IF($C$5=\"n/a\",\"\",IF(B18=\"\",\"\",IFERROR(INDEX('quantities report'!$D$2:$D$9877,SMALL(IF('quantities report'!$A$2:$A$9877=F$3,ROW('quantities report'!$A$2:$A$9877)-1,\"\"),ROWS($B$9:$B18))),\"0\")))","v":""}," ",{"$f":"IF($F18=\"\",\" \",(G18*$E$3/'manual inputs'!$C$17))","v":" "},"",{"$f":"IF($J$5=\"n/a\",\"\",IF(B18=\"\",\"\",IFERROR(INDEX('quantities report'!$D$2:$D$9877,SMALL(IF('quantities report'!$A$2:$A$9877=J$3,ROW('quantities report'!$A$2:$A$9877)-1,\"\"),ROWS($B$9:$B18))),\"0\")))","v":""}," ",{"$f":"IF($J18=\"\",\" \",(K18*$L$3/'manual inputs'!$C$17))","v":" "},{"$f":"IF($J$5=\"n/a\",\"\",IF(B18=\"\",\"\",IFERROR(INDEX('quantities report'!$D$2:$D$9877,SMALL(IF('quantities report'!$A$2:$A$9877=M$3,ROW('quantities report'!$A$2:$A$9877)-1,\"\"),ROWS($B$9:$B18))),\"0\")))","v":""}," ",{"$f":"IF($M18=\"\",\" \",(N18*$O$3/'manual inputs'!$C$17))","v":" "},"",{"$f":"IF($Q$5=\"n/a\",\"\",IF(B18=\"\",\"\",IFERROR(INDEX('quantities report'!$D$2:$D$9877,SMALL(IF('quantities report'!$A$2:$A$9877=Q$3,ROW('quantities report'!$A$2:$A$9877)-1,\"\"),ROWS($B$9:$B18))),\"0\")))","v":""}," ",{"$f":"IF($Q18=\"\",\" \",(R18*$S$3/'manual inputs'!$C$17))","v":" "},{"$f":"IF($Q$5=\"n/a\",\"\",IF(I18=\"\",\"\",IFERROR(INDEX('quantities report'!$D$2:$D$9877,SMALL(IF('quantities report'!$A$2:$A$9877=T$3,ROW('quantities report'!$A$2:$A$9877)-1,\"\"),ROWS($B$9:$B18))),\"0\")))","v":""}," ",{"$f":"IF($T18=\"\",\" \",(U18*$V$3/'manual inputs'!$C$17))","v":" "},"",{"$f":"IF($X$5=\"n/a\",\"\",IF(B18=\"\",\"\",IFERROR(INDEX('quantities report'!$D$2:$D$9877,SMALL(IF('quantities report'!$A$2:$A$9877=X$3,ROW('quantities report'!$A$2:$A$9877)-1,\"\"),ROWS($B$9:$B18))),\"0\")))","v":""}," ",{"$f":"IF($X18=\"\",\" \",(Y18*$Z$3/'manual inputs'!$C$17))","v":" "},{"$f":"IF($X$5=\"n/a\",\"\",IF(B18=\"\",\"\",IFERROR(INDEX('quantities report'!$D$2:$D$9877,SMALL(IF('quantities report'!$A$2:$A$9877=AA$3,ROW('quantities report'!$A$2:$A$9877)-1,\"\"),ROWS($B$9:$B18))),\"0\")))","v":""}," ",{"$f":"IF($AA18=\"\",\" \",(AB18*$AC$3/'manual inputs'!$C$17))","v":" "},"",{"$f":"IF($AE$5=\"n/a\",\"\",IF(B18=\"\",\"\",IFERROR(INDEX('quantities report'!$D$2:$D$9877,SMALL(IF('quantities report'!$A$2:$A$9877=AE$3,ROW('quantities report'!$A$2:$A$9877)-1,\"\"),ROWS($B$9:$B18))),\"0\")))","v":""}," ",{"$f":"IF($AE18=\"\",\" \",(AF18*$AG$3/'manual inputs'!$C$17))","v":" "},{"$f":"IF($AE$5=\"n/a\",\"\",IF(B18=\"\",\"\",IFERROR(INDEX('quantities report'!$D$2:$D$9877,SMALL(IF('quantities report'!$A$2:$A$9877=AH$3,ROW('quantities report'!$A$2:$A$9877)-1,\"\"),ROWS($B$9:$B18))),\"0\")))","v":""}," ",{"$f":"IF($AE18=\"\",\" \",(AI18*$AJ$3/'manual inputs'!$C$17))","v":" "},""," "," ",{"$f":"IF(B18=\"\",\"\",(AM18*'manual inputs'!$C$6))","v":""},{"$f":"IF($B18=\"\",\"\",(((($AM18*'manual inputs'!$C$17/Surfacing!$E$3)/('manual inputs'!$D$23/12))/9)*$AO$3)/'manual inputs'!$C$16)","v":""},{"$f":"IF($B18=\"\",\"\",(((($AM18*'manual inputs'!$C$17/Surfacing!$E$3)/('manual inputs'!$D$23/12))/9)))","v":""},{"$f":"IF($B18=\"\",\"\",((((($AM18*'manual inputs'!$C$17/Surfacing!$E$3)/('manual inputs'!$D$23/12))/9)*$AQ$3)/'manual inputs'!$C$17)*'manual inputs'!$C$12)","v":""},{"$f":"IF($B18=\"\",\"\",(((($AM18*'manual inputs'!$C$17/Surfacing!$E$3)/('manual inputs'!$D$23/12))/9)*$AO$3)/'manual inputs'!$C$16)","v":""},{"$f":"IF($C$5=\"n/a\",\"\",IF(B18=\"\",\"\",IFERROR(INDEX('quantities report'!$D$2:$D$9877,SMALL(IF('quantities report'!$A$2:$A$9877=AS$3,ROW('quantities report'!$A$2:$A$9877)-1,\"\"),ROWS($B$9:$B18))),\"0\")))","v":""}," ",{"$f":"IF($C18=\"\",\" \",(AT18/('manual inputs'!$C$21/12)/9))","v":" "}]
[null,{"$f":"IFERROR(INDEX('manual inputs'!J:J,SMALL(IF('manual inputs'!J:J<>\"\",ROW('manual inputs'!J:J)),ROW('manual inputs'!13:13))),\"\")","v":""},{"$f":"IF($C$5=\"n/a\",\"\",IF(B19=\"\",\"\",IFERROR(INDEX('quantities report'!$D$2:$D$9877,SMALL(IF('quantities report'!$A$2:$A$9877=C$3,ROW('quantities report'!$A$2:$A$9877)-1,\"\"),ROWS($B$9:$B19))),\"0\")))","v":""}," ",{"$f":"IF($C19=\"\",\" \",(D19*$E$3/'manual inputs'!$C$17))","v":" "},{"$f":"IF($C$5=\"n/a\",\"\",IF(B19=\"\",\"\",IFERROR(INDEX('quantities report'!$D$2:$D$9877,SMALL(IF('quantities report'!$A$2:$A$9877=F$3,ROW('quantities report'!$A$2:$A$9877)-1,\"\"),ROWS($B$9:$B19))),\"0\")))","v":""}," ",{"$f":"IF($F19=\"\",\" \",(G19*$E$3/'manual inputs'!$C$17))","v":" "},"",{"$f":"IF($J$5=\"n/a\",\"\",IF(B19=\"\",\"\",IFERROR(INDEX('quantities report'!$D$2:$D$9877,SMALL(IF('quantities report'!$A$2:$A$9877=J$3,ROW('quantities report'!$A$2:$A$9877)-1,\"\"),ROWS($B$9:$B19))),\"0\")))","v":""}," ",{"$f":"IF($J19=\"\",\" \",(K19*$L$3/'manual inputs'!$C$17))","v":" "},{"$f":"IF($J$5=\"n/a\",\"\",IF(B19=\"\",\"\",IFERROR(INDEX('quantities report'!$D$2:$D$9877,SMALL(IF('quantities report'!$A$2:$A$9877=M$3,ROW('quantities report'!$A$2:$A$9877)-1,\"\"),ROWS($B$9:$B19))),\"0\")))","v":""}," ",{"$f":"IF($M19=\"\",\" \",(N19*$O$3/'manual inputs'!$C$17))","v":" "},"",{"$f":"IF($Q$5=\"n/a\",\"\",IF(B19=\"\",\"\",IFERROR(INDEX('quantities report'!$D$2:$D$9877,SMALL(IF('quantities report'!$A$2:$A$9877=Q$3,ROW('quantities report'!$A$2:$A$9877)-1,\"\"),ROWS($B$9:$B19))),\"0\")))","v":""}," ",{"$f":"IF($Q19=\"\",\" \",(R19*$S$3/'manual inputs'!$C$17))","v":" "},{"$f":"IF($Q$5=\"n/a\",\"\",IF(I19=\"\",\"\",IFERROR(INDEX('quantities report'!$D$2:$D$9877,SMALL(IF('quantities report'!$A$2:$A$9877=T$3,ROW('quantities report'!$A$2:$A$9877)-1,\"\"),ROWS($B$9:$B19))),\"0\")))","v":""}," ",{"$f":"IF($T19=\"\",\" \",(U19*$V$3/'manual inputs'!$C$17))","v":" "},"",{"$f":"IF($X$5=\"n/a\",\"\",IF(B19=\"\",\"\",IFERROR(INDEX('quantities report'!$D$2:$D$9877,SMALL(IF('quantities report'!$A$2:$A$9877=X$3,ROW('quantities report'!$A$2:$A$9877)-1,\"\"),ROWS($B$9:$B19))),\"0\")))","v":""}," ",{"$f":"IF($X19=\"\",\" \",(Y19*$Z$3/'manual inputs'!$C$17))","v":" "},{"$f":"IF($X$5=\"n/a\",\"\",IF(B19=\"\",\"\",IFERROR(INDEX('quantities report'!$D$2:$D$9877,SMALL(IF('quantities report'!$A$2:$A$9877=AA$3,ROW('quantities report'!$A$2:$A$9877)-1,\"\"),ROWS($B$9:$B19))),\"0\")))","v":""}," ",{"$f":"IF($AA19=\"\",\" \",(AB19*$AC$3/'manual inputs'!$C$17))","v":" "},"",{"$f":"IF($AE$5=\"n/a\",\"\",IF(B19=\"\",\"\",IFERROR(INDEX('quantities report'!$D$2:$D$9877,SMALL(IF('quantities report'!$A$2:$A$9877=AE$3,ROW('quantities report'!$A$2:$A$9877)-1,\"\"),ROWS($B$9:$B19))),\"0\")))","v":""}," ",{"$f":"IF($AE19=\"\",\" \",(AF19*$AG$3/'manual inputs'!$C$17))","v":" "},{"$f":"IF($AE$5=\"n/a\",\"\",IF(B19=\"\",\"\",IFERROR(INDEX('quantities report'!$D$2:$D$9877,SMALL(IF('quantities report'!$A$2:$A$9877=AH$3,ROW('quantities report'!$A$2:$A$9877)-1,\"\"),ROWS($B$9:$B19))),\"0\")))","v":""}," ",{"$f":"IF($AE19=\"\",\" \",(AI19*$AJ$3/'manual inputs'!$C$17))","v":" "},""," "," ",{"$f":"IF(B19=\"\",\"\",(AM19*'manual inputs'!$C$6))","v":""},{"$f":"IF($B19=\"\",\"\",(((($AM19*'manual inputs'!$C$17/Surfacing!$E$3)/('manual inputs'!$D$23/12))/9)*$AO$3)/'manual inputs'!$C$16)","v":""},{"$f":"IF($B19=\"\",\"\",(((($AM19*'manual inputs'!$C$17/Surfacing!$E$3)/('manual inputs'!$D$23/12))/9)))","v":""},{"$f":"IF($B19=\"\",\"\",((((($AM19*'manual inputs'!$C$17/Surfacing!$E$3)/('manual inputs'!$D$23/12))/9)*$AQ$3)/'manual inputs'!$C$17)*'manual inputs'!$C$12)","v":""},{"$f":"IF($B19=\"\",\"\",(((($AM19*'manual inputs'!$C$17/Surfacing!$E$3)/('manual inputs'!$D$23/12))/9)*$AO$3)/'manual inputs'!$C$16)","v":""},{"$f":"IF($C$5=\"n/a\",\"\",IF(B19=\"\",\"\",IFERROR(INDEX('quantities report'!$D$2:$D$9877,SMALL(IF('quantities report'!$A$2:$A$9877=AS$3,ROW('quantities report'!$A$2:$A$9877)-1,\"\"),ROWS($B$9:$B19))),\"0\")))","v":""}," ",{"$f":"IF($C19=\"\",\" \",(AT19/('manual inputs'!$C$21/12)/9))","v":" "}]
[null,{"$f":"IFERROR(INDEX('manual inputs'!J:J,SMALL(IF('manual inputs'!J:J<>\"\",ROW('manual inputs'!J:J)),ROW('manual inputs'!14:14))),\"\")","v":""},{"$f":"IF($C$5=\"n/a\",\"\",IF(B20=\"\",\"\",IFERROR(INDEX('quantities report'!$D$2:$D$9877,SMALL(IF('quantities report'!$A$2:$A$9877=C$3,ROW('quantities report'!$A$2:$A$9877)-1,\"\"),ROWS($B$9:$B20))),\"0\")))","v":""}," ",{"$f":"IF($C20=\"\",\" \",(D20*$E$3/'manual inputs'!$C$17))","v":" "},{"$f":"IF($C$5=\"n/a\",\"\",IF(B20=\"\",\"\",IFERROR(INDEX('quantities report'!$D$2:$D$9877,SMALL(IF('quantities report'!$A$2:$A$9877=F$3,ROW('quantities report'!$A$2:$A$9877)-1,\"\"),ROWS($B$9:$B20))),\"0\")))","v":""}," ",{"$f":"IF($F20=\"\",\" \",(G20*$E$3/'manual inputs'!$C$17))","v":" "},"",{"$f":"IF($J$5=\"n/a\",\"\",IF(B20=\"\",\"\",IFERROR(INDEX('quantities report'!$D$2:$D$9877,SMALL(IF('quantities report'!$A$2:$A$9877=J$3,ROW('quantities report'!$A$2:$A$9877)-1,\"\"),ROWS($B$9:$B20))),\"0\")))","v":""}," ",{"$f":"IF($J20=\"\",\" \",(K20*$L$3/'manual inputs'!$C$17))","v":" "},{"$f":"IF($J$5=\"n/a\",\"\",IF(B20=\"\",\"\",IFERROR(INDEX('quantities report'!$D$2:$D$9877,SMALL(IF('quantities report'!$A$2:$A$9877=M$3,ROW('quantities report'!$A$2:$A$9877)-1,\"\"),ROWS($B$9:$B20))),\"0\")))","v":""}," ",{"$f":"IF($M20=\"\",\" \",(N20*$O$3/'manual inputs'!$C$17))","v":" "},"",{"$f":"IF($Q$5=\"n/a\",\"\",IF(B20=\"\",\"\",IFERROR(INDEX('quantities report'!$D$2:$D$9877,SMALL(IF('quantities report'!$A$2:$A$9877=Q$3,ROW('quantities report'!$A$2:$A$9877)-1,\"\"),ROWS($B$9:$B20))),\"0\")))","v":""}," ",{"$f":"IF($Q20=\"\",\" \",(R20*$S$3/'manual inputs'!$C$17))","v":" "},{"$f":"IF($Q$5=\"n/a\",\"\",IF(I20=\"\",\"\",IFERROR(INDEX('quantities report'!$D$2:$D$9877,SMALL(IF('quantities report'!$A$2:$A$9877=T$3,ROW('quantities report'!$A$2:$A$9877)-1,\"\"),ROWS($B$9:$B20))),\"0\")))","v":""}," ",{"$f":"IF($T20=\"\",\" \",(U20*$V$3/'manual inputs'!$C$17))","v":" "},"",{"$f":"IF($X$5=\"n/a\",\"\",IF(B20=\"\",\"\",IFERROR(INDEX('quantities report'!$D$2:$D$9877,SMALL(IF('quantities report'!$A$2:$A$9877=X$3,ROW('quantities report'!$A$2:$A$9877)-1,\"\"),ROWS($B$9:$B20))),\"0\")))","v":""}," ",{"$f":"IF($X20=\"\",\" \",(Y20*$Z$3/'manual inputs'!$C$17))","v":" "},{"$f":"IF($X$5=\"n/a\",\"\",IF(B20=\"\",\"\",IFERROR(INDEX('quantities report'!$D$2:$D$9877,SMALL(IF('quantities report'!$A$2:$A$9877=AA$3,ROW('quantities report'!$A$2:$A$9877)-1,\"\"),ROWS($B$9:$B20))),\"0\")))","v":""}," ",{"$f":"IF($AA20=\"\",\" \",(AB20*$AC$3/'manual inputs'!$C$17))","v":" "},"",{"$f":"IF($AE$5=\"n/a\",\"\",IF(B20=\"\",\"\",IFERROR(INDEX('quantities report'!$D$2:$D$9877,SMALL(IF('quantities report'!$A$2:$A$9877=AE$3,ROW('quantities report'!$A$2:$A$9877)-1,\"\"),ROWS($B$9:$B20))),\"0\")))","v":""}," ",{"$f":"IF($AE20=\"\",\" \",(AF20*$AG$3/'manual inputs'!$C$17))","v":" "},{"$f":"IF($AE$5=\"n/a\",\"\",IF(B20=\"\",\"\",IFERROR(INDEX('quantities report'!$D$2:$D$9877,SMALL(IF('quantities report'!$A$2:$A$9877=AH$3,ROW('quantities report'!$A$2:$A$9877)-1,\"\"),ROWS($B$9:$B20))),\"0\")))","v":""}," ",{"$f":"IF($AE20=\"\",\" \",(AI20*$AJ$3/'manual inputs'!$C$17))","v":" "},""," "," ",{"$f":"IF(B20=\"\",\"\",(AM20*'manual inputs'!$C$6))","v":""},{"$f":"IF($B20=\"\",\"\",(((($AM20*'manual inputs'!$C$17/Surfacing!$E$3)/('manual inputs'!$D$23/12))/9)*$AO$3)/'manual inputs'!$C$16)","v":""},{"$f":"IF($B20=\"\",\"\",(((($AM20*'manual inputs'!$C$17/Surfacing!$E$3)/('manual inputs'!$D$23/12))/9)))","v":""},{"$f":"IF($B20=\"\",\"\",((((($AM20*'manual inputs'!$C$17/Surfacing!$E$3)/('manual inputs'!$D$23/12))/9)*$AQ$3)/'manual inputs'!$C$17)*'manual inputs'!$C$12)","v":""},{"$f":"IF($B20=\"\",\"\",(((($AM20*'manual inputs'!$C$17/Surfacing!$E$3)/('manual inputs'!$D$23/12))/9)*$AO$3)/'manual inputs'!$C$16)","v":""},{"$f":"IF($C$5=\"n/a\",\"\",IF(B20=\"\",\"\",IFERROR(INDEX('quantities report'!$D$2:$D$9877,SMALL(IF('quantities report'!$A$2:$A$9877=AS$3,ROW('quantities report'!$A$2:$A$9877)-1,\"\"),ROWS($B$9:$B20))),\"0\")))","v":""}," ",{"$f":"IF($C20=\"\",\" \",(AT20/('manual inputs'!$C$21/12)/9))","v":" "}]
[null,{"$f":"IFERROR(INDEX('manual inputs'!J:J,SMALL(IF('manual inputs'!J:J<>\"\",ROW('manual inputs'!J:J)),ROW('manual inputs'!15:15))),\"\")","v":""},{"$f":"IF($C$5=\"n/a\",\"\",IF(B21=\"\",\"\",IFERROR(INDEX('quantities report'!$D$2:$D$9877,SMALL(IF('quantities report'!$A$2:$A$9877=C$3,ROW('quantities report'!$A$2:$A$9877)-1,\"\"),ROWS($B$9:$B21))),\"0\")))","v":""}," ",{"$f":"IF($C21=\"\",\" \",(D21*$E$3/'manual inputs'!$C$17))","v":" "},{"$f":"IF($C$5=\"n/a\",\"\",IF(B21=\"\",\"\",IFERROR(INDEX('quantities report'!$D$2:$D$9877,SMALL(IF('quantities report'!$A$2:$A$9877=F$3,ROW('quantities report'!$A$2:$A$9877)-1,\"\"),ROWS($B$9:$B21))),\"0\")))","v":""}," ",{"$f":"IF($F21=\"\",\" \",(G21*$E$3/'manual inputs'!$C$17))","v":" "},"",{"$f":"IF($J$5=\"n/a\",\"\",IF(B21=\"\",\"\",IFERROR(INDEX('quantities report'!$D$2:$D$9877,SMALL(IF('quantities report'!$A$2:$A$9877=J$3,ROW('quantities report'!$A$2:$A$9877)-1,\"\"),ROWS($B$9:$B21))),\"0\")))","v":""}," ",{"$f":"IF($J21=\"\",\" \",(K21*$L$3/'manual inputs'!$C$17))","v":" "},{"$f":"IF($J$5=\"n/a\",\"\",IF(B21=\"\",\"\",IFERROR(INDEX('quantities report'!$D$2:$D$9877,SMALL(IF('quantities report'!$A$2:$A$9877=M$3,ROW('quantities report'!$A$2:$A$9877)-1,\"\"),ROWS($B$9:$B21))),\"0\")))","v":""}," ",{"$f":"IF($M21=\"\",\" \",(N21*$O$3/'manual inputs'!$C$17))","v":" "},"",{"$f":"IF($Q$5=\"n/a\",\"\",IF(B21=\"\",\"\",IFERROR(INDEX('quantities report'!$D$2:$D$9877,SMALL(IF('quantities report'!$A$2:$A$9877=Q$3,ROW('quantities report'!$A$2:$A$9877)-1,\"\"),ROWS($B$9:$B21))),\"0\")))","v":""}," ",{"$f":"IF($Q21=\"\",\" \",(R21*$S$3/'manual inputs'!$C$17))","v":" "},{"$f":"IF($Q$5=\"n/a\",\"\",IF(I21=\"\",\"\",IFERROR(INDEX('quantities report'!$D$2:$D$9877,SMALL(IF('quantities report'!$A$2:$A$9877=T$3,ROW('quantities report'!$A$2:$A$9877)-1,\"\"),ROWS($B$9:$B21))),\"0\")))","v":""}," ",{"$f":"IF($T21=\"\",\" \",(U21*$V$3/'manual inputs'!$C$17))","v":" "},"",{"$f":"IF($X$5=\"n/a\",\"\",IF(B21=\"\",\"\",IFERROR(INDEX('quantities report'!$D$2:$D$9877,SMALL(IF('quantities report'!$A$2:$A$9877=X$3,ROW('quantities report'!$A$2:$A$9877)-1,\"\"),ROWS($B$9:$B21))),\"0\")))","v":""}," ",{"$f":"IF($X21=\"\",\" \",(Y21*$Z$3/'manual inputs'!$C$17))","v":" "},{"$f":"IF($X$5=\"n/a\",\"\",IF(B21=\"\",\"\",IFERROR(INDEX('quantities report'!$D$2:$D$9877,SMALL(IF('quantities report'!$A$2:$A$9877=AA$3,ROW('quantities report'!$A$2:$A$9877)-1,\"\"),ROWS($B$9:$B21))),\"0\")))","v":""}," ",{"$f":"IF($AA21=\"\",\" \",(AB21*$AC$3/'manual inputs'!$C$17))","v":" "},"",{"$f":"IF($AE$5=\"n/a\",\"\",IF(B21=\"\",\"\",IFERROR(INDEX('quantities report'!$D$2:$D$9877,SMALL(IF('quantities report'!$A$2:$A$9877=AE$3,ROW('quantities report'!$A$2:$A$9877)-1,\"\"),ROWS($B$9:$B21))),\"0\")))","v":""}," ",{"$f":"IF($AE21=\"\",\" \",(AF21*$AG$3/'manual inputs'!$C$17))","v":" "},{"$f":"IF($AE$5=\"n/a\",\"\",IF(B21=\"\",\"\",IFERROR(INDEX('quantities report'!$D$2:$D$9877,SMALL(IF('quantities report'!$A$2:$A$9877=AH$3,ROW('quantities report'!$A$2:$A$9877)-1,\"\"),ROWS($B$9:$B21))),\"0\")))","v":""}," ",{"$f":"IF($AE21=\"\",\" \",(AI21*$AJ$3/'manual inputs'!$C$17))","v":" "},""," "," ",{"$f":"IF(B21=\"\",\"\",(AM21*'manual inputs'!$C$6))","v":""},{"$f":"IF($B21=\"\",\"\",(((($AM21*'manual inputs'!$C$17/Surfacing!$E$3)/('manual inputs'!$D$23/12))/9)*$AO$3)/'manual inputs'!$C$16)","v":""},{"$f":"IF($B21=\"\",\"\",(((($AM21*'manual inputs'!$C$17/Surfacing!$E$3)/('manual inputs'!$D$23/12))/9)))","v":""},{"$f":"IF($B21=\"\",\"\",((((($AM21*'manual inputs'!$C$17/Surfacing!$E$3)/('manual inputs'!$D$23/12))/9)*$AQ$3)/'manual inputs'!$C$17)*'manual inputs'!$C$12)","v":""},{"$f":"IF($B21=\"\",\"\",(((($AM21*'manual inputs'!$C$17/Surfacing!$E$3)/('manual inputs'!$D$23/12))/9)*$AO$3)/'manual inputs'!$C$16)","v":""},{"$f":"IF($C$5=\"n/a\",\"\",IF(B21=\"\",\"\",IFERROR(INDEX('quantities report'!$D$2:$D$9877,SMALL(IF('quantities report'!$A$2:$A$9877=AS$3,ROW('quantities report'!$A$2:$A$9877)-1,\"\"),ROWS($B$9:$B21))),\"0\")))","v":""}," ",{"$f":"IF($C21=\"\",\" \",(AT21/('manual inputs'!$C$21/12)/9))","v":" "}]
[null,{"$f":"IFERROR(INDEX('manual inputs'!J:J,SMALL(IF('manual inputs'!J:J<>\"\",ROW('manual inputs'!J:J)),ROW('manual inputs'!16:16))),\"\")","v":""},{"$f":"IF($C$5=\"n/a\",\"\",IF(B22=\"\",\"\",IFERROR(INDEX('quantities report'!$D$2:$D$9877,SMALL(IF('quantities report'!$A$2:$A$9877=C$3,ROW('quantities report'!$A$2:$A$9877)-1,\"\"),ROWS($B$9:$B22))),\"0\")))","v":""}," ",{"$f":"IF($C22=\"\",\" \",(D22*$E$3/'manual inputs'!$C$17))","v":" "},{"$f":"IF($C$5=\"n/a\",\"\",IF(B22=\"\",\"\",IFERROR(INDEX('quantities report'!$D$2:$D$9877,SMALL(IF('quantities report'!$A$2:$A$9877=F$3,ROW('quantities report'!$A$2:$A$9877)-1,\"\"),ROWS($B$9:$B22))),\"0\")))","v":""}," ",{"$f":"IF($F22=\"\",\" \",(G22*$E$3/'manual inputs'!$C$17))","v":" "},"",{"$f":"IF($J$5=\"n/a\",\"\",IF(B22=\"\",\"\",IFERROR(INDEX('quantities report'!$D$2:$D$9877,SMALL(IF('quantities report'!$A$2:$A$9877=J$3,ROW('quantities report'!$A$2:$A$9877)-1,\"\"),ROWS($B$9:$B22))),\"0\")))","v":""}," ",{"$f":"IF($J22=\"\",\" \",(K22*$L$3/'manual inputs'!$C$17))","v":" "},{"$f":"IF($J$5=\"n/a\",\"\",IF(B22=\"\",\"\",IFERROR(INDEX('quantities report'!$D$2:$D$9877,SMALL(IF('quantities report'!$A$2:$A$9877=M$3,ROW('quantities report'!$A$2:$A$9877)-1,\"\"),ROWS($B$9:$B22))),\"0\")))","v":""}," ",{"$f":"IF($M22=\"\",\" \",(N22*$O$3/'manual inputs'!$C$17))","v":" "},"",{"$f":"IF($Q$5=\"n/a\",\"\",IF(B22=\"\",\"\",IFERROR(INDEX('quantities report'!$D$2:$D$9877,SMALL(IF('quantities report'!$A$2:$A$9877=Q$3,ROW('quantities report'!$A$2:$A$9877)-1,\"\"),ROWS($B$9:$B22))),\"0\")))","v":""}," ",{"$f":"IF($Q22=\"\",\" \",(R22*$S$3/'manual inputs'!$C$17))","v":" "},{"$f":"IF($Q$5=\"n/a\",\"\",IF(I22=\"\",\"\",IFERROR(INDEX('quantities report'!$D$2:$D$9877,SMALL(IF('quantities report'!$A$2:$A$9877=T$3,ROW('quantities report'!$A$2:$A$9877)-1,\"\"),ROWS($B$9:$B22))),\"0\")))","v":""}," ",{"$f":"IF($T22=\"\",\" \",(U22*$V$3/'manual inputs'!$C$17))","v":" "},"",{"$f":"IF($X$5=\"n/a\",\"\",IF(B22=\"\",\"\",IFERROR(INDEX('quantities report'!$D$2:$D$9877,SMALL(IF('quantities report'!$A$2:$A$9877=X$3,ROW('quantities report'!$A$2:$A$9877)-1,\"\"),ROWS($B$9:$B22))),\"0\")))","v":""}," ",{"$f":"IF($X22=\"\",\" \",(Y22*$Z$3/'manual inputs'!$C$17))","v":" "},{"$f":"IF($X$5=\"n/a\",\"\",IF(B22=\"\",\"\",IFERROR(INDEX('quantities report'!$D$2:$D$9877,SMALL(IF('quantities report'!$A$2:$A$9877=AA$3,ROW('quantities report'!$A$2:$A$9877)-1,\"\"),ROWS($B$9:$B22))),\"0\")))","v":""}," ",{"$f":"IF($AA22=\"\",\" \",(AB22*$AC$3/'manual inputs'!$C$17))","v":" "},"",{"$f":"IF($AE$5=\"n/a\",\"\",IF(B22=\"\",\"\",IFERROR(INDEX('quantities report'!$D$2:$D$9877,SMALL(IF('quantities report'!$A$2:$A$9877=AE$3,ROW('quantities report'!$A$2:$A$9877)-1,\"\"),ROWS($B$9:$B22))),\"0\")))","v":""}," ",{"$f":"IF($AE22=\"\",\" \",(AF22*$AG$3/'manual inputs'!$C$17))","v":" "},{"$f":"IF($AE$5=\"n/a\",\"\",IF(B22=\"\",\"\",IFERROR(INDEX('quantities report'!$D$2:$D$9877,SMALL(IF('quantities report'!$A$2:$A$9877=AH$3,ROW('quantities report'!$A$2:$A$9877)-1,\"\"),ROWS($B$9:$B22))),\"0\")))","v":""}," ",{"$f":"IF($AE22=\"\",\" \",(AI22*$AJ$3/'manual inputs'!$C$17))","v":" "},""," "," ",{"$f":"IF(B22=\"\",\"\",(AM22*'manual inputs'!$C$6))","v":""},{"$f":"IF($B22=\"\",\"\",(((($AM22*'manual inputs'!$C$17/Surfacing!$E$3)/('manual inputs'!$D$23/12))/9)*$AO$3)/'manual inputs'!$C$16)","v":""},{"$f":"IF($B22=\"\",\"\",(((($AM22*'manual inputs'!$C$17/Surfacing!$E$3)/('manual inputs'!$D$23/12))/9)))","v":""},{"$f":"IF($B22=\"\",\"\",((((($AM22*'manual inputs'!$C$17/Surfacing!$E$3)/('manual inputs'!$D$23/12))/9)*$AQ$3)/'manual inputs'!$C$17)*'manual inputs'!$C$12)","v":""},{"$f":"IF($B22=\"\",\"\",(((($AM22*'manual inputs'!$C$17/Surfacing!$E$3)/('manual inputs'!$D$23/12))/9)*$AO$3)/'manual inputs'!$C$16)","v":""},{"$f":"IF($C$5=\"n/a\",\"\",IF(B22=\"\",\"\",IFERROR(INDEX('quantities report'!$D$2:$D$9877,SMALL(IF('quantities report'!$A$2:$A$9877=AS$3,ROW('quantities report'!$A$2:$A$9877)-1,\"\"),ROWS($B$9:$B22))),\"0\")))","v":""}," ",{"$f":"IF($C22=\"\",\" \",(AT22/('manual inputs'!$C$21/12)/9))","v":" "}]
[null,{"$f":"IFERROR(INDEX('manual inputs'!J:J,SMALL(IF('manual inputs'!J:J<>\"\",ROW('manual inputs'!J:J)),ROW('manual inputs'!17:17))),\"\")","v":""},{"$f":"IF($C$5=\"n/a\",\"\",IF(B23=\"\",\"\",IFERROR(INDEX('quantities report'!$D$2:$D$9877,SMALL(IF('quantities report'!$A$2:$A$9877=C$3,ROW('quantities report'!$A$2:$A$9877)-1,\"\"),ROWS($B$9:$B23))),\"0\")))","v":""}," ",{"$f":"IF($C23=\"\",\" \",(D23*$E$3/'manual inputs'!$C$17))","v":" "},{"$f":"IF($C$5=\"n/a\",\"\",IF(B23=\"\",\"\",IFERROR(INDEX('quantities report'!$D$2:$D$9877,SMALL(IF('quantities report'!$A$2:$A$9877=F$3,ROW('quantities report'!$A$2:$A$9877)-1,\"\"),ROWS($B$9:$B23))),\"0\")))","v":""},{"$f":"IF($F23=\"\",\" \",(F23*27))","v":" "},{"$f":"IF($F23=\"\",\" \",(G23*$E$3/'manual inputs'!$C$17))","v":" "},"",{"$f":"IF($J$5=\"n/a\",\"\",IF(B23=\"\",\"\",IFERROR(INDEX('quantities report'!$D$2:$D$9877,SMALL(IF('quantities report'!$A$2:$A$9877=J$3,ROW('quantities report'!$A$2:$A$9877)-1,\"\"),ROWS($B$9:$B23))),\"0\")))","v":""}," ",{"$f":"IF($J23=\"\",\" \",(K23*$L$3/'manual inputs'!$C$17))","v":" "},{"$f":"IF($J$5=\"n/a\",\"\",IF(B23=\"\",\"\",IFERROR(INDEX('quantities report'!$D$2:$D$9877,SMALL(IF('quantities report'!$A$2:$A$9877=M$3,ROW('quantities report'!$A$2:$A$9877)-1,\"\"),ROWS($B$9:$B23))),\"0\")))","v":""}," ",{"$f":"IF($M23=\"\",\" \",(N23*$O$3/'manual inputs'!$C$17))","v":" "},"",{"$f":"IF($Q$5=\"n/a\",\"\",IF(B23=\"\",\"\",IFERROR(INDEX('quantities report'!$D$2:$D$9877,SMALL(IF('quantities report'!$A$2:$A$9877=Q$3,ROW('quantities report'!$A$2:$A$9877)-1,\"\"),ROWS($B$9:$B23))),\"0\")))","v":""}," ",{"$f":"IF($Q23=\"\",\" \",(R23*$S$3/'manual inputs'!$C$17))","v":" "},{"$f":"IF($Q$5=\"n/a\",\"\",IF(I23=\"\",\"\",IFERROR(INDEX('quantities report'!$D$2:$D$9877,SMALL(IF('quantities report'!$A$2:$A$9877=T$3,ROW('quantities report'!$A$2:$A$9877)-1,\"\"),ROWS($B$9:$B23))),\"0\")))","v":""}," ",{"$f":"IF($T23=\"\",\" \",(U23*$V$3/'manual inputs'!$C$17))","v":" "},"",{"$f":"IF($X$5=\"n/a\",\"\",IF(B23=\"\",\"\",IFERROR(INDEX('quantities report'!$D$2:$D$9877,SMALL(IF('quantities report'!$A$2:$A$9877=X$3,ROW('quantities report'!$A$2:$A$9877)-1,\"\"),ROWS($B$9:$B23))),\"0\")))","v":""}," ",{"$f":"IF($X23=\"\",\" \",(Y23*$Z$3/'manual inputs'!$C$17))","v":" "},{"$f":"IF($X$5=\"n/a\",\"\",IF(B23=\"\",\"\",IFERROR(INDEX('quantities report'!$D$2:$D$9877,SMALL(IF('quantities report'!$A$2:$A$9877=AA$3,ROW('quantities report'!$A$2:$A$9877)-1,\"\"),ROWS($B$9:$B23))),\"0\")))","v":""}," ",{"$f":"IF($AA23=\"\",\" \",(AB23*$AC$3/'manual inputs'!$C$17))","v":" "},"",{"$f":"IF($AE$5=\"n/a\",\"\",IF(B23=\"\",\"\",IFERROR(INDEX('quantities report'!$D$2:$D$9877,SMALL(IF('quantities report'!$A$2:$A$9877=AE$3,ROW('quantities report'!$A$2:$A$9877)-1,\"\"),ROWS($B$9:$B23))),\"0\")))","v":""}," ",{"$f":"IF($AE23=\"\",\" \",(AF23*$AG$3/'manual inputs'!$C$17))","v":" "},{"$f":"IF($AE$5=\"n/a\",\"\",IF(B23=\"\",\"\",IFERROR(INDEX('quantities report'!$D$2:$D$9877,SMALL(IF('quantities report'!$A$2:$A$9877=AH$3,ROW('quantities report'!$A$2:$A$9877)-1,\"\"),ROWS($B$9:$B23))),\"0\")))","v":""}," ",{"$f":"IF($AE23=\"\",\" \",(AI23*$AJ$3/'manual inputs'!$C$17))","v":" "},""," "," ",{"$f":"IF(B23=\"\",\"\",(AM23*'manual inputs'!$C$6))","v":""},{"$f":"IF($B23=\"\",\"\",(((($AM23*'manual inputs'!$C$17/Surfacing!$E$3)/('manual inputs'!$D$23/12))/9)*$AO$3)/'manual inputs'!$C$16)","v":""},{"$f":"IF($B23=\"\",\"\",(((($AM23*'manual inputs'!$C$17/Surfacing!$E$3)/('manual inputs'!$D$23/12))/9)))","v":""},{"$f":"IF($B23=\"\",\"\",((((($AM23*'manual inputs'!$C$17/Surfacing!$E$3)/('manual inputs'!$D$23/12))/9)*$AQ$3)/'manual inputs'!$C$17)*'manual inputs'!$C$12)","v":""},{"$f":"IF($B23=\"\",\"\",(((($AM23*'manual inputs'!$C$17/Surfacing!$E$3)/('manual inputs'!$D$23/12))/9)*$AO$3)/'manual inputs'!$C$16)","v":""},{"$f":"IF($C$5=\"n/a\",\"\",IF(B23=\"\",\"\",IFERROR(INDEX('quantities report'!$D$2:$D$9877,SMALL(IF('quantities report'!$A$2:$A$9877=AS$3,ROW('quantities report'!$A$2:$A$9877)-1,\"\"),ROWS($B$9:$B23))),\"0\")))","v":""}," ",{"$f":"IF($C23=\"\",\" \",(AT23/('manual inputs'!$C$21/12)/9))","v":" "}]
[null,{"$f":"IFERROR(INDEX('manual inputs'!J:J,SMALL(IF('manual inputs'!J:J<>\"\",ROW('manual inputs'!J:J)),ROW('manual inputs'!18:18))),\"\")","v":""},{"$f":"IF($C$5=\"n/a\",\"\",IF(B24=\"\",\"\",IFERROR(INDEX('quantities report'!$D$2:$D$9877,SMALL(IF('quantities report'!$A$2:$A$9877=C$3,ROW('quantities report'!$A$2:$A$9877)-1,\"\"),ROWS($B$9:$B24))),\"0\")))","v":""}," ",{"$f":"IF($C24=\"\",\" \",(D24*$E$3/'manual inputs'!$C$17))","v":" "},{"$f":"IF($C$5=\"n/a\",\"\",IF(B24=\"\",\"\",IFERROR(INDEX('quantities report'!$D$2:$D$9877,SMALL(IF('quantities report'!$A$2:$A$9877=F$3,ROW('quantities report'!$A$2:$A$9877)-1,\"\"),ROWS($B$9:$B24))),\"0\")))","v":""}," ",{"$f":"IF($F24=\"\",\" \",(G24*$E$3/'manual inputs'!$C$17))","v":" "},"",{"$f":"IF($J$5=\"n/a\",\"\",IF(B24=\"\",\"\",IFERROR(INDEX('quantities report'!$D$2:$D$9877,SMALL(IF('quantities report'!$A$2:$A$9877=J$3,ROW('quantities report'!$A$2:$A$9877)-1,\"\"),ROWS($B$9:$B24))),\"0\")))","v":""}," ",{"$f":"IF($J24=\"\",\" \",(K24*$L$3/'manual inputs'!$C$17))","v":" "},{"$f":"IF($J$5=\"n/a\",\"\",IF(B24=\"\",\"\",IFERROR(INDEX('quantities report'!$D$2:$D$9877,SMALL(IF('quantities report'!$A$2:$A$9877=M$3,ROW('quantities report'!$A$2:$A$9877)-1,\"\"),ROWS($B$9:$B24))),\"0\")))","v":""}," ",{"$f":"IF($M24=\"\",\" \",(N24*$O$3/'manual inputs'!$C$17))","v":" "},"",{"$f":"IF($Q$5=\"n/a\",\"\",IF(B24=\"\",\"\",IFERROR(INDEX('quantities report'!$D$2:$D$9877,SMALL(IF('quantities report'!$A$2:$A$9877=Q$3,ROW('quantities report'!$A$2:$A$9877)-1,\"\"),ROWS($B$9:$B24))),\"0\")))","v":""}," ",{"$f":"IF($Q24=\"\",\" \",(R24*$S$3/'manual inputs'!$C$17))","v":" "},{"$f":"IF($Q$5=\"n/a\",\"\",IF(I24=\"\",\"\",IFERROR(INDEX('quantities report'!$D$2:$D$9877,SMALL(IF('quantities report'!$A$2:$A$9877=T$3,ROW('quantities report'!$A$2:$A$9877)-1,\"\"),ROWS($B$9:$B24))),\"0\")))","v":""}," ",{"$f":"IF($T24=\"\",\" \",(U24*$V$3/'manual inputs'!$C$17))","v":" "},"",{"$f":"IF($X$5=\"n/a\",\"\",IF(B24=\"\",\"\",IFERROR(INDEX('quantities report'!$D$2:$D$9877,SMALL(IF('quantities report'!$A$2:$A$9877=X$3,ROW('quantities report'!$A$2:$A$9877)-1,\"\"),ROWS($B$9:$B24))),\"0\")))","v":""}," ",{"$f":"IF($X24=\"\",\" \",(Y24*$Z$3/'manual inputs'!$C$17))","v":" "},{"$f":"IF($X$5=\"n/a\",\"\",IF(B24=\"\",\"\",IFERROR(INDEX('quantities report'!$D$2:$D$9877,SMALL(IF('quantities report'!$A$2:$A$9877=AA$3,ROW('quantities report'!$A$2:$A$9877)-1,\"\"),ROWS($B$9:$B24))),\"0\")))","v":""}," ",{"$f":"IF($AA24=\"\",\" \",(AB24*$AC$3/'manual inputs'!$C$17))","v":" "},"",{"$f":"IF($AE$5=\"n/a\",\"\",IF(B24=\"\",\"\",IFERROR(INDEX('quantities report'!$D$2:$D$9877,SMALL(IF('quantities report'!$A$2:$A$9877=AE$3,ROW('quantities report'!$A$2:$A$9877)-1,\"\"),ROWS($B$9:$B24))),\"0\")))","v":""}," ",{"$f":"IF($AE24=\"\",\" \",(AF24*$AG$3/'manual inputs'!$C$17))","v":" "},{"$f":"IF($AE$5=\"n/a\",\"\",IF(B24=\"\",\"\",IFERROR(INDEX('quantities report'!$D$2:$D$9877,SMALL(IF('quantities report'!$A$2:$A$9877=AH$3,ROW('quantities report'!$A$2:$A$9877)-1,\"\"),ROWS($B$9:$B24))),\"0\")))","v":""}," ",{"$f":"IF($AE24=\"\",\" \",(AI24*$AJ$3/'manual inputs'!$C$17))","v":" "},""," "," ",{"$f":"IF(B24=\"\",\"\",(AM24*'manual inputs'!$C$6))","v":""},{"$f":"IF($B24=\"\",\"\",(((($AM24*'manual inputs'!$C$17/Surfacing!$E$3)/('manual inputs'!$D$23/12))/9)*$AO$3)/'manual inputs'!$C$16)","v":""},{"$f":"IF($B24=\"\",\"\",(((($AM24*'manual inputs'!$C$17/Surfacing!$E$3)/('manual inputs'!$D$23/12))/9)))","v":""},{"$f":"IF($B24=\"\",\"\",((((($AM24*'manual inputs'!$C$17/Surfacing!$E$3)/('manual inputs'!$D$23/12))/9)*$AQ$3)/'manual inputs'!$C$17)*'manual inputs'!$C$12)","v":""},{"$f":"IF($B24=\"\",\"\",(((($AM24*'manual inputs'!$C$17/Surfacing!$E$3)/('manual inputs'!$D$23/12))/9)*$AO$3)/'manual inputs'!$C$16)","v":""},{"$f":"IF($C$5=\"n/a\",\"\",IF(B24=\"\",\"\",IFERROR(INDEX('quantities report'!$D$2:$D$9877,SMALL(IF('quantities report'!$A$2:$A$9877=AS$3,ROW('quantities report'!$A$2:$A$9877)-1,\"\"),ROWS($B$9:$B24))),\"0\")))","v":""}," ",{"$f":"IF($C24=\"\",\" \",(AT24/('manual inputs'!$C$21/12)/9))","v":" "}]
[null,{"$f":"IFERROR(INDEX('manual inputs'!J:J,SMALL(IF('manual inputs'!J:J<>\"\",ROW('manual inputs'!J:J)),ROW('manual inputs'!19:19))),\"\")","v":""},{"$f":"IF($C$5=\"n/a\",\"\",IF(B25=\"\",\"\",IFERROR(INDEX('quantities report'!$D$2:$D$9877,SMALL(IF('quantities report'!$A$2:$A$9877=C$3,ROW('quantities report'!$A$2:$A$9877)-1,\"\"),ROWS($B$9:$B25))),\"0\")))","v":""}," ",{"$f":"IF($C25=\"\",\" \",(D25*$E$3/'manual inputs'!$C$17))","v":" "},{"$f":"IF($C$5=\"n/a\",\"\",IF(B25=\"\",\"\",IFERROR(INDEX('quantities report'!$D$2:$D$9877,SMALL(IF('quantities report'!$A$2:$A$9877=F$3,ROW('quantities report'!$A$2:$A$9877)-1,\"\"),ROWS($B$9:$B25))),\"0\")))","v":""}," ",{"$f":"IF($F25=\"\",\" \",(G25*$E$3/'manual inputs'!$C$17))","v":" "},"",{"$f":"IF($J$5=\"n/a\",\"\",IF(B25=\"\",\"\",IFERROR(INDEX('quantities report'!$D$2:$D$9877,SMALL(IF('quantities report'!$A$2:$A$9877=J$3,ROW('quantities report'!$A$2:$A$9877)-1,\"\"),ROWS($B$9:$B25))),\"0\")))","v":""}," ",{"$f":"IF($J25=\"\",\" \",(K25*$L$3/'manual inputs'!$C$17))","v":" "},{"$f":"IF($J$5=\"n/a\",\"\",IF(B25=\"\",\"\",IFERROR(INDEX('quantities report'!$D$2:$D$9877,SMALL(IF('quantities report'!$A$2:$A$9877=M$3,ROW('quantities report'!$A$2:$A$9877)-1,\"\"),ROWS($B$9:$B25))),\"0\")))","v":""}," ",{"$f":"IF($M25=\"\",\" \",(N25*$O$3/'manual inputs'!$C$17))","v":" "},"",{"$f":"IF($Q$5=\"n/a\",\"\",IF(B25=\"\",\"\",IFERROR(INDEX('quantities report'!$D$2:$D$9877,SMALL(IF('quantities report'!$A$2:$A$9877=Q$3,ROW('quantities report'!$A$2:$A$9877)-1,\"\"),ROWS($B$9:$B25))),\"0\")))","v":""}," ",{"$f":"IF($Q25=\"\",\" \",(R25*$S$3/'manual inputs'!$C$17))","v":" "},{"$f":"IF($Q$5=\"n/a\",\"\",IF(I25=\"\",\"\",IFERROR(INDEX('quantities report'!$D$2:$D$9877,SMALL(IF('quantities report'!$A$2:$A$9877=T$3,ROW('quantities report'!$A$2:$A$9877)-1,\"\"),ROWS($B$9:$B25))),\"0\")))","v":""}," ",{"$f":"IF($T25=\"\",\" \",(U25*$V$3/'manual inputs'!$C$17))","v":" "},"",{"$f":"IF($X$5=\"n/a\",\"\",IF(B25=\"\",\"\",IFERROR(INDEX('quantities report'!$D$2:$D$9877,SMALL(IF('quantities report'!$A$2:$A$9877=X$3,ROW('quantities report'!$A$2:$A$9877)-1,\"\"),ROWS($B$9:$B25))),\"0\")))","v":""}," ",{"$f":"IF($X25=\"\",\" \",(Y25*$Z$3/'manual inputs'!$C$17))","v":" "},{"$f":"IF($X$5=\"n/a\",\"\",IF(B25=\"\",\"\",IFERROR(INDEX('quantities report'!$D$2:$D$9877,SMALL(IF('quantities report'!$A$2:$A$9877=AA$3,ROW('quantities report'!$A$2:$A$9877)-1,\"\"),ROWS($B$9:$B25))),\"0\")))","v":""}," ",{"$f":"IF($AA25=\"\",\" \",(AB25*$AC$3/'manual inputs'!$C$17))","v":" "},"",{"$f":"IF($AE$5=\"n/a\",\"\",IF(B25=\"\",\"\",IFERROR(INDEX('quantities report'!$D$2:$D$9877,SMALL(IF('quantities report'!$A$2:$A$9877=AE$3,ROW('quantities report'!$A$2:$A$9877)-1,\"\"),ROWS($B$9:$B25))),\"0\")))","v":""}," ",{"$f":"IF($AE25=\"\",\" \",(AF25*$AG$3/'manual inputs'!$C$17))","v":" "},{"$f":"IF($AE$5=\"n/a\",\"\",IF(B25=\"\",\"\",IFERROR(INDEX('quantities report'!$D$2:$D$9877,SMALL(IF('quantities report'!$A$2:$A$9877=AH$3,ROW('quantities report'!$A$2:$A$9877)-1,\"\"),ROWS($B$9:$B25))),\"0\")))","v":""}," ",{"$f":"IF($AE25=\"\",\" \",(AI25*$AJ$3/'manual inputs'!$C$17))","v":" "},""," "," ",{"$f":"IF(B25=\"\",\"\",(AM25*'manual inputs'!$C$6))","v":""},{"$f":"IF($B25=\"\",\"\",(((($AM25*'manual inputs'!$C$17/Surfacing!$E$3)/('manual inputs'!$D$23/12))/9)*$AO$3)/'manual inputs'!$C$16)","v":""},{"$f":"IF($B25=\"\",\"\",(((($AM25*'manual inputs'!$C$17/Surfacing!$E$3)/('manual inputs'!$D$23/12))/9)))","v":""},{"$f":"IF($B25=\"\",\"\",((((($AM25*'manual inputs'!$C$17/Surfacing!$E$3)/('manual inputs'!$D$23/12))/9)*$AQ$3)/'manual inputs'!$C$17)*'manual inputs'!$C$12)","v":""},{"$f":"IF($B25=\"\",\"\",(((($AM25*'manual inputs'!$C$17/Surfacing!$E$3)/('manual inputs'!$D$23/12))/9)*$AO$3)/'manual inputs'!$C$16)","v":""},{"$f":"IF($C$5=\"n/a\",\"\",IF(B25=\"\",\"\",IFERROR(INDEX('quantities report'!$D$2:$D$9877,SMALL(IF('quantities report'!$A$2:$A$9877=AS$3,ROW('quantities report'!$A$2:$A$9877)-1,\"\"),ROWS($B$9:$B25))),\"0\")))","v":""}," ",{"$f":"IF($C25=\"\",\" \",(AT25/('manual inputs'!$C$21/12)/9))","v":" "}]
[null,{"$f":"IFERROR(INDEX('manual inputs'!J:J,SMALL(IF('manual inputs'!J:J<>\"\",ROW('manual inputs'!J:J)),ROW('manual inputs'!20:20))),\"\")","v":""},{"$f":"IF($C$5=\"n/a\",\"\",IF(B26=\"\",\"\",IFERROR(INDEX('quantities report'!$D$2:$D$9877,SMALL(IF('quantities report'!$A$2:$A$9877=C$3,ROW('quantities report'!$A$2:$A$9877)-1,\"\"),ROWS($B$9:$B26))),\"0\")))","v":""}," ",{"$f":"IF($C26=\"\",\" \",(D26*$E$3/'manual inputs'!$C$17))","v":" "},{"$f":"IF($C$5=\"n/a\",\"\",IF(B26=\"\",\"\",IFERROR(INDEX('quantities report'!$D$2:$D$9877,SMALL(IF('quantities report'!$A$2:$A$9877=F$3,ROW('quantities report'!$A$2:$A$9877)-1,\"\"),ROWS($B$9:$B26))),\"0\")))","v":""}," ",{"$f":"IF($F26=\"\",\" \",(G26*$E$3/'manual inputs'!$C$17))","v":" "},"",{"$f":"IF($J$5=\"n/a\",\"\",IF(B26=\"\",\"\",IFERROR(INDEX('quantities report'!$D$2:$D$9877,SMALL(IF('quantities report'!$A$2:$A$9877=J$3,ROW('quantities report'!$A$2:$A$9877)-1,\"\"),ROWS($B$9:$B26))),\"0\")))","v":""}," ",{"$f":"IF($J26=\"\",\" \",(K26*$L$3/'manual inputs'!$C$17))","v":" "},{"$f":"IF($J$5=\"n/a\",\"\",IF(B26=\"\",\"\",IFERROR(INDEX('quantities report'!$D$2:$D$9877,SMALL(IF('quantities report'!$A$2:$A$9877=M$3,ROW('quantities report'!$A$2:$A$9877)-1,\"\"),ROWS($B$9:$B26))),\"0\")))","v":""}," ",{"$f":"IF($M26=\"\",\" \",(N26*$O$3/'manual inputs'!$C$17))","v":" "},"",{"$f":"IF($Q$5=\"n/a\",\"\",IF(B26=\"\",\"\",IFERROR(INDEX('quantities report'!$D$2:$D$9877,SMALL(IF('quantities report'!$A$2:$A$9877=Q$3,ROW('quantities report'!$A$2:$A$9877)-1,\"\"),ROWS($B$9:$B26))),\"0\")))","v":""}," ",{"$f":"IF($Q26=\"\",\" \",(R26*$S$3/'manual inputs'!$C$17))","v":" "},{"$f":"IF($Q$5=\"n/a\",\"\",IF(I26=\"\",\"\",IFERROR(INDEX('quantities report'!$D$2:$D$9877,SMALL(IF('quantities report'!$A$2:$A$9877=T$3,ROW('quantities report'!$A$2:$A$9877)-1,\"\"),ROWS($B$9:$B26))),\"0\")))","v":""}," ",{"$f":"IF($T26=\"\",\" \",(U26*$V$3/'manual inputs'!$C$17))","v":" "},"",{"$f":"IF($X$5=\"n/a\",\"\",IF(B26=\"\",\"\",IFERROR(INDEX('quantities report'!$D$2:$D$9877,SMALL(IF('quantities report'!$A$2:$A$9877=X$3,ROW('quantities report'!$A$2:$A$9877)-1,\"\"),ROWS($B$9:$B26))),\"0\")))","v":""}," ",{"$f":"IF($X26=\"\",\" \",(Y26*$Z$3/'manual inputs'!$C$17))","v":" "},{"$f":"IF($X$5=\"n/a\",\"\",IF(B26=\"\",\"\",IFERROR(INDEX('quantities report'!$D$2:$D$9877,SMALL(IF('quantities report'!$A$2:$A$9877=AA$3,ROW('quantities report'!$A$2:$A$9877)-1,\"\"),ROWS($B$9:$B26))),\"0\")))","v":""}," ",{"$f":"IF($AA26=\"\",\" \",(AB26*$AC$3/'manual inputs'!$C$17))","v":" "},"",{"$f":"IF($AE$5=\"n/a\",\"\",IF(B26=\"\",\"\",IFERROR(INDEX('quantities report'!$D$2:$D$9877,SMALL(IF('quantities report'!$A$2:$A$9877=AE$3,ROW('quantities report'!$A$2:$A$9877)-1,\"\"),ROWS($B$9:$B26))),\"0\")))","v":""}," ",{"$f":"IF($AE26=\"\",\" \",(AF26*$AG$3/'manual inputs'!$C$17))","v":" "},{"$f":"IF($AE$5=\"n/a\",\"\",IF(B26=\"\",\"\",IFERROR(INDEX('quantities report'!$D$2:$D$9877,SMALL(IF('quantities report'!$A$2:$A$9877=AH$3,ROW('quantities report'!$A$2:$A$9877)-1,\"\"),ROWS($B$9:$B26))),\"0\")))","v":""}," ",{"$f":"IF($AE26=\"\",\" \",(AI26*$AJ$3/'manual inputs'!$C$17))","v":" "},""," "," ",{"$f":"IF(B26=\"\",\"\",(AM26*'manual inputs'!$C$6))","v":""},{"$f":"IF($B26=\"\",\"\",(((($AM26*'manual inputs'!$C$17/Surfacing!$E$3)/('manual inputs'!$D$23/12))/9)*$AO$3)/'manual inputs'!$C$16)","v":""},{"$f":"IF($B26=\"\",\"\",(((($AM26*'manual inputs'!$C$17/Surfacing!$E$3)/('manual inputs'!$D$23/12))/9)))","v":""},{"$f":"IF($B26=\"\",\"\",((((($AM26*'manual inputs'!$C$17/Surfacing!$E$3)/('manual inputs'!$D$23/12))/9)*$AQ$3)/'manual inputs'!$C$17)*'manual inputs'!$C$12)","v":""},{"$f":"IF($B26=\"\",\"\",(((($AM26*'manual inputs'!$C$17/Surfacing!$E$3)/('manual inputs'!$D$23/12))/9)*$AO$3)/'manual inputs'!$C$16)","v":""},{"$f":"IF($C$5=\"n/a\",\"\",IF(B26=\"\",\"\",IFERROR(INDEX('quantities report'!$D$2:$D$9877,SMALL(IF('quantities report'!$A$2:$A$9877=AS$3,ROW('quantities report'!$A$2:$A$9877)-1,\"\"),ROWS($B$9:$B26))),\"0\")))","v":""}," ",{"$f":"IF($C26=\"\",\" \",(AT26/('manual inputs'!$C$21/12)/9))","v":" "}]
[null,{"$f":"IFERROR(INDEX('manual inputs'!J:J,SMALL(IF('manual inputs'!J:J<>\"\",ROW('manual inputs'!J:J)),ROW('manual inputs'!21:21))),\"\")","v":""},{"$f":"IF($C$5=\"n/a\",\"\",IF(B27=\"\",\"\",IFERROR(INDEX('quantities report'!$D$2:$D$9877,SMALL(IF('quantities report'!$A$2:$A$9877=C$3,ROW('quantities report'!$A$2:$A$9877)-1,\"\"),ROWS($B$9:$B27))),\"0\")))","v":""}," ",{"$f":"IF($C27=\"\",\" \",(D27*$E$3/'manual inputs'!$C$17))","v":" "},{"$f":"IF($C$5=\"n/a\",\"\",IF(B27=\"\",\"\",IFERROR(INDEX('quantities report'!$D$2:$D$9877,SMALL(IF('quantities report'!$A$2:$A$9877=F$3,ROW('quantities report'!$A$2:$A$9877)-1,\"\"),ROWS($B$9:$B27))),\"0\")))","v":""}," ",{"$f":"IF($F27=\"\",\" \",(G27*$E$3/'manual inputs'!$C$17))","v":" "},"",{"$f":"IF($J$5=\"n/a\",\"\",IF(B27=\"\",\"\",IFERROR(INDEX('quantities report'!$D$2:$D$9877,SMALL(IF('quantities report'!$A$2:$A$9877=J$3,ROW('quantities report'!$A$2:$A$9877)-1,\"\"),ROWS($B$9:$B27))),\"0\")))","v":""}," ",{"$f":"IF($J27=\"\",\" \",(K27*$L$3/'manual inputs'!$C$17))","v":" "},{"$f":"IF($J$5=\"n/a\",\"\",IF(B27=\"\",\"\",IFERROR(INDEX('quantities report'!$D$2:$D$9877,SMALL(IF('quantities report'!$A$2:$A$9877=M$3,ROW('quantities report'!$A$2:$A$9877)-1,\"\"),ROWS($B$9:$B27))),\"0\")))","v":""}," ",{"$f":"IF($M27=\"\",\" \",(N27*$O$3/'manual inputs'!$C$17))","v":" "},"",{"$f":"IF($Q$5=\"n/a\",\"\",IF(B27=\"\",\"\",IFERROR(INDEX('quantities report'!$D$2:$D$9877,SMALL(IF('quantities report'!$A$2:$A$9877=Q$3,ROW('quantities report'!$A$2:$A$9877)-1,\"\"),ROWS($B$9:$B27))),\"0\")))","v":""}," ",{"$f":"IF($Q27=\"\",\" \",(R27*$S$3/'manual inputs'!$C$17))","v":" "},{"$f":"IF($Q$5=\"n/a\",\"\",IF(I27=\"\",\"\",IFERROR(INDEX('quantities report'!$D$2:$D$9877,SMALL(IF('quantities report'!$A$2:$A$9877=T$3,ROW('quantities report'!$A$2:$A$9877)-1,\"\"),ROWS($B$9:$B27))),\"0\")))","v":""}," ",{"$f":"IF($T27=\"\",\" \",(U27*$V$3/'manual inputs'!$C$17))","v":" "},"",{"$f":"IF($X$5=\"n/a\",\"\",IF(B27=\"\",\"\",IFERROR(INDEX('quantities report'!$D$2:$D$9877,SMALL(IF('quantities report'!$A$2:$A$9877=X$3,ROW('quantities report'!$A$2:$A$9877)-1,\"\"),ROWS($B$9:$B27))),\"0\")))","v":""}," ",{"$f":"IF($X27=\"\",\" \",(Y27*$Z$3/'manual inputs'!$C$17))","v":" "},{"$f":"IF($X$5=\"n/a\",\"\",IF(B27=\"\",\"\",IFERROR(INDEX('quantities report'!$D$2:$D$9877,SMALL(IF('quantities report'!$A$2:$A$9877=AA$3,ROW('quantities report'!$A$2:$A$9877)-1,\"\"),ROWS($B$9:$B27))),\"0\")))","v":""}," ",{"$f":"IF($AA27=\"\",\" \",(AB27*$AC$3/'manual inputs'!$C$17))","v":" "},"",{"$f":"IF($AE$5=\"n/a\",\"\",IF(B27=\"\",\"\",IFERROR(INDEX('quantities report'!$D$2:$D$9877,SMALL(IF('quantities report'!$A$2:$A$9877=AE$3,ROW('quantities report'!$A$2:$A$9877)-1,\"\"),ROWS($B$9:$B27))),\"0\")))","v":""}," ",{"$f":"IF($AE27=\"\",\" \",(AF27*$AG$3/'manual inputs'!$C$17))","v":" "},{"$f":"IF($AE$5=\"n/a\",\"\",IF(B27=\"\",\"\",IFERROR(INDEX('quantities report'!$D$2:$D$9877,SMALL(IF('quantities report'!$A$2:$A$9877=AH$3,ROW('quantities report'!$A$2:$A$9877)-1,\"\"),ROWS($B$9:$B27))),\"0\")))","v":""}," ",{"$f":"IF($AE27=\"\",\" \",(AI27*$AJ$3/'manual inputs'!$C$17))","v":" "},""," "," ",{"$f":"IF(B27=\"\",\"\",(AM27*'manual inputs'!$C$6))","v":""},{"$f":"IF($B27=\"\",\"\",(((($AM27*'manual inputs'!$C$17/Surfacing!$E$3)/('manual inputs'!$D$23/12))/9)*$AO$3)/'manual inputs'!$C$16)","v":""},{"$f":"IF($B27=\"\",\"\",(((($AM27*'manual inputs'!$C$17/Surfacing!$E$3)/('manual inputs'!$D$23/12))/9)))","v":""},{"$f":"IF($B27=\"\",\"\",((((($AM27*'manual inputs'!$C$17/Surfacing!$E$3)/('manual inputs'!$D$23/12))/9)*$AQ$3)/'manual inputs'!$C$17)*'manual inputs'!$C$12)","v":""},{"$f":"IF($B27=\"\",\"\",(((($AM27*'manual inputs'!$C$17/Surfacing!$E$3)/('manual inputs'!$D$23/12))/9)*$AO$3)/'manual inputs'!$C$16)","v":""},{"$f":"IF($C$5=\"n/a\",\"\",IF(B27=\"\",\"\",IFERROR(INDEX('quantities report'!$D$2:$D$9877,SMALL(IF('quantities report'!$A$2:$A$9877=AS$3,ROW('quantities report'!$A$2:$A$9877)-1,\"\"),ROWS($B$9:$B27))),\"0\")))","v":""}," ",{"$f":"IF($C27=\"\",\" \",(AT27/('manual inputs'!$C$21/12)/9))","v":" "}]
[null,{"$f":"IFERROR(INDEX('manual inputs'!J:J,SMALL(IF('manual inputs'!J:J<>\"\",ROW('manual inputs'!J:J)),ROW('manual inputs'!22:22))),\"\")","v":""},{"$f":"IF($C$5=\"n/a\",\"\",IF(B28=\"\",\"\",IFERROR(INDEX('quantities report'!$D$2:$D$9877,SMALL(IF('quantities report'!$A$2:$A$9877=C$3,ROW('quantities report'!$A$2:$A$9877)-1,\"\"),ROWS($B$9:$B28))),\"0\")))","v":""}," ",{"$f":"IF($C28=\"\",\" \",(D28*$E$3/'manual inputs'!$C$17))","v":" "},{"$f":"IF($C$5=\"n/a\",\"\",IF(B28=\"\",\"\",IFERROR(INDEX('quantities report'!$D$2:$D$9877,SMALL(IF('quantities report'!$A$2:$A$9877=F$3,ROW('quantities report'!$A$2:$A$9877)-1,\"\"),ROWS($B$9:$B28))),\"0\")))","v":""}," ",{"$f":"IF($F28=\"\",\" \",(G28*$E$3/'manual inputs'!$C$17))","v":" "},"",{"$f":"IF($J$5=\"n/a\",\"\",IF(B28=\"\",\"\",IFERROR(INDEX('quantities report'!$D$2:$D$9877,SMALL(IF('quantities report'!$A$2:$A$9877=J$3,ROW('quantities report'!$A$2:$A$9877)-1,\"\"),ROWS($B$9:$B28))),\"0\")))","v":""}," ",{"$f":"IF($J28=\"\",\" \",(K28*$L$3/'manual inputs'!$C$17))","v":" "},{"$f":"IF($J$5=\"n/a\",\"\",IF(B28=\"\",\"\",IFERROR(INDEX('quantities report'!$D$2:$D$9877,SMALL(IF('quantities report'!$A$2:$A$9877=M$3,ROW('quantities report'!$A$2:$A$9877)-1,\"\"),ROWS($B$9:$B28))),\"0\")))","v":""}," ",{"$f":"IF($M28=\"\",\" \",(N28*$O$3/'manual inputs'!$C$17))","v":" "},"",{"$f":"IF($Q$5=\"n/a\",\"\",IF(B28=\"\",\"\",IFERROR(INDEX('quantities report'!$D$2:$D$9877,SMALL(IF('quantities report'!$A$2:$A$9877=Q$3,ROW('quantities report'!$A$2:$A$9877)-1,\"\"),ROWS($B$9:$B28))),\"0\")))","v":""}," ",{"$f":"IF($Q28=\"\",\" \",(R28*$S$3/'manual inputs'!$C$17))","v":" "},{"$f":"IF($Q$5=\"n/a\",\"\",IF(I28=\"\",\"\",IFERROR(INDEX('quantities report'!$D$2:$D$9877,SMALL(IF('quantities report'!$A$2:$A$9877=T$3,ROW('quantities report'!$A$2:$A$9877)-1,\"\"),ROWS($B$9:$B28))),\"0\")))","v":""}," ",{"$f":"IF($T28=\"\",\" \",(U28*$V$3/'manual inputs'!$C$17))","v":" "},"",{"$f":"IF($X$5=\"n/a\",\"\",IF(B28=\"\",\"\",IFERROR(INDEX('quantities report'!$D$2:$D$9877,SMALL(IF('quantities report'!$A$2:$A$9877=X$3,ROW('quantities report'!$A$2:$A$9877)-1,\"\"),ROWS($B$9:$B28))),\"0\")))","v":""}," ",{"$f":"IF($X28=\"\",\" \",(Y28*$Z$3/'manual inputs'!$C$17))","v":" "},{"$f":"IF($X$5=\"n/a\",\"\",IF(B28=\"\",\"\",IFERROR(INDEX('quantities report'!$D$2:$D$9877,SMALL(IF('quantities report'!$A$2:$A$9877=AA$3,ROW('quantities report'!$A$2:$A$9877)-1,\"\"),ROWS($B$9:$B28))),\"0\")))","v":""}," ",{"$f":"IF($AA28=\"\",\" \",(AB28*$AC$3/'manual inputs'!$C$17))","v":" "},"",{"$f":"IF($AE$5=\"n/a\",\"\",IF(B28=\"\",\"\",IFERROR(INDEX('quantities report'!$D$2:$D$9877,SMALL(IF('quantities report'!$A$2:$A$9877=AE$3,ROW('quantities report'!$A$2:$A$9877)-1,\"\"),ROWS($B$9:$B28))),\"0\")))","v":""}," ",{"$f":"IF($AE28=\"\",\" \",(AF28*$AG$3/'manual inputs'!$C$17))","v":" "},{"$f":"IF($AE$5=\"n/a\",\"\",IF(B28=\"\",\"\",IFERROR(INDEX('quantities report'!$D$2:$D$9877,SMALL(IF('quantities report'!$A$2:$A$9877=AH$3,ROW('quantities report'!$A$2:$A$9877)-1,\"\"),ROWS($B$9:$B28))),\"0\")))","v":""}," ",{"$f":"IF($AE28=\"\",\" \",(AI28*$AJ$3/'manual inputs'!$C$17))","v":" "},""," "," ",{"$f":"IF(B28=\"\",\"\",(AM28*'manual inputs'!$C$6))","v":""},{"$f":"IF($B28=\"\",\"\",(((($AM28*'manual inputs'!$C$17/Surfacing!$E$3)/('manual inputs'!$D$23/12))/9)*$AO$3)/'manual inputs'!$C$16)","v":""},{"$f":"IF($B28=\"\",\"\",(((($AM28*'manual inputs'!$C$17/Surfacing!$E$3)/('manual inputs'!$D$23/12))/9)))","v":""},{"$f":"IF($B28=\"\",\"\",((((($AM28*'manual inputs'!$C$17/Surfacing!$E$3)/('manual inputs'!$D$23/12))/9)*$AQ$3)/'manual inputs'!$C$17)*'manual inputs'!$C$12)","v":""},{"$f":"IF($B28=\"\",\"\",(((($AM28*'manual inputs'!$C$17/Surfacing!$E$3)/('manual inputs'!$D$23/12))/9)*$AO$3)/'manual inputs'!$C$16)","v":""},{"$f":"IF($C$5=\"n/a\",\"\",IF(B28=\"\",\"\",IFERROR(INDEX('quantities report'!$D$2:$D$9877,SMALL(IF('quantities report'!$A$2:$A$9877=AS$3,ROW('quantities report'!$A$2:$A$9877)-1,\"\"),ROWS($B$9:$B28))),\"0\")))","v":""}," ",{"$f":"IF($C28=\"\",\" \",(AT28/('manual inputs'!$C$21/12)/9))","v":" "}]
[null,{"$f":"IFERROR(INDEX('manual inputs'!J:J,SMALL(IF('manual inputs'!J:J<>\"\",ROW('manual inputs'!J:J)),ROW('manual inputs'!23:23))),\"\")","v":""},{"$f":"IF($C$5=\"n/a\",\"\",IF(B29=\"\",\"\",IFERROR(INDEX('quantities report'!$D$2:$D$9877,SMALL(IF('quantities report'!$A$2:$A$9877=C$3,ROW('quantities report'!$A$2:$A$9877)-1,\"\"),ROWS($B$9:$B29))),\"0\")))","v":""}," ",{"$f":"IF($C29=\"\",\" \",(D29*$E$3/'manual inputs'!$C$17))","v":" "},{"$f":"IF($C$5=\"n/a\",\"\",IF(B29=\"\",\"\",IFERROR(INDEX('quantities report'!$D$2:$D$9877,SMALL(IF('quantities report'!$A$2:$A$9877=F$3,ROW('quantities report'!$A$2:$A$9877)-1,\"\"),ROWS($B$9:$B29))),\"0\")))","v":""}," ",{"$f":"IF($F29=\"\",\" \",(G29*$E$3/'manual inputs'!$C$17))","v":" "},"",{"$f":"IF($J$5=\"n/a\",\"\",IF(B29=\"\",\"\",IFERROR(INDEX('quantities report'!$D$2:$D$9877,SMALL(IF('quantities report'!$A$2:$A$9877=J$3,ROW('quantities report'!$A$2:$A$9877)-1,\"\"),ROWS($B$9:$B29))),\"0\")))","v":""}," ",{"$f":"IF($J29=\"\",\" \",(K29*$L$3/'manual inputs'!$C$17))","v":" "},{"$f":"IF($J$5=\"n/a\",\"\",IF(B29=\"\",\"\",IFERROR(INDEX('quantities report'!$D$2:$D$9877,SMALL(IF('quantities report'!$A$2:$A$9877=M$3,ROW('quantities report'!$A$2:$A$9877)-1,\"\"),ROWS($B$9:$B29))),\"0\")))","v":""}," ",{"$f":"IF($M29=\"\",\" \",(N29*$O$3/'manual inputs'!$C$17))","v":" "},"",{"$f":"IF($Q$5=\"n/a\",\"\",IF(B29=\"\",\"\",IFERROR(INDEX('quantities report'!$D$2:$D$9877,SMALL(IF('quantities report'!$A$2:$A$9877=Q$3,ROW('quantities report'!$A$2:$A$9877)-1,\"\"),ROWS($B$9:$B29))),\"0\")))","v":""}," ",{"$f":"IF($Q29=\"\",\" \",(R29*$S$3/'manual inputs'!$C$17))","v":" "},{"$f":"IF($Q$5=\"n/a\",\"\",IF(I29=\"\",\"\",IFERROR(INDEX('quantities report'!$D$2:$D$9877,SMALL(IF('quantities report'!$A$2:$A$9877=T$3,ROW('quantities report'!$A$2:$A$9877)-1,\"\"),ROWS($B$9:$B29))),\"0\")))","v":""}," ",{"$f":"IF($T29=\"\",\" \",(U29*$V$3/'manual inputs'!$C$17))","v":" "},"",{"$f":"IF($X$5=\"n/a\",\"\",IF(B29=\"\",\"\",IFERROR(INDEX('quantities report'!$D$2:$D$9877,SMALL(IF('quantities report'!$A$2:$A$9877=X$3,ROW('quantities report'!$A$2:$A$9877)-1,\"\"),ROWS($B$9:$B29))),\"0\")))","v":""}," ",{"$f":"IF($X29=\"\",\" \",(Y29*$Z$3/'manual inputs'!$C$17))","v":" "},{"$f":"IF($X$5=\"n/a\",\"\",IF(B29=\"\",\"\",IFERROR(INDEX('quantities report'!$D$2:$D$9877,SMALL(IF('quantities report'!$A$2:$A$9877=AA$3,ROW('quantities report'!$A$2:$A$9877)-1,\"\"),ROWS($B$9:$B29))),\"0\")))","v":""}," ",{"$f":"IF($AA29=\"\",\" \",(AB29*$AC$3/'manual inputs'!$C$17))","v":" "},"",{"$f":"IF($AE$5=\"n/a\",\"\",IF(B29=\"\",\"\",IFERROR(INDEX('quantities report'!$D$2:$D$9877,SMALL(IF('quantities report'!$A$2:$A$9877=AE$3,ROW('quantities report'!$A$2:$A$9877)-1,\"\"),ROWS($B$9:$B29))),\"0\")))","v":""}," ",{"$f":"IF($AE29=\"\",\" \",(AF29*$AG$3/'manual inputs'!$C$17))","v":" "},{"$f":"IF($AE$5=\"n/a\",\"\",IF(B29=\"\",\"\",IFERROR(INDEX('quantities report'!$D$2:$D$9877,SMALL(IF('quantities report'!$A$2:$A$9877=AH$3,ROW('quantities report'!$A$2:$A$9877)-1,\"\"),ROWS($B$9:$B29))),\"0\")))","v":""}," ",{"$f":"IF($AE29=\"\",\" \",(AI29*$AJ$3/'manual inputs'!$C$17))","v":" "},""," "," ",{"$f":"IF(B29=\"\",\"\",(AM29*'manual inputs'!$C$6))","v":""},{"$f":"IF($B29=\"\",\"\",(((($AM29*'manual inputs'!$C$17/Surfacing!$E$3)/('manual inputs'!$D$23/12))/9)*$AO$3)/'manual inputs'!$C$16)","v":""},{"$f":"IF($B29=\"\",\"\",(((($AM29*'manual inputs'!$C$17/Surfacing!$E$3)/('manual inputs'!$D$23/12))/9)))","v":""},{"$f":"IF($B29=\"\",\"\",((((($AM29*'manual inputs'!$C$17/Surfacing!$E$3)/('manual inputs'!$D$23/12))/9)*$AQ$3)/'manual inputs'!$C$17)*'manual inputs'!$C$12)","v":""},{"$f":"IF($B29=\"\",\"\",(((($AM29*'manual inputs'!$C$17/Surfacing!$E$3)/('manual inputs'!$D$23/12))/9)*$AO$3)/'manual inputs'!$C$16)","v":""},{"$f":"IF($C$5=\"n/a\",\"\",IF(B29=\"\",\"\",IFERROR(INDEX('quantities report'!$D$2:$D$9877,SMALL(IF('quantities report'!$A$2:$A$9877=AS$3,ROW('quantities report'!$A$2:$A$9877)-1,\"\"),ROWS($B$9:$B29))),\"0\")))","v":""}," ",{"$f":"IF($C29=\"\",\" \",(AT29/('manual inputs'!$C$21/12)/9))","v":" "}]
[null,{"$f":"IFERROR(INDEX('manual inputs'!J:J,SMALL(IF('manual inputs'!J:J<>\"\",ROW('manual inputs'!J:J)),ROW('manual inputs'!24:24))),\"\")","v":""},{"$f":"IF($C$5=\"n/a\",\"\",IF(B30=\"\",\"\",IFERROR(INDEX('quantities report'!$D$2:$D$9877,SMALL(IF('quantities report'!$A$2:$A$9877=C$3,ROW('quantities report'!$A$2:$A$9877)-1,\"\"),ROWS($B$9:$B30))),\"0\")))","v":""}," ",{"$f":"IF($C30=\"\",\" \",(D30*$E$3/'manual inputs'!$C$17))","v":" "},{"$f":"IF($C$5=\"n/a\",\"\",IF(B30=\"\",\"\",IFERROR(INDEX('quantities report'!$D$2:$D$9877,SMALL(IF('quantities report'!$A$2:$A$9877=F$3,ROW('quantities report'!$A$2:$A$9877)-1,\"\"),ROWS($B$9:$B30))),\"0\")))","v":""}," ",{"$f":"IF($F30=\"\",\" \",(G30*$E$3/'manual inputs'!$C$17))","v":" "},"",{"$f":"IF($J$5=\"n/a\",\"\",IF(B30=\"\",\"\",IFERROR(INDEX('quantities report'!$D$2:$D$9877,SMALL(IF('quantities report'!$A$2:$A$9877=J$3,ROW('quantities report'!$A$2:$A$9877)-1,\"\"),ROWS($B$9:$B30))),\"0\")))","v":""}," ",{"$f":"IF($J30=\"\",\" \",(K30*$L$3/'manual inputs'!$C$17))","v":" "},{"$f":"IF($J$5=\"n/a\",\"\",IF(B30=\"\",\"\",IFERROR(INDEX('quantities report'!$D$2:$D$9877,SMALL(IF('quantities report'!$A$2:$A$9877=M$3,ROW('quantities report'!$A$2:$A$9877)-1,\"\"),ROWS($B$9:$B30))),\"0\")))","v":""}," ",{"$f":"IF($M30=\"\",\" \",(N30*$O$3/'manual inputs'!$C$17))","v":" "},"",{"$f":"IF($Q$5=\"n/a\",\"\",IF(B30=\"\",\"\",IFERROR(INDEX('quantities report'!$D$2:$D$9877,SMALL(IF('quantities report'!$A$2:$A$9877=Q$3,ROW('quantities report'!$A$2:$A$9877)-1,\"\"),ROWS($B$9:$B30))),\"0\")))","v":""}," ",{"$f":"IF($Q30=\"\",\" \",(R30*$S$3/'manual inputs'!$C$17))","v":" "},{"$f":"IF($Q$5=\"n/a\",\"\",IF(I30=\"\",\"\",IFERROR(INDEX('quantities report'!$D$2:$D$9877,SMALL(IF('quantities report'!$A$2:$A$9877=T$3,ROW('quantities report'!$A$2:$A$9877)-1,\"\"),ROWS($B$9:$B30))),\"0\")))","v":""}," ",{"$f":"IF($T30=\"\",\" \",(U30*$V$3/'manual inputs'!$C$17))","v":" "},"",{"$f":"IF($X$5=\"n/a\",\"\",IF(B30=\"\",\"\",IFERROR(INDEX('quantities report'!$D$2:$D$9877,SMALL(IF('quantities report'!$A$2:$A$9877=X$3,ROW('quantities report'!$A$2:$A$9877)-1,\"\"),ROWS($B$9:$B30))),\"0\")))","v":""}," ",{"$f":"IF($X30=\"\",\" \",(Y30*$Z$3/'manual inputs'!$C$17))","v":" "},{"$f":"IF($X$5=\"n/a\",\"\",IF(B30=\"\",\"\",IFERROR(INDEX('quantities report'!$D$2:$D$9877,SMALL(IF('quantities report'!$A$2:$A$9877=AA$3,ROW('quantities report'!$A$2:$A$9877)-1,\"\"),ROWS($B$9:$B30))),\"0\")))","v":""}," ",{"$f":"IF($AA30=\"\",\" \",(AB30*$AC$3/'manual inputs'!$C$17))","v":" "},"",{"$f":"IF($AE$5=\"n/a\",\"\",IF(B30=\"\",\"\",IFERROR(INDEX('quantities report'!$D$2:$D$9877,SMALL(IF('quantities report'!$A$2:$A$9877=AE$3,ROW('quantities report'!$A$2:$A$9877)-1,\"\"),ROWS($B$9:$B30))),\"0\")))","v":""}," ",{"$f":"IF($AE30=\"\",\" \",(AF30*$AG$3/'manual inputs'!$C$17))","v":" "},{"$f":"IF($AE$5=\"n/a\",\"\",IF(B30=\"\",\"\",IFERROR(INDEX('quantities report'!$D$2:$D$9877,SMALL(IF('quantities report'!$A$2:$A$9877=AH$3,ROW('quantities report'!$A$2:$A$9877)-1,\"\"),ROWS($B$9:$B30))),\"0\")))","v":""}," ",{"$f":"IF($AE30=\"\",\" \",(AI30*$AJ$3/'manual inputs'!$C$17))","v":" "},""," "," ",{"$f":"IF(B30=\"\",\"\",(AM30*'manual inputs'!$C$6))","v":""},{"$f":"IF($B30=\"\",\"\",(((($AM30*'manual inputs'!$C$17/Surfacing!$E$3)/('manual inputs'!$D$23/12))/9)*$AO$3)/'manual inputs'!$C$16)","v":""},{"$f":"IF($B30=\"\",\"\",(((($AM30*'manual inputs'!$C$17/Surfacing!$E$3)/('manual inputs'!$D$23/12))/9)))","v":""},{"$f":"IF($B30=\"\",\"\",((((($AM30*'manual inputs'!$C$17/Surfacing!$E$3)/('manual inputs'!$D$23/12))/9)*$AQ$3)/'manual inputs'!$C$17)*'manual inputs'!$C$12)","v":""},{"$f":"IF($B30=\"\",\"\",(((($AM30*'manual inputs'!$C$17/Surfacing!$E$3)/('manual inputs'!$D$23/12))/9)*$AO$3)/'manual inputs'!$C$16)","v":""},{"$f":"IF($C$5=\"n/a\",\"\",IF(B30=\"\",\"\",IFERROR(INDEX('quantities report'!$D$2:$D$9877,SMALL(IF('quantities report'!$A$2:$A$9877=AS$3,ROW('quantities report'!$A$2:$A$9877)-1,\"\"),ROWS($B$9:$B30))),\"0\")))","v":""}," ",{"$f":"IF($C30=\"\",\" \",(AT30/('manual inputs'!$C$21/12)/9))","v":" "}]
[null,{"$f":"IFERROR(INDEX('manual inputs'!J:J,SMALL(IF('manual inputs'!J:J<>\"\",ROW('manual inputs'!J:J)),ROW('manual inputs'!25:25))),\"\")","v":""},{"$f":"IF($C$5=\"n/a\",\"\",IF(B31=\"\",\"\",IFERROR(INDEX('quantities report'!$D$2:$D$9877,SMALL(IF('quantities report'!$A$2:$A$9877=C$3,ROW('quantities report'!$A$2:$A$9877)-1,\"\"),ROWS($B$9:$B31))),\"0\")))","v":""}," ",{"$f":"IF($C31=\"\",\" \",(D31*$E$3/'manual inputs'!$C$17))","v":" "},{"$f":"IF($C$5=\"n/a\",\"\",IF(B31=\"\",\"\",IFERROR(INDEX('quantities report'!$D$2:$D$9877,SMALL(IF('quantities report'!$A$2:$A$9877=F$3,ROW('quantities report'!$A$2:$A$9877)-1,\"\"),ROWS($B$9:$B31))),\"0\")))","v":""}," ",{"$f":"IF($F31=\"\",\" \",(G31*$E$3/'manual inputs'!$C$17))","v":" "},"",{"$f":"IF($J$5=\"n/a\",\"\",IF(B31=\"\",\"\",IFERROR(INDEX('quantities report'!$D$2:$D$9877,SMALL(IF('quantities report'!$A$2:$A$9877=J$3,ROW('quantities report'!$A$2:$A$9877)-1,\"\"),ROWS($B$9:$B31))),\"0\")))","v":""}," ",{"$f":"IF($J31=\"\",\" \",(K31*$L$3/'manual inputs'!$C$17))","v":" "},{"$f":"IF($J$5=\"n/a\",\"\",IF(B31=\"\",\"\",IFERROR(INDEX('quantities report'!$D$2:$D$9877,SMALL(IF('quantities report'!$A$2:$A$9877=M$3,ROW('quantities report'!$A$2:$A$9877)-1,\"\"),ROWS($B$9:$B31))),\"0\")))","v":""}," ",{"$f":"IF($M31=\"\",\" \",(N31*$O$3/'manual inputs'!$C$17))","v":" "},"",{"$f":"IF($Q$5=\"n/a\",\"\",IF(B31=\"\",\"\",IFERROR(INDEX('quantities report'!$D$2:$D$9877,SMALL(IF('quantities report'!$A$2:$A$9877=Q$3,ROW('quantities report'!$A$2:$A$9877)-1,\"\"),ROWS($B$9:$B31))),\"0\")))","v":""}," ",{"$f":"IF($Q31=\"\",\" \",(R31*$S$3/'manual inputs'!$C$17))","v":" "},{"$f":"IF($Q$5=\"n/a\",\"\",IF(I31=\"\",\"\",IFERROR(INDEX('quantities report'!$D$2:$D$9877,SMALL(IF('quantities report'!$A$2:$A$9877=T$3,ROW('quantities report'!$A$2:$A$9877)-1,\"\"),ROWS($B$9:$B31))),\"0\")))","v":""}," ",{"$f":"IF($T31=\"\",\" \",(U31*$V$3/'manual inputs'!$C$17))","v":" "},"",{"$f":"IF($X$5=\"n/a\",\"\",IF(B31=\"\",\"\",IFERROR(INDEX('quantities report'!$D$2:$D$9877,SMALL(IF('quantities report'!$A$2:$A$9877=X$3,ROW('quantities report'!$A$2:$A$9877)-1,\"\"),ROWS($B$9:$B31))),\"0\")))","v":""}," ",{"$f":"IF($X31=\"\",\" \",(Y31*$Z$3/'manual inputs'!$C$17))","v":" "},{"$f":"IF($X$5=\"n/a\",\"\",IF(B31=\"\",\"\",IFERROR(INDEX('quantities report'!$D$2:$D$9877,SMALL(IF('quantities report'!$A$2:$A$9877=AA$3,ROW('quantities report'!$A$2:$A$9877)-1,\"\"),ROWS($B$9:$B31))),\"0\")))","v":""}," ",{"$f":"IF($AA31=\"\",\" \",(AB31*$AC$3/'manual inputs'!$C$17))","v":" "},"",{"$f":"IF($AE$5=\"n/a\",\"\",IF(B31=\"\",\"\",IFERROR(INDEX('quantities report'!$D$2:$D$9877,SMALL(IF('quantities report'!$A$2:$A$9877=AE$3,ROW('quantities report'!$A$2:$A$9877)-1,\"\"),ROWS($B$9:$B31))),\"0\")))","v":""}," ",{"$f":"IF($AE31=\"\",\" \",(AF31*$AG$3/'manual inputs'!$C$17))","v":" "},{"$f":"IF($AE$5=\"n/a\",\"\",IF(B31=\"\",\"\",IFERROR(INDEX('quantities report'!$D$2:$D$9877,SMALL(IF('quantities report'!$A$2:$A$9877=AH$3,ROW('quantities report'!$A$2:$A$9877)-1,\"\"),ROWS($B$9:$B31))),\"0\")))","v":""}," ",{"$f":"IF($AE31=\"\",\" \",(AI31*$AJ$3/'manual inputs'!$C$17))","v":" "},""," "," ",{"$f":"IF(B31=\"\",\"\",(AM31*'manual inputs'!$C$6))","v":""},{"$f":"IF($B31=\"\",\"\",(((($AM31*'manual inputs'!$C$17/Surfacing!$E$3)/('manual inputs'!$D$23/12))/9)*$AO$3)/'manual inputs'!$C$16)","v":""},{"$f":"IF($B31=\"\",\"\",(((($AM31*'manual inputs'!$C$17/Surfacing!$E$3)/('manual inputs'!$D$23/12))/9)))","v":""},{"$f":"IF($B31=\"\",\"\",((((($AM31*'manual inputs'!$C$17/Surfacing!$E$3)/('manual inputs'!$D$23/12))/9)*$AQ$3)/'manual inputs'!$C$17)*'manual inputs'!$C$12)","v":""},{"$f":"IF($B31=\"\",\"\",(((($AM31*'manual inputs'!$C$17/Surfacing!$E$3)/('manual inputs'!$D$23/12))/9)*$AO$3)/'manual inputs'!$C$16)","v":""},{"$f":"IF($C$5=\"n/a\",\"\",IF(B31=\"\",\"\",IFERROR(INDEX('quantities report'!$D$2:$D$9877,SMALL(IF('quantities report'!$A$2:$A$9877=AS$3,ROW('quantities report'!$A$2:$A$9877)-1,\"\"),ROWS($B$9:$B31))),\"0\")))","v":""}," ",{"$f":"IF($C31=\"\",\" \",(AT31/('manual inputs'!$C$21/12)/9))","v":" "}]
[null,{"$f":"IFERROR(INDEX('manual inputs'!J:J,SMALL(IF('manual inputs'!J:J<>\"\",ROW('manual inputs'!J:J)),ROW('manual inputs'!26:26))),\"\")","v":""},{"$f":"IF($C$5=\"n/a\",\"\",IF(B32=\"\",\"\",IFERROR(INDEX('quantities report'!$D$2:$D$9877,SMALL(IF('quantities report'!$A$2:$A$9877=C$3,ROW('quantities report'!$A$2:$A$9877)-1,\"\"),ROWS($B$9:$B32))),\"0\")))","v":""}," ",{"$f":"IF($C32=\"\",\" \",(D32*$E$3/'manual inputs'!$C$17))","v":" "},{"$f":"IF($C$5=\"n/a\",\"\",IF(B32=\"\",\"\",IFERROR(INDEX('quantities report'!$D$2:$D$9877,SMALL(IF('quantities report'!$A$2:$A$9877=F$3,ROW('quantities report'!$A$2:$A$9877)-1,\"\"),ROWS($B$9:$B32))),\"0\")))","v":""}," ",{"$f":"IF($F32=\"\",\" \",(G32*$E$3/'manual inputs'!$C$17))","v":" "},"",{"$f":"IF($J$5=\"n/a\",\"\",IF(B32=\"\",\"\",IFERROR(INDEX('quantities report'!$D$2:$D$9877,SMALL(IF('quantities report'!$A$2:$A$9877=J$3,ROW('quantities report'!$A$2:$A$9877)-1,\"\"),ROWS($B$9:$B32))),\"0\")))","v":""}," ",{"$f":"IF($J32=\"\",\" \",(K32*$L$3/'manual inputs'!$C$17))","v":" "},{"$f":"IF($J$5=\"n/a\",\"\",IF(B32=\"\",\"\",IFERROR(INDEX('quantities report'!$D$2:$D$9877,SMALL(IF('quantities report'!$A$2:$A$9877=M$3,ROW('quantities report'!$A$2:$A$9877)-1,\"\"),ROWS($B$9:$B32))),\"0\")))","v":""}," ",{"$f":"IF($M32=\"\",\" \",(N32*$O$3/'manual inputs'!$C$17))","v":" "},"",{"$f":"IF($Q$5=\"n/a\",\"\",IF(B32=\"\",\"\",IFERROR(INDEX('quantities report'!$D$2:$D$9877,SMALL(IF('quantities report'!$A$2:$A$9877=Q$3,ROW('quantities report'!$A$2:$A$9877)-1,\"\"),ROWS($B$9:$B32))),\"0\")))","v":""}," ",{"$f":"IF($Q32=\"\",\" \",(R32*$S$3/'manual inputs'!$C$17))","v":" "},{"$f":"IF($Q$5=\"n/a\",\"\",IF(I32=\"\",\"\",IFERROR(INDEX('quantities report'!$D$2:$D$9877,SMALL(IF('quantities report'!$A$2:$A$9877=T$3,ROW('quantities report'!$A$2:$A$9877)-1,\"\"),ROWS($B$9:$B32))),\"0\")))","v":""}," ",{"$f":"IF($T32=\"\",\" \",(U32*$V$3/'manual inputs'!$C$17))","v":" "},"",{"$f":"IF($X$5=\"n/a\",\"\",IF(B32=\"\",\"\",IFERROR(INDEX('quantities report'!$D$2:$D$9877,SMALL(IF('quantities report'!$A$2:$A$9877=X$3,ROW('quantities report'!$A$2:$A$9877)-1,\"\"),ROWS($B$9:$B32))),\"0\")))","v":""}," ",{"$f":"IF($X32=\"\",\" \",(Y32*$Z$3/'manual inputs'!$C$17))","v":" "},{"$f":"IF($X$5=\"n/a\",\"\",IF(B32=\"\",\"\",IFERROR(INDEX('quantities report'!$D$2:$D$9877,SMALL(IF('quantities report'!$A$2:$A$9877=AA$3,ROW('quantities report'!$A$2:$A$9877)-1,\"\"),ROWS($B$9:$B32))),\"0\")))","v":""}," ",{"$f":"IF($AA32=\"\",\" \",(AB32*$AC$3/'manual inputs'!$C$17))","v":" "},"",{"$f":"IF($AE$5=\"n/a\",\"\",IF(B32=\"\",\"\",IFERROR(INDEX('quantities report'!$D$2:$D$9877,SMALL(IF('quantities report'!$A$2:$A$9877=AE$3,ROW('quantities report'!$A$2:$A$9877)-1,\"\"),ROWS($B$9:$B32))),\"0\")))","v":""}," ",{"$f":"IF($AE32=\"\",\" \",(AF32*$AG$3/'manual inputs'!$C$17))","v":" "},{"$f":"IF($AE$5=\"n/a\",\"\",IF(B32=\"\",\"\",IFERROR(INDEX('quantities report'!$D$2:$D$9877,SMALL(IF('quantities report'!$A$2:$A$9877=AH$3,ROW('quantities report'!$A$2:$A$9877)-1,\"\"),ROWS($B$9:$B32))),\"0\")))","v":""}," ",{"$f":"IF($AE32=\"\",\" \",(AI32*$AJ$3/'manual inputs'!$C$17))","v":" "},""," "," ",{"$f":"IF(B32=\"\",\"\",(AM32*'manual inputs'!$C$6))","v":""},{"$f":"IF($B32=\"\",\"\",(((($AM32*'manual inputs'!$C$17/Surfacing!$E$3)/('manual inputs'!$D$23/12))/9)*$AO$3)/'manual inputs'!$C$16)","v":""},{"$f":"IF($B32=\"\",\"\",(((($AM32*'manual inputs'!$C$17/Surfacing!$E$3)/('manual inputs'!$D$23/12))/9)))","v":""},{"$f":"IF($B32=\"\",\"\",((((($AM32*'manual inputs'!$C$17/Surfacing!$E$3)/('manual inputs'!$D$23/12))/9)*$AQ$3)/'manual inputs'!$C$17)*'manual inputs'!$C$12)","v":""},{"$f":"IF($B32=\"\",\"\",(((($AM32*'manual inputs'!$C$17/Surfacing!$E$3)/('manual inputs'!$D$23/12))/9)*$AO$3)/'manual inputs'!$C$16)","v":""},{"$f":"IF($C$5=\"n/a\",\"\",IF(B32=\"\",\"\",IFERROR(INDEX('quantities report'!$D$2:$D$9877,SMALL(IF('quantities report'!$A$2:$A$9877=AS$3,ROW('quantities report'!$A$2:$A$9877)-1,\"\"),ROWS($B$9:$B32))),\"0\")))","v":""}," ",{"$f":"IF($C32=\"\",\" \",(AT32/('manual inputs'!$C$21/12)/9))","v":" "}]
[null,{"$f":"IFERROR(INDEX(#REF!,SMALL(IF(#REF!<>\"\",ROW(#REF!)),ROW(28:28))),\"\")","v":""}]

{"sheet":"Surfacing Summary","index":5,"n_rows":53,"n_cols":14,"rows_kept":53,"cut":false,"hidden":false,"merged":[[5,4,5,13],[6,4,6,6],[48,14,48,23],[47,14,47,23],[7,9,11,9],[7,10,11,10],[7,11,11,11],[44,4,44,6],[7,4,12,6],[7,7,11,7],[7,8,11,8],[28,4,28,6],[7,12,11,12],[7,13,11,13],[28,0,28,1],[11,0,11,1],[12,0,12,1],[1,0,10,0],[1,1,10,1]]}
[]
["<---Type Beginning Row Number","<---Automatic calculates except for last row",null,null,"NOTE TO DESIGNER:  EXAMPLE PAY ITEMS SHOWN…ADJUST TO FIT PROJECT SPECIFIC REQUIREMENTS"]
[]
[null,null,null,null,"Check Totals ------->",null,null,{"$f":"Surfacing!AL2+Surfacing_secondary!AL2","v":0},{"$f":"Surfacing!AL2+Surfacing_secondary!AL2","v":0},{"$f":"Surfacing!AM2+Surfacing_secondary!AM2","v":0},{"$f":"Surfacing!AN2+Surfacing_secondary!AN2","v":0},{"$f":"Surfacing!AO2+Surfacing_secondary!AO2","v":0},{"$f":"Surfacing!AP2+Surfacing_secondary!AP2","v":0},{"$f":"Surfacing!AR2+Surfacing_secondary!AR2","v":0}]
[]
[null,null,null,null,"SURFACING SUMMARY"]
[null,null,null,null,null,null,null,"20303-1600","30202-2000","40101-1000","40105-3000","40601-0000","41102-1000","41201-0000"]
[null,null,null,null,"Station to Station",null,null,{"$f":"IF(ISBLANK(H7),\" \",LOOKUP(H7,'[1]FP24 Pay Items'!$B:$B,'[1]FP24 Pay Items'!$E:$E))","v":"REMOVAL OF PAVEMENT, ASPHALT"},{"$f":"IF(ISBLANK(I7),\" \",LOOKUP(I7,'[1]FP24 Pay Items'!$B:$B,'[1]FP24 Pay Items'!$E:$E))","v":"ROADWAY AGGREGATE, METHOD 2"},{"$f":"IF(ISBLANK(J7),\" \",LOOKUP(J7,'[1]FP24 Pay Items'!$B:$B,'[1]FP24 Pay Items'!$E:$E))","v":"ASPHALT CONCRETE PAVEMENT, GYRATORY MIX, 3/4-INCH NOMINAL MAXIMUM SIZE AGGREGATE, 0.3 TO <3 MILLION ESAL"},{"$f":"IF(ISBLANK(K7),\" \",LOOKUP(K7,'[1]FP24 Pay Items'!$B:$B,'[1]FP24 Pay Items'!$E:$E))","v":"ANTISTRIP ADDITIVE, TYPE 3"},{"$f":"IF(ISBLANK(L7),\" \",LOOKUP(L7,'[1]FP24 Pay Items'!$B:$B,'[1]FP24 Pay Items'!$E:$E))","v":"FOG SEAL"},{"$f":"IF(ISBLANK(M7),\" \",LOOKUP(M7,'[1]FP24 Pay Items'!$B:$B,'[1]FP24 Pay Items'!$E:$E))","v":"PRIME COAT, METHOD 1"},{"$f":"IF(ISBLANK(N7),\" \",LOOKUP(N7,'[1]FP24 Pay Items'!$B:$B,'[1]FP24 Pay Items'!$E:$E))","v":"TACK COAT"}]
[]
[]
[]
["Rows from"]
["Surfacing",null,null,null,null,null,null,{"$f":"IF(ISBLANK(H7),\" \",LOOKUP(H7,'[1]FP24 Pay Items'!$B:$B,'[1]FP24 Pay Items'!$F:$F))","v":"SQYD"},{"$f":"IF(ISBLANK(I7),\" \",LOOKUP(I7,'[1]FP24 Pay Items'!$B:$B,'[1]FP24 Pay Items'!$F:$F))","v":"TON"},{"$f":"IF(ISBLANK(J7),\" \",LOOKUP(J7,'[1]FP24 Pay Items'!$B:$B,'[1]FP24 Pay Items'!$F:$F))","v":"TON"},{"$f":"IF(ISBLANK(K7),\" \",LOOKUP(K7,'[1]FP24 Pay Items'!$B:$B,'[1]FP24 Pay Items'!$F:$F))","v":"TON"},{"$f":"IF(ISBLANK(L7),\" \",LOOKUP(L7,'[1]FP24 Pay Items'!$B:$B,'[1]FP24 Pay Items'!$F:$F))","v":"TON"},{"$f":"IF(ISBLANK(M7),\" \",LOOKUP(M7,'[1]FP24 Pay Items'!$B:$B,'[1]FP24 Pay Items'!$F:$F))","v":"SQYD"},{"$f":"IF(ISBLANK(N7),\" \",LOOKUP(N7,'[1]FP24 Pay Items'!$B:$B,'[1]FP24 Pay Items'!$F:$F))","v":"TON"}]
[null,{"$f":"IF(A15=\"\",\"\",+A15)","v":""},null,null,{"$f":"IF(A14=\"\",\"\",INDIRECT(CONCATENATE($A$13,\"!\",\"B\",A14)))","v":""},{"$f":"IF(E14=\"\",\"\",\"-\")","v":""},{"$f":"IF(A14=\"\",\"\",INDIRECT(CONCATENATE($A$13,\"!\",\"b\",B14)))","v":""},{"$f":"IF(F14=\"\",\"\",ROUND(SUM(INDIRECT(CONCATENATE($A$13,\"!\",\"AU\",$B14))),0))","v":""},{"$f":"IF(F14=\"\",\"\",ROUND(SUM(INDIRECT(CONCATENATE($A$13,\"!\",\"AL\",$B14))),0))","v":""},{"$f":"IF(F14=\"\",\"\",ROUND(SUM(INDIRECT(CONCATENATE($A$13,\"!\",\"AM\",$B14))),0))","v":""},{"$f":"IF(F14=\"\",\"\",ROUND(SUM(INDIRECT(CONCATENATE($A$13,\"!\",\"AN\",$B14))),0))","v":""},{"$f":"IF(F14=\"\",\"\",ROUND(SUM(INDIRECT(CONCATENATE($A$13,\"!\",\"AO\",$B14))),0))","v":""},{"$f":"IF(F14=\"\",\"\",ROUND(SUM(INDIRECT(CONCATENATE($A$13,\"!\",\"AP\",$B14))),0))","v":""},{"$f":"IF(F14=\"\",\"\",ROUND(SUM(INDIRECT(CONCATENATE($A$13,\"!\",\"AR\",$B14))),0))","v":""}]
[null,{"$f":"IF(A16=\"\",\"\",+A16)","v":""},null,null,{"$f":"IF(A15=\"\",\"\",INDIRECT(CONCATENATE($A$13,\"!\",\"B\",A15)))","v":""},"",{"$f":"IF(A15=\"\",\"\",INDIRECT(CONCATENATE($A$13,\"!\",\"b\",B15)))","v":""},{"$f":"IF(F15=\"\",\"\",ROUND(SUM(INDIRECT(CONCATENATE($A$13,\"!\",\"AU\",$B15))),0))","v":""},{"$f":"IF(F15=\"\",\"\",ROUND(SUM(INDIRECT(CONCATENATE($A$13,\"!\",\"AL\",$B15))),0))","v":""},{"$f":"IF(F15=\"\",\"\",ROUND(SUM(INDIRECT(CONCATENATE($A$13,\"!\",\"AM\",$B15))),0))","v":""},{"$f":"IF(F15=\"\",\"\",ROUND(SUM(INDIRECT(CONCATENATE($A$13,\"!\",\"AN\",$B15))),0))","v":""},{"$f":"IF(F15=\"\",\"\",ROUND(SUM(INDIRECT(CONCATENATE($A$13,\"!\",\"AO\",$B15))),0))","v":""},{"$f":"IF(F15=\"\",\"\",ROUND(SUM(INDIRECT(CONCATENATE($A$13,\"!\",\"AP\",$B15))),0))","v":""},{"$f":"IF(F15=\"\",\"\",ROUND(SUM(INDIRECT(CONCATENATE($A$13,\"!\",\"AR\",$B15))),0))","v":""}]
[null,{"$f":"IF(A17=\"\",\"\",+A17)","v":""},null,null,"","","",{"$f":"IF(F16=\"\",\"\",ROUND(SUM(INDIRECT(CONCATENATE($A$13,\"!\",\"AU\",$B16))),0))","v":""},{"$f":"IF(F16=\"\",\"\",ROUND(SUM(INDIRECT(CONCATENATE($A$13,\"!\",\"AL\",$B16))),0))","v":""},{"$f":"IF(F16=\"\",\"\",ROUND(SUM(INDIRECT(CONCATENATE($A$13,\"!\",\"AM\",$B16))),0))","v":""},{"$f":"IF(F16=\"\",\"\",ROUND(SUM(INDIRECT(CONCATENATE($A$13,\"!\",\"AN\",$B16))),0))","v":""},{"$f":"IF(F16=\"\",\"\",ROUND(SUM(INDIRECT(CONCATENATE($A$13,\"!\",\"AO\",$B16))),0))","v":""},{"$f":"IF(F16=\"\",\"\",ROUND(SUM(INDIRECT(CONCATENATE($A$13,\"!\",\"AP\",$B16))),0))","v":""},{"$f":"IF(F16=\"\",\"\",ROUND(SUM(INDIRECT(CONCATENATE($A$13,\"!\",\"AR\",$B16))),0))","v":""}]
[null,"",null,null,"","","","","","","","","",""]
[null,"",null,null,"","","","","","","","","",""]
[null,"",null,null,"","","","","","","","","",""]
[null,"",null,null,"","","","","","","","","",""]
[null,"",null,null,"","","","","","","","","",""]
[null,"",null,null,"","","","","","","","","",""]
[null,"",null,null,"","","","","","","","","",""]
[null,"",null,null,"","","","","","","","","",""]
[null,"",null,null,"","","","","","","","","",""]
[null,{"$f":"IF(A27=\"\",\"\",+A27)","v":""},null,null,"","","","","","","","","",""]
[null,"",null,null,"","","","","","","","","",""]
[null,null,null,null,"","",null,"","","","","","",""]
["Surfacing_Secondary",null,null,null,"Secondary Alignment"]
[null,{"$f":"IF(A31=\"\",\"\",+A31)","v":""},null,null,{"$f":"IF(A30=\"\",\"\",INDIRECT(CONCATENATE($A$29,\"!\",\"B\",A30)))","v":""},"",{"$f":"IF(A30=\"\",\"\",INDIRECT(CONCATENATE($A$29,\"!\",\"b\",B30)))","v":""},{"$f":"IF(F30=\"\",\"\",ROUND(SUM(INDIRECT(CONCATENATE($A$29,\"!\",\"AU\",$B30))),0))","v":""},{"$f":"IF(F30=\"\",\"\",ROUND(SUM(INDIRECT(CONCATENATE($A$29,\"!\",\"AL\",$B30))),0))","v":""},{"$f":"IF(F30=\"\",\"\",ROUND(SUM(INDIRECT(CONCATENATE($A$29,\"!\",\"AM\",$B30))),0))","v":""},{"$f":"IF(F30=\"\",\"\",ROUND(SUM(INDIRECT(CONCATENATE($A$29,\"!\",\"AN\",$B30))),0))","v":""},{"$f":"IF(F30=\"\",\"\",ROUND(SUM(INDIRECT(CONCATENATE($A$29,\"!\",\"AO\",$B30))),0))","v":""},{"$f":"IF(F30=\"\",\"\",ROUND(SUM(INDIRECT(CONCATENATE($A$29,\"!\",\"AP\",$B30))),0))","v":""},{"$f":"IF(F30=\"\",\"\",ROUND(SUM(INDIRECT(CONCATENATE($A$29,\"!\",\"AR\",$B30))),0))","v":""}]
[null,"",null,null,{"$f":"IF(A31=\"\",\"\",INDIRECT(CONCATENATE($A$29,\"!\",\"B\",A31)))","v":""},{"$f":"IF(E31=\"\",\"\",\"-\")","v":""},{"$f":"IF(A31=\"\",\"\",INDIRECT(CONCATENATE($A$29,\"!\",\"b\",B31)))","v":""},{"$f":"IF(F31=\"\",\"\",ROUND(SUM(INDIRECT(CONCATENATE($A$29,\"!\",\"AU\",$B31))),0))","v":""},{"$f":"IF(F31=\"\",\"\",ROUND(SUM(INDIRECT(CONCATENATE($A$29,\"!\",\"AL\",$B31))),0))","v":""},{"$f":"IF(F31=\"\",\"\",ROUND(SUM(INDIRECT(CONCATENATE($A$29,\"!\",\"AM\",$B31))),0))","v":""},{"$f":"IF(F31=\"\",\"\",ROUND(SUM(INDIRECT(CONCATENATE($A$29,\"!\",\"AN\",$B31))),0))","v":""},{"$f":"IF(F31=\"\",\"\",ROUND(SUM(INDIRECT(CONCATENATE($A$29,\"!\",\"AO\",$B31))),0))","v":""},{"$f":"IF(F31=\"\",\"\",ROUND(SUM(INDIRECT(CONCATENATE($A$29,\"!\",\"AP\",$B31))),0))","v":""},{"$f":"IF(F31=\"\",\"\",ROUND(SUM(INDIRECT(CONCATENATE($A$29,\"!\",\"AR\",$B31))),0))","v":""}]
[null,"",null,null,"","","","","","","","","",""]
[null,"",null,null,"","","","","","","","","",""]
[null,"",null,null,"","","","","","","","","",""]
[null,"",null,null,"","","","","","","","","",""]
[null,"",null,null,"","","","","","","","","",""]
[null,"",null,null,{"$f":"IF(A37=\"\",\"\",INDIRECT(CONCATENATE($A$29,\"!\",\"B\",A37)))","v":""},{"$f":"IF(E37=\"\",\"\",\"-\")","v":""},{"$f":"IF(A37=\"\",\"\",INDIRECT(CONCATENATE($A$29,\"!\",\"b\",B37)))","v":""},"","","","","","",""]
[null,"",null,null,"","","","","","","","","",""]
[null,"",null,null,"","","","","","","","","",""]
[null,"",null,null,"","","","","","","","","",""]
[null,"",null,null,{"$f":"IF(A41=\"\",\"\",INDIRECT(CONCATENATE($A$29,\"!\",\"B\",A41)))","v":""},{"$f":"IF(E41=\"\",\"\",\"-\")","v":""},{"$f":"IF(A41=\"\",\"\",INDIRECT(CONCATENATE($A$29,\"!\",\"b\",B41)))","v":""},"","","","","","",""]
[null,"",null,null,"","","","","","","","","",""]
[null,"",null,null,"","","","","","","","","",""]
[null,""]
[null,"",null,null,"TOTALS",null,null,{"$f":"SUM(H14:H44)","v":0},0,0,0,0,0,0]
[null,{"$f":"IF(A47=\"\",\"\",+A47)","v":""}]
[null,{"$f":"IF(A48=\"\",\"\",+A48)","v":""},null,null,"Values used for estimating purposes:"]
[null,{"$f":"IF(A49=\"\",\"\",+A49)","v":""},null,null,null,null,null,"Aggregate base . . . .",{"$f":"CONCATENATE('manual inputs'!C4,\" \",'manual inputs'!D4)","v":"139 lb/ft3"}]
[null,{"$f":"IF(A51=\"\",\"\",+A51)","v":""},null,null,null,null,null,"Asphalt concrete pavement . . . .",{"$f":"CONCATENATE('manual inputs'!C5,\" \",'manual inputs'!D5)","v":"145.2 lb/ft3"}]
[null,null,null,null,null,null,null,"Antistrip . . . .",{"$f":"CONCATENATE('manual inputs'!C6*100,\"\", \"% of weight of mix\")","v":"1% of weight of mix"}]
[null,null,null,null,null,null,null,"Fog seal . . . .",{"$f":"CONCATENATE('manual inputs'!C15,\" \",'manual inputs'!D15,\" (\",'manual inputs'!C16,\" \",'manual inputs'!D16,\")\")","v":"0.1 gal/yd2 (233 gal/ton)"}]
[null,null,null,null,null,null,null,"Prime coat . . . .",{"$f":"IF('manual inputs'!C19=\"ASPHALT EMULSION\",CONCATENATE('manual inputs'!C9,\" \",'manual inputs'!D9,\" (\",'manual inputs'!C10,\" \",'manual inputs'!D10,\")\"),CONCATENATE('manual inputs'!C7,\" \",'manual inputs'!D7,\" (\",'manual inputs'!C8,\" \",'manual inputs'!D8,\")\"))","v":"0.27 gal/yd2 (233 gal/ton)"}]
[null,null,null,null,null,null,null,"Tack coat . . . .",{"$f":"CONCATENATE('manual inputs'!C13,\" \",'manual inputs'!D13,\" (\",'manual inputs'!C14,\" \",'manual inputs'!D14,\")\")","v":"0.1 gal/yd2 (233 gal/ton)"}]

{"sheet":"quantities report_secondary","index":6,"n_rows":0,"n_cols":0,"rows_kept":0,"cut":false,"hidden":false,"merged":[]}

{"sheet":"manual inputs_secondary","index":7,"n_rows":27,"n_cols":14,"rows_kept":27,"cut":false,"hidden":false,"merged":[[18,3,18,4],[19,3,19,4],[20,3,20,4],[21,3,21,4],[27,3,27,4],[0,1,0,4],[13,3,13,4],[14,3,14,4],[15,3,15,4],[1,1,1,4],[2,3,2,4],[3,3,3,4],[4,3,4,4],[5,3,5,4],[6,3,6,4],[16,3,16,4],[17,3,17,4],[7,3,7,4],[8,3,8,4],[9,3,9,4],[10,3,10,4],[11,3,11,4],[12,3,12,4]]}
[null,"Manually update any YELLOW cells"]
[null,"Conversion Factors",null,null,null,null,null,null,null,"Station Range",null,null,null,"Number of Rows"]
[null,"Material","Factor",null,null,null,null,null,"Add Starting Station",null,null,null,null,{"$f":"LOOKUP(2,1/('quantities report'!A:A<>\"\"),ROW('quantities report'!A:A))","v":{"$error":"#N/A"}}]
[null,"Aggregate Base",139,"lb/ft3"]
[null,"Asphalt Concrete Pavement",145.19999999999999,"lb/ft3"]
[null,"AntiStrip",0.01,null,null,null,null,null,null,null,null,null,null,"Aggregate Base"]
[null,"Prime Coat - Asphalt Cutbacks",0.33,"gal/yd2",null,null,null,null,null,null,null,null,null,"Asphalt Concrete Pavement"]
[null,"Prime Coat - Asphalt Cutbacks",251,"gal/ton",null,null,null,null,null,null,null,null,null,"N/A"]
[null,"Prime Coat - Asphalt Emulsion",0.27,"gal/yd2"]
[null,"Prime Coat - Asphalt Emulsion",233,"gal/ton",null,null,null,null,null,null,null,null,null,"Asphalt Cutbacks"]
[null,"Blotter",14.75,"lb/yd2",null,null,null,null,null,null,null,null,null,"Asphalt Emulsion"]
[null,"Blotter",0.2,"of total area"]
[null,"Tack Coat - Asphalt Emulsion",0.1,"gal/yd2",null,null,null,null,null,null,null,null,null,"Asphalt Cutbacks"]
[null,"Tack Coat - Asphalt Emulsion",233,"gal/ton",null,null,null,null,null,null,null,null,null,"Asphalt Emulsion"]
[null,"Fog Seal - Asphalt Emulsion",0.1,"gal/yd2"]
[null,"Fog Seal - Asphalt Emulsion",233,"gal/ton"]
[null,null,2000,"lb/ton"]
[]
[null,"Using Cutbacks or Emulsion","Asphalt Emulsion"]
[]
[null,"Existing Pavement",null,"inches"]
[]
[null,"Layer 1","N/A",null,"inches"]
[null,"Layer 2","N/A",null,"inches"]
[null,"Layer 3","N/A",null,"inches"]
[null,"Layer 4","N/A",null,"inches"]
[null,"Layer 5","N/A",null,"inches"]

{"sheet":"Surfacing_secondary","index":8,"n_rows":33,"n_cols":47,"rows_kept":33,"cut":false,"hidden":false,"merged":[[5,2,5,7],[5,9,5,14],[5,16,5,21],[5,23,5,28],[5,30,5,35],[5,44,5,46],[2,26,3,27],[2,30,3,31],[2,33,3,34],[2,44,3,45],[4,44,4,46],[4,2,4,7],[4,9,4,14],[4,16,4,21],[4,23,4,28],[4,30,4,35],[0,37,0,39],[1,0,1,1],[2,0,3,1],[2,2,3,3],[2,5,3,6],[2,9,3,10],[2,12,3,13],[2,16,3,17],[2,19,3,20],[2,23,3,24]]}
[null,null,null,null,null,null,null,null,null,null,null,null,null,null,null,null,null,null,null,null,null,null,null,null,null,null,null,null,null,null,null,null,null,null,null,null,null,"PAY COLUMNS",null,null,null,null,"(20% of area)"]
["TOTALS",null,{"$f":"SUM(C9:C33)","v":0},0,0,0,0,0,null,0,0,0,0,0,0,null,0,0,0,0,0,0,null,0,0,0,0,0,0,null,0,0,0,0,0,0,null,0,0,0,0,0,0,0,0,0,0]
["ORD Component Name",null,"Pavement Layer 1: ",null,{"$f":"VLOOKUP(C5,'manual inputs_secondary'!B2:E28,2,FALSE)","v":{"$error":"#N/A"}},"Shoulder Layer 1: ",null,{"$f":"VLOOKUP(C5,'manual inputs_secondary'!B2:E28,2,FALSE)","v":{"$error":"#N/A"}},null,"Pavement Layer 2: ",null,{"$f":"VLOOKUP(J5,'manual inputs_secondary'!$B$2:$E$28,2,FALSE)","v":{"$error":"#N/A"}},"Shoulder Layer 2: ",null,{"$f":"VLOOKUP(J5,'manual inputs_secondary'!$B$2:$E$28,2,FALSE)","v":{"$error":"#N/A"}},null,"Pavement Layer 3: ",null,{"$f":"VLOOKUP($Q$5,'manual inputs_secondary'!$B$2:$E$28,2,FALSE)","v":{"$error":"#N/A"}},"Shoulder Layer 3: ",null,{"$f":"VLOOKUP($Q$5,'manual inputs_secondary'!$B$2:$E$28,2,FALSE)","v":{"$error":"#N/A"}},null,"Pavement Layer 4: ",null,{"$f":"VLOOKUP($X$5,'manual inputs_secondary'!$B$2:$E$28,2,FALSE)","v":{"$error":"#N/A"}},"Shoulder Layer 4: ",null,{"$f":"VLOOKUP($X$5,'manual inputs_secondary'!$B$2:$E$28,2,FALSE)","v":{"$error":"#N/A"}},null,"Pavement Layer 5: ",null,{"$f":"VLOOKUP($AE$5,'manual inputs_secondary'!$B$2:$E$28,2,FALSE)","v":{"$error":"#N/A"}},"Shoulder Layer 5: ",null,{"$f":"VLOOKUP($AE$5,'manual inputs_secondary'!$B$2:$E$28,2,FALSE)","v":{"$error":"#N/A"}},null,null,null,null,{"$f":"VLOOKUP(AO5,'manual inputs_secondary'!$B$2:$E$28,2,FALSE)","v":0.1},{"$f":"VLOOKUP(AP5,'manual inputs_secondary'!$B$2:$E$28,2,FALSE)","v":0.27},{"$f":"VLOOKUP(AQ5,'manual inputs_secondary'!$B$2:$E$28,2,FALSE)","v":14.75},{"$f":"VLOOKUP(AR5,'manual inputs_secondary'!$B$2:$E$28,2,FALSE)","v":0.1},"Total Exist Pvmt Layer 1: ",null,{"$f":"VLOOKUP(AS5,'manual inputs_secondary'!$B$2:$E$28,2,FALSE)","v":0}]
[null,null,null,null,{"$f":"VLOOKUP(C5,'manual inputs_secondary'!B2:E270,3,FALSE)","v":{"$error":"#N/A"}},null,null,{"$f":"VLOOKUP(C5,'manual inputs_secondary'!B2:E270,3,FALSE)","v":{"$error":"#N/A"}},null,null,null,{"$f":"VLOOKUP(J5,'manual inputs_secondary'!$B$2:$E$28,3,FALSE)","v":{"$error":"#N/A"}},null,null,{"$f":"VLOOKUP(J5,'manual inputs_secondary'!$B$2:$E$28,3,FALSE)","v":{"$error":"#N/A"}},null,null,null,{"$f":"VLOOKUP($Q$5,'manual inputs_secondary'!$B$2:$E$28,3,FALSE)","v":{"$error":"#N/A"}},null,null,{"$f":"VLOOKUP($Q$5,'manual inputs_secondary'!$B$2:$E$28,3,FALSE)","v":{"$error":"#N/A"}},null,null,null,{"$f":"VLOOKUP($X$5,'manual inputs_secondary'!$B$2:$E$28,3,FALSE)","v":{"$error":"#N/A"}},null,null,{"$f":"VLOOKUP($X$5,'manual inputs_secondary'!$B$2:$E$28,3,FALSE)","v":{"$error":"#N/A"}},null,null,null,{"$f":"VLOOKUP($AE$5,'manual inputs_secondary'!$B$2:$E$28,3,FALSE)","v":{"$error":"#N/A"}},null,null,{"$f":"VLOOKUP($AE$5,'manual inputs_secondary'!$B$2:$E$28,3,FALSE)","v":{"$error":"#N/A"}},null,null,null,null,{"$f":"VLOOKUP(AO5,'manual inputs_secondary'!$B$2:$E$28,3,FALSE)","v":"gal/yd2"},{"$f":"VLOOKUP(AP5,'manual inputs_secondary'!$B$2:$E$28,3,FALSE)","v":"gal/yd2"},{"$f":"VLOOKUP(AQ5,'manual inputs_secondary'!$B$2:$E$28,3,FALSE)","v":"lb/yd2"},{"$f":"VLOOKUP(AR5,'manual inputs_secondary'!$B$2:$E$28,3,FALSE)","v":"gal/yd2"},null,null,{"$f":"VLOOKUP(AS5,'manual inputs_secondary'!$B$2:$E$28,3,FALSE)","v":"inches"}]
[null,null,{"$f":"LOOKUP(C6,'manual inputs_secondary'!$B$23:$B$27,'manual inputs_secondary'!C23:C27)","v":"N/A"},null,null,null,null,null,"Layer 1 Total",{"$f":"LOOKUP(J6,'manual inputs_secondary'!$B$23:$B$27,'manual inputs_secondary'!C23:C27)","v":"N/A"},null,null,null,null,null,"Layer 2 Total",{"$f":"LOOKUP(Q6,'manual inputs_secondary'!B23:B27,'manual inputs_secondary'!C23:C27)","v":"N/A"},null,null,null,null,null,"Layer 3 Total",{"$f":"LOOKUP(X6,'manual inputs_secondary'!B23:B27,'manual inputs_secondary'!C23:C27)","v":"N/A"},null,null,null,null,null,"Layer 4 Total",{"$f":"LOOKUP(AE6,'manual inputs_secondary'!B23:B27,'manual inputs_secondary'!C23:C27)","v":"N/A"},null,null,null,null,null,"Layer 5 Total","Total Aggregate Base","Total Asphalt Concrete Pavement","ANTISTRIP","Fog Seal - Asphalt Emulsion",{"$f":"IF('manual inputs_secondary'!C19=\"Asphalt Emulsion\",'manual inputs_secondary'!B9,'manual inputs_secondary'!B7)","v":"Prime Coat - Asphalt Emulsion"},"Blotter","Tack Coat - Asphalt Emulsion","Existing Pavement"]
[null,null,"Layer 1",null,null,null,null,null,null,"Layer 2",null,null,null,null,null,null,"Layer 3",null,null,null,null,null,null,"Layer 4",null,null,null,null,null,null,"Layer 5"]
[null,null,"CUYD","CUFT","TON","CUYD","CUFT","TON","TON","CUYD","CUFT","TON","CUYD","CUFT","TON","TON","CUYD","CUFT","TON","CUYD","CUFT","TON","TON","CUYD","CUFT","TON","CUYD","CUFT","TON","TON","CUYD","CUFT","TON","CUYD","CUFT","TON","TON","TON","TON","TON","TON","SQYD","TON","TON","CUYD","CUFT","SQYD"]
[null,{"$f":"IFERROR(INDEX('manual inputs_secondary'!J:J,SMALL(IF('manual inputs_secondary'!J:J<>\"\",ROW('manual inputs_secondary'!J:J)),ROW('manual inputs_secondary'!2:2))),\"\")","v":""}]
[null,{"$f":"IFERROR(INDEX('manual inputs_secondary'!J:J,SMALL(IF('manual inputs_secondary'!J:J<>\"\",ROW('manual inputs_secondary'!J:J)),ROW('manual inputs_secondary'!3:3))),\"\")","v":""},{"$f":"IF($C$5=\"n/a\",\"\",IF(B9=\"\",\"\",IFERROR(INDEX('quantities report'!$D$2:$D$9877,SMALL(IF('quantities report'!$A$2:$A$9877=C$3,ROW('quantities report'!$A$2:$A$9877)-1,\"\"),ROWS($B$9:$B9))),\"0\")))","v":""},{"$f":"IF($C9=\"\",\" \",(C9*27))","v":" "},{"$f":"IF($C9=\"\",\" \",(D9*$E$3/'manual inputs'!$C$17))","v":" "},{"$f":"IF($C$5=\"n/a\",\"\",IF(B9=\"\",\"\",IFERROR(INDEX('quantities report'!$D$2:$D$9877,SMALL(IF('quantities report'!$A$2:$A$9877=F$3,ROW('quantities report'!$A$2:$A$9877)-1,\"\"),ROWS($B$9:$B9))),\"0\")))","v":""},{"$f":"IF($F9=\"\",\" \",(F9*27))","v":" "},{"$f":"IF($F9=\"\",\" \",(G9*$H$3/'manual inputs'!$C$17))","v":" "},{"$f":"IF($C$5=\"N/A\",\"\",IF($B9=\"\",\"\",($H9+$E9)))","v":""},{"$f":"IF($J$5=\"n/a\",\"\",IF(B9=\"\",\"\",IFERROR(INDEX('quantities report'!$D$2:$D$9877,SMALL(IF('quantities report'!$A$2:$A$9877=J$3,ROW('quantities report'!$A$2:$A$9877)-1,\"\"),ROWS($B$9:$B9))),\"0\")))","v":""},{"$f":"IF($J9=\"\",\" \",(J9*27))","v":" "},{"$f":"IF($J9=\"\",\" \",(K9*$L$3/'manual inputs'!$C$17))","v":" "},{"$f":"IF($J$5=\"n/a\",\"\",IF(B9=\"\",\"\",IFERROR(INDEX('quantities report'!$D$2:$D$9877,SMALL(IF('quantities report'!$A$2:$A$9877=M$3,ROW('quantities report'!$A$2:$A$9877)-1,\"\"),ROWS($B$9:$B9))),\"0\")))","v":""},{"$f":"IF($M9=\"\",\" \",(M9*27))","v":" "},{"$f":"IF($M9=\"\",\" \",(N9*$O$3/'manual inputs'!$C$17))","v":" "},{"$f":"IF($J$5=\"N/A\",\"\",IF($B9=\"\",\"\",($O9+$L9)))","v":""},{"$f":"IF($Q$5=\"n/a\",\"\",IF(B9=\"\",\"\",IFERROR(INDEX('quantities report'!$D$2:$D$9877,SMALL(IF('quantities report'!$A$2:$A$9877=Q$3,ROW('quantities report'!$A$2:$A$9877)-1,\"\"),ROWS($B$9:$B9))),\"0\")))","v":""},{"$f":"IF($Q9=\"\",\" \",(Q9*27))","v":" "},{"$f":"IF($Q9=\"\",\" \",(R9*$S$3/'manual inputs'!$C$17))","v":" "},{"$f":"IF($Q$5=\"n/a\",\"\",IF(I9=\"\",\"\",IFERROR(INDEX('quantities report'!$D$2:$D$9877,SMALL(IF('quantities report'!$A$2:$A$9877=T$3,ROW('quantities report'!$A$2:$A$9877)-1,\"\"),ROWS($B$9:$B9))),\"0\")))","v":""},{"$f":"IF($T9=\"\",\" \",(T9*27))","v":" "},{"$f":"IF($T9=\"\",\" \",(U9*$V$3/'manual inputs'!$C$17))","v":" "},{"$f":"IF($Q$5=\"N/A\",\"\",IF($B9=\"\",\"\",($V9+$S9)))","v":""},{"$f":"IF($X$5=\"n/a\",\"\",IF(B9=\"\",\"\",IFERROR(INDEX('quantities report'!$D$2:$D$9877,SMALL(IF('quantities report'!$A$2:$A$9877=X$3,ROW('quantities report'!$A$2:$A$9877)-1,\"\"),ROWS($B$9:$B9))),\"0\")))","v":""},{"$f":"IF($X9=\"\",\" \",(X9*27))","v":" "},{"$f":"IF($X9=\"\",\" \",(Y9*$Z$3/'manual inputs'!$C$17))","v":" "},{"$f":"IF($X$5=\"n/a\",\"\",IF(B9=\"\",\"\",IFERROR(INDEX('quantities report'!$D$2:$D$9877,SMALL(IF('quantities report'!$A$2:$A$9877=AA$3,ROW('quantities report'!$A$2:$A$9877)-1,\"\"),ROWS($B$9:$B9))),\"0\")))","v":""},{"$f":"IF($AA9=\"\",\" \",(AA9*27))","v":" "},{"$f":"IF($AA9=\"\",\" \",(AB9*$AC$3/'manual inputs'!$C$17))","v":" "},{"$f":"IF($X$5=\"N/A\",\"\",IF($B9=\"\",\"\",($AC9+$Z9)))","v":""},{"$f":"IF($AE$5=\"n/a\",\"\",IF(B9=\"\",\"\",IFERROR(INDEX('quantities report'!$D$2:$D$9877,SMALL(IF('quantities report'!$A$2:$A$9877=AE$3,ROW('quantities report'!$A$2:$A$9877)-1,\"\"),ROWS($B$9:$B9))),\"0\")))","v":""},{"$f":"IF($AE9=\"\",\" \",(AE9*27))","v":" "},{"$f":"IF($AE9=\"\",\" \",(AF9*$AG$3/'manual inputs'!$C$17))","v":" "},{"$f":"IF($AE$5=\"n/a\",\"\",IF(B9=\"\",\"\",IFERROR(INDEX('quantities report'!$D$2:$D$9877,SMALL(IF('quantities report'!$A$2:$A$9877=AH$3,ROW('quantities report'!$A$2:$A$9877)-1,\"\"),ROWS($B$9:$B9))),\"0\")))","v":""},{"$f":"IF($AE9=\"\",\" \",(AH9*27))","v":" "},{"$f":"IF($AE9=\"\",\" \",(AI9*$AJ$3/'manual inputs'!$C$17))","v":" "},{"$f":"IF($AE$5=\"N/A\",\"\",IF($B9=\"\",\"\",($AJ9+$AG9)))","v":""},{"$f":"IF(B9=\"\",\" \",IF($C$5=\"Aggregate Base\",I9)+IF($Q$5=\"Aggregate Base\",W9)+IF($J$5=\"Aggregate Base\",P9)+IF($X$5=\"Aggregate Base\",AD9)+IF($AE$5=\"Aggregate Base\",AK9))","v":" "},{"$f":"IF(B9=\"\",\" \",IF($C$5=\"Asphalt Concrete Pavement\",I9)+IF($Q$5=\"Asphalt Concrete Pavement\",$W$9)+IF($J$5=\"Asphalt Concrete Pavement\",P9)+IF($X$5=\"Asphalt Concrete Pavement\",AD9)+IF($AE$5=\"Asphalt Concrete Pavement\",AK9))","v":" "},{"$f":"IF(B9=\"\",\"\",(AM9*'manual inputs_secondary'!$C$6))","v":""},{"$f":"IF($B9=\"\",\"\",(((($AM9*'manual inputs_secondary'!$C$17/$E$3)/('manual inputs_secondary'!$D$23/12))/9)*$AO$3)/'manual inputs_secondary'!$C$16)","v":""},{"$f":"IF($B9=\"\",\"\",(((($AM9*'manual inputs_secondary'!$C$17/$E$3)/('manual inputs_secondary'!$D$23/12))/9)))","v":""},{"$f":"IF($B9=\"\",\"\",((((($AM9*'manual inputs_secondary'!$C$17/$E$3)/('manual inputs_secondary'!$D$23/12))/9)*$AQ$3)/'manual inputs_secondary'!$C$17)*'manual inputs_secondary'!$C$12)","v":""},{"$f":"IF($B9=\"\",\"\",(((($AM9*'manual inputs_secondary'!$C$17/$E$3)/('manual inputs_secondary'!$D$23/12))/9)*$AO$3)/'manual inputs_secondary'!$C$16)","v":""},{"$f":"IF($C$5=\"n/a\",\"\",IF(B9=\"\",\"\",IFERROR(INDEX('quantities report_secondary'!$D$2:$D$9877,SMALL(IF('quantities report_secondary'!$A$2:$A$9877=AS$3,ROW('quantities report_secondary'!$A$2:$A$9877)-1,\"\"),ROWS($B$9:$B9))),\"0\")))","v":""},{"$f":"IF($C9=\"\",\" \",(AS9*27))","v":" "},{"$f":"IF($C9=\"\",\" \",(AT9/('manual inputs_secondary'!$C$21/12)/9))","v":" "}]
[null,{"$f":"IFERROR(INDEX('manual inputs_secondary'!J:J,SMALL(IF('manual inputs_secondary'!J:J<>\"\",ROW('manual inputs_secondary'!J:J)),ROW('manual inputs_secondary'!4:4))),\"\")","v":""},{"$f":"IF($C$5=\"n/a\",\"\",IF(B10=\"\",\"\",IFERROR(INDEX('quantities report'!$D$2:$D$9877,SMALL(IF('quantities report'!$A$2:$A$9877=C$3,ROW('quantities report'!$A$2:$A$9877)-1,\"\"),ROWS($B$9:$B10))),\"0\")))","v":""},{"$f":"IF($C10=\"\",\" \",(C10*27))","v":" "},{"$f":"IF($C10=\"\",\" \",(D10*$E$3/'manual inputs'!$C$17))","v":" "},{"$f":"IF($C$5=\"n/a\",\"\",IF(B10=\"\",\"\",IFERROR(INDEX('quantities report'!$D$2:$D$9877,SMALL(IF('quantities report'!$A$2:$A$9877=F$3,ROW('quantities report'!$A$2:$A$9877)-1,\"\"),ROWS($B$9:$B10))),\"0\")))","v":""},{"$f":"IF($F10=\"\",\" \",(F10*27))","v":" "},{"$f":"IF($F10=\"\",\" \",(G10*$E$3/'manual inputs'!$C$17))","v":" "},{"$f":"IF($C$5=\"N/A\",\"\",IF(B10=\"\",\"\",($H10+$E10)))","v":""},{"$f":"IF($J$5=\"n/a\",\"\",IF(B10=\"\",\"\",IFERROR(INDEX('quantities report'!$D$2:$D$9877,SMALL(IF('quantities report'!$A$2:$A$9877=J$3,ROW('quantities report'!$A$2:$A$9877)-1,\"\"),ROWS($B$9:$B10))),\"0\")))","v":""},{"$f":"IF($J10=\"\",\" \",(J10*27))","v":" "},{"$f":"IF($J10=\"\",\" \",(K10*$L$3/'manual inputs'!$C$17))","v":" "},{"$f":"IF($J$5=\"n/a\",\"\",IF(B10=\"\",\"\",IFERROR(INDEX('quantities report'!$D$2:$D$9877,SMALL(IF('quantities report'!$A$2:$A$9877=M$3,ROW('quantities report'!$A$2:$A$9877)-1,\"\"),ROWS($B$9:$B10))),\"0\")))","v":""},{"$f":"IF($M10=\"\",\" \",(M10*27))","v":" "},{"$f":"IF($M10=\"\",\" \",(N10*$O$3/'manual inputs'!$C$17))","v":" "},"",{"$f":"IF($Q$5=\"n/a\",\"\",IF(B10=\"\",\"\",IFERROR(INDEX('quantities report'!$D$2:$D$9877,SMALL(IF('quantities report'!$A$2:$A$9877=Q$3,ROW('quantities report'!$A$2:$A$9877)-1,\"\"),ROWS($B$9:$B10))),\"0\")))","v":""},{"$f":"IF($Q10=\"\",\" \",(Q10*27))","v":" "},{"$f":"IF($Q10=\"\",\" \",(R10*$S$3/'manual inputs'!$C$17))","v":" "},{"$f":"IF($Q$5=\"n/a\",\"\",IF(I10=\"\",\"\",IFERROR(INDEX('quantities report'!$D$2:$D$9877,SMALL(IF('quantities report'!$A$2:$A$9877=T$3,ROW('quantities report'!$A$2:$A$9877)-1,\"\"),ROWS($B$9:$B10))),\"0\")))","v":""},{"$f":"IF($T10=\"\",\" \",(T10*27))","v":" "},{"$f":"IF($T10=\"\",\" \",(U10*$V$3/'manual inputs'!$C$17))","v":" "},"",{"$f":"IF($X$5=\"n/a\",\"\",IF(B10=\"\",\"\",IFERROR(INDEX('quantities report'!$D$2:$D$9877,SMALL(IF('quantities report'!$A$2:$A$9877=X$3,ROW('quantities report'!$A$2:$A$9877)-1,\"\"),ROWS($B$9:$B10))),\"0\")))","v":""},{"$f":"IF($X10=\"\",\" \",(X10*27))","v":" "},{"$f":"IF($X10=\"\",\" \",(Y10*$Z$3/'manual inputs'!$C$17))","v":" "},{"$f":"IF($X$5=\"n/a\",\"\",IF(B10=\"\",\"\",IFERROR(INDEX('quantities report'!$D$2:$D$9877,SMALL(IF('quantities report'!$A$2:$A$9877=AA$3,ROW('quantities report'!$A$2:$A$9877)-1,\"\"),ROWS($B$9:$B10))),\"0\")))","v":""},{"$f":"IF($AA10=\"\",\" \",(AA10*27))","v":" "},{"$f":"IF($AA10=\"\",\" \",(AB10*$AC$3/'manual inputs'!$C$17))","v":" "},"",{"$f":"IF($AE$5=\"n/a\",\"\",IF(B10=\"\",\"\",IFERROR(INDEX('quantities report'!$D$2:$D$9877,SMALL(IF('quantities report'!$A$2:$A$9877=AE$3,ROW('quantities report'!$A$2:$A$9877)-1,\"\"),ROWS($B$9:$B10))),\"0\")))","v":""},{"$f":"IF($AE10=\"\",\" \",(AE10*27))","v":" "},{"$f":"IF($AE10=\"\",\" \",(AF10*$AG$3/'manual inputs'!$C$17))","v":" "},{"$f":"IF($AE$5=\"n/a\",\"\",IF(B10=\"\",\"\",IFERROR(INDEX('quantities report'!$D$2:$D$9877,SMALL(IF('quantities report'!$A$2:$A$9877=AH$3,ROW('quantities report'!$A$2:$A$9877)-1,\"\"),ROWS($B$9:$B10))),\"0\")))","v":""},{"$f":"IF($AE10=\"\",\" \",(AH10*27))","v":" "},{"$f":"IF($AE10=\"\",\" \",(AI10*$AJ$3/'manual inputs'!$C$17))","v":" "},"",{"$f":"IF(B10=\"\",\" \",IF($C$5=\"Aggregate Base\",I10)+IF($Q$5=\"Aggregate Base\",W10)+IF($J$5=\"Aggregate Base\",P10)+IF($X$5=\"Aggregate Base\",AD10)+IF($AE$5=\"Aggregate Base\",AK10))","v":" "},{"$f":"IF(B10=\"\",\" \",IF($C$5=\"Asphalt Concrete Pavement\",I10)+IF($Q$5=\"Asphalt Concrete Pavement\",$W$9)+IF($J$5=\"Asphalt Concrete Pavement\",P10)+IF($X$5=\"Asphalt Concrete Pavement\",AD10)+IF($AE$5=\"Asphalt Concrete Pavement\",AK10))","v":" "},{"$f":"IF(B10=\"\",\"\",(AM10*'manual inputs_secondary'!$C$6))","v":""},{"$f":"IF($B10=\"\",\"\",(((($AM10*'manual inputs_secondary'!$C$17/$E$3)/('manual inputs_secondary'!$D$23/12))/9)*$AO$3)/'manual inputs_secondary'!$C$16)","v":""},{"$f":"IF($B10=\"\",\"\",(((($AM10*'manual inputs_secondary'!$C$17/$E$3)/('manual inputs_secondary'!$D$23/12))/9)))","v":""},{"$f":"IF($B10=\"\",\"\",((((($AM10*'manual inputs_secondary'!$C$17/$E$3)/('manual inputs_secondary'!$D$23/12))/9)*$AQ$3)/'manual inputs_secondary'!$C$17)*'manual inputs_secondary'!$C$12)","v":""},{"$f":"IF($B10=\"\",\"\",(((($AM10*'manual inputs_secondary'!$C$17/$E$3)/('manual inputs_secondary'!$D$23/12))/9)*$AO$3)/'manual inputs_secondary'!$C$16)","v":""},{"$f":"IF($C$5=\"n/a\",\"\",IF(B10=\"\",\"\",IFERROR(INDEX('quantities report_secondary'!$D$2:$D$9877,SMALL(IF('quantities report_secondary'!$A$2:$A$9877=AS$3,ROW('quantities report_secondary'!$A$2:$A$9877)-1,\"\"),ROWS($B$9:$B10))),\"0\")))","v":""},{"$f":"IF($C10=\"\",\" \",(AS10*27))","v":" "},{"$f":"IF($C10=\"\",\" \",(AT10/('manual inputs_secondary'!$C$21/12)/9))","v":" "}]
[null,{"$f":"IFERROR(INDEX('manual inputs_secondary'!J:J,SMALL(IF('manual inputs_secondary'!J:J<>\"\",ROW('manual inputs_secondary'!J:J)),ROW('manual inputs_secondary'!5:5))),\"\")","v":""},{"$f":"IF($C$5=\"n/a\",\"\",IF(B11=\"\",\"\",IFERROR(INDEX('quantities report'!$D$2:$D$9877,SMALL(IF('quantities report'!$A$2:$A$9877=C$3,ROW('quantities report'!$A$2:$A$9877)-1,\"\"),ROWS($B$9:$B11))),\"0\")))","v":""}," ",{"$f":"IF($C11=\"\",\" \",(D11*$E$3/'manual inputs'!$C$17))","v":" "},{"$f":"IF($C$5=\"n/a\",\"\",IF(B11=\"\",\"\",IFERROR(INDEX('quantities report'!$D$2:$D$9877,SMALL(IF('quantities report'!$A$2:$A$9877=F$3,ROW('quantities report'!$A$2:$A$9877)-1,\"\"),ROWS($B$9:$B11))),\"0\")))","v":""}," ",{"$f":"IF($F11=\"\",\" \",(G11*$E$3/'manual inputs'!$C$17))","v":" "},"",{"$f":"IF($J$5=\"n/a\",\"\",IF(B11=\"\",\"\",IFERROR(INDEX('quantities report'!$D$2:$D$9877,SMALL(IF('quantities report'!$A$2:$A$9877=J$3,ROW('quantities report'!$A$2:$A$9877)-1,\"\"),ROWS($B$9:$B11))),\"0\")))","v":""}," ",{"$f":"IF($J11=\"\",\" \",(K11*$L$3/'manual inputs'!$C$17))","v":" "},{"$f":"IF($J$5=\"n/a\",\"\",IF(B11=\"\",\"\",IFERROR(INDEX('quantities report'!$D$2:$D$9877,SMALL(IF('quantities report'!$A$2:$A$9877=M$3,ROW('quantities report'!$A$2:$A$9877)-1,\"\"),ROWS($B$9:$B11))),\"0\")))","v":""}," ",{"$f":"IF($M11=\"\",\" \",(N11*$O$3/'manual inputs'!$C$17))","v":" "},"",{"$f":"IF($Q$5=\"n/a\",\"\",IF(B11=\"\",\"\",IFERROR(INDEX('quantities report'!$D$2:$D$9877,SMALL(IF('quantities report'!$A$2:$A$9877=Q$3,ROW('quantities report'!$A$2:$A$9877)-1,\"\"),ROWS($B$9:$B11))),\"0\")))","v":""}," ",{"$f":"IF($Q11=\"\",\" \",(R11*$S$3/'manual inputs'!$C$17))","v":" "},{"$f":"IF($Q$5=\"n/a\",\"\",IF(I11=\"\",\"\",IFERROR(INDEX('quantities report'!$D$2:$D$9877,SMALL(IF('quantities report'!$A$2:$A$9877=T$3,ROW('quantities report'!$A$2:$A$9877)-1,\"\"),ROWS($B$9:$B11))),\"0\")))","v":""}," ",{"$f":"IF($T11=\"\",\" \",(U11*$V$3/'manual inputs'!$C$17))","v":" "},"",{"$f":"IF($X$5=\"n/a\",\"\",IF(B11=\"\",\"\",IFERROR(INDEX('quantities report'!$D$2:$D$9877,SMALL(IF('quantities report'!$A$2:$A$9877=X$3,ROW('quantities report'!$A$2:$A$9877)-1,\"\"),ROWS($B$9:$B11))),\"0\")))","v":""}," ",{"$f":"IF($X11=\"\",\" \",(Y11*$Z$3/'manual inputs'!$C$17))","v":" "},{"$f":"IF($X$5=\"n/a\",\"\",IF(B11=\"\",\"\",IFERROR(INDEX('quantities report'!$D$2:$D$9877,SMALL(IF('quantities report'!$A$2:$A$9877=AA$3,ROW('quantities report'!$A$2:$A$9877)-1,\"\"),ROWS($B$9:$B11))),\"0\")))","v":""}," ",{"$f":"IF($AA11=\"\",\" \",(AB11*$AC$3/'manual inputs'!$C$17))","v":" "},"",{"$f":"IF($AE$5=\"n/a\",\"\",IF(B11=\"\",\"\",IFERROR(INDEX('quantities report'!$D$2:$D$9877,SMALL(IF('quantities report'!$A$2:$A$9877=AE$3,ROW('quantities report'!$A$2:$A$9877)-1,\"\"),ROWS($B$9:$B11))),\"0\")))","v":""}," ",{"$f":"IF($AE11=\"\",\" \",(AF11*$AG$3/'manual inputs'!$C$17))","v":" "},{"$f":"IF($AE$5=\"n/a\",\"\",IF(B11=\"\",\"\",IFERROR(INDEX('quantities report'!$D$2:$D$9877,SMALL(IF('quantities report'!$A$2:$A$9877=AH$3,ROW('quantities report'!$A$2:$A$9877)-1,\"\"),ROWS($B$9:$B11))),\"0\")))","v":""}," ",{"$f":"IF($AE11=\"\",\" \",(AI11*$AJ$3/'manual inputs'!$C$17))","v":" "},""," "," ",{"$f":"IF(B11=\"\",\"\",(AM11*'manual inputs_secondary'!$C$6))","v":""},{"$f":"IF($B11=\"\",\"\",(((($AM11*'manual inputs_secondary'!$C$17/$E$3)/('manual inputs_secondary'!$D$23/12))/9)*$AO$3)/'manual inputs_secondary'!$C$16)","v":""},{"$f":"IF($B11=\"\",\"\",(((($AM11*'manual inputs_secondary'!$C$17/$E$3)/('manual inputs_secondary'!$D$23/12))/9)))","v":""},{"$f":"IF($B11=\"\",\"\",((((($AM11*'manual inputs_secondary'!$C$17/$E$3)/('manual inputs_secondary'!$D$23/12))/9)*$AQ$3)/'manual inputs_secondary'!$C$17)*'manual inputs_secondary'!$C$12)","v":""},{"$f":"IF($B11=\"\",\"\",(((($AM11*'manual inputs_secondary'!$C$17/$E$3)/('manual inputs_secondary'!$D$23/12))/9)*$AO$3)/'manual inputs_secondary'!$C$16)","v":""},{"$f":"IF($C$5=\"n/a\",\"\",IF(B11=\"\",\"\",IFERROR(INDEX('quantities report_secondary'!$D$2:$D$9877,SMALL(IF('quantities report_secondary'!$A$2:$A$9877=AS$3,ROW('quantities report_secondary'!$A$2:$A$9877)-1,\"\"),ROWS($B$9:$B11))),\"0\")))","v":""}," ",{"$f":"IF($C11=\"\",\" \",(AT11/('manual inputs_secondary'!$C$21/12)/9))","v":" "}]
[null,{"$f":"IFERROR(INDEX('manual inputs_secondary'!J:J,SMALL(IF('manual inputs_secondary'!J:J<>\"\",ROW('manual inputs_secondary'!J:J)),ROW('manual inputs_secondary'!6:6))),\"\")","v":""},{"$f":"IF($C$5=\"n/a\",\"\",IF(B12=\"\",\"\",IFERROR(INDEX('quantities report'!$D$2:$D$9877,SMALL(IF('quantities report'!$A$2:$A$9877=C$3,ROW('quantities report'!$A$2:$A$9877)-1,\"\"),ROWS($B$9:$B12))),\"0\")))","v":""}," ",{"$f":"IF($C12=\"\",\" \",(D12*$E$3/'manual inputs'!$C$17))","v":" "},{"$f":"IF($C$5=\"n/a\",\"\",IF(B12=\"\",\"\",IFERROR(INDEX('quantities report'!$D$2:$D$9877,SMALL(IF('quantities report'!$A$2:$A$9877=F$3,ROW('quantities report'!$A$2:$A$9877)-1,\"\"),ROWS($B$9:$B12))),\"0\")))","v":""}," ",{"$f":"IF($F12=\"\",\" \",(G12*$E$3/'manual inputs'!$C$17))","v":" "},"",{"$f":"IF($J$5=\"n/a\",\"\",IF(B12=\"\",\"\",IFERROR(INDEX('quantities report'!$D$2:$D$9877,SMALL(IF('quantities report'!$A$2:$A$9877=J$3,ROW('quantities report'!$A$2:$A$9877)-1,\"\"),ROWS($B$9:$B12))),\"0\")))","v":""}," ",{"$f":"IF($J12=\"\",\" \",(K12*$L$3/'manual inputs'!$C$17))","v":" "},{"$f":"IF($J$5=\"n/a\",\"\",IF(B12=\"\",\"\",IFERROR(INDEX('quantities report'!$D$2:$D$9877,SMALL(IF('quantities report'!$A$2:$A$9877=M$3,ROW('quantities report'!$A$2:$A$9877)-1,\"\"),ROWS($B$9:$B12))),\"0\")))","v":""}," ",{"$f":"IF($M12=\"\",\" \",(N12*$O$3/'manual inputs'!$C$17))","v":" "},"",{"$f":"IF($Q$5=\"n/a\",\"\",IF(B12=\"\",\"\",IFERROR(INDEX('quantities report'!$D$2:$D$9877,SMALL(IF('quantities report'!$A$2:$A$9877=Q$3,ROW('quantities report'!$A$2:$A$9877)-1,\"\"),ROWS($B$9:$B12))),\"0\")))","v":""}," ",{"$f":"IF($Q12=\"\",\" \",(R12*$S$3/'manual inputs'!$C$17))","v":" "},{"$f":"IF($Q$5=\"n/a\",\"\",IF(I12=\"\",\"\",IFERROR(INDEX('quantities report'!$D$2:$D$9877,SMALL(IF('quantities report'!$A$2:$A$9877=T$3,ROW('quantities report'!$A$2:$A$9877)-1,\"\"),ROWS($B$9:$B12))),\"0\")))","v":""}," ",{"$f":"IF($T12=\"\",\" \",(U12*$V$3/'manual inputs'!$C$17))","v":" "},"",{"$f":"IF($X$5=\"n/a\",\"\",IF(B12=\"\",\"\",IFERROR(INDEX('quantities report'!$D$2:$D$9877,SMALL(IF('quantities report'!$A$2:$A$9877=X$3,ROW('quantities report'!$A$2:$A$9877)-1,\"\"),ROWS($B$9:$B12))),\"0\")))","v":""}," ",{"$f":"IF($X12=\"\",\" \",(Y12*$Z$3/'manual inputs'!$C$17))","v":" "},{"$f":"IF($X$5=\"n/a\",\"\",IF(B12=\"\",\"\",IFERROR(INDEX('quantities report'!$D$2:$D$9877,SMALL(IF('quantities report'!$A$2:$A$9877=AA$3,ROW('quantities report'!$A$2:$A$9877)-1,\"\"),ROWS($B$9:$B12))),\"0\")))","v":""}," ",{"$f":"IF($AA12=\"\",\" \",(AB12*$AC$3/'manual inputs'!$C$17))","v":" "},"",{"$f":"IF($AE$5=\"n/a\",\"\",IF(B12=\"\",\"\",IFERROR(INDEX('quantities report'!$D$2:$D$9877,SMALL(IF('quantities report'!$A$2:$A$9877=AE$3,ROW('quantities report'!$A$2:$A$9877)-1,\"\"),ROWS($B$9:$B12))),\"0\")))","v":""}," ",{"$f":"IF($AE12=\"\",\" \",(AF12*$AG$3/'manual inputs'!$C$17))","v":" "},{"$f":"IF($AE$5=\"n/a\",\"\",IF(B12=\"\",\"\",IFERROR(INDEX('quantities report'!$D$2:$D$9877,SMALL(IF('quantities report'!$A$2:$A$9877=AH$3,ROW('quantities report'!$A$2:$A$9877)-1,\"\"),ROWS($B$9:$B12))),\"0\")))","v":""}," ",{"$f":"IF($AE12=\"\",\" \",(AI12*$AJ$3/'manual inputs'!$C$17))","v":" "},""," "," ",{"$f":"IF(B12=\"\",\"\",(AM12*'manual inputs_secondary'!$C$6))","v":""},{"$f":"IF($B12=\"\",\"\",(((($AM12*'manual inputs_secondary'!$C$17/$E$3)/('manual inputs_secondary'!$D$23/12))/9)*$AO$3)/'manual inputs_secondary'!$C$16)","v":""},{"$f":"IF($B12=\"\",\"\",(((($AM12*'manual inputs_secondary'!$C$17/$E$3)/('manual inputs_secondary'!$D$23/12))/9)))","v":""},{"$f":"IF($B12=\"\",\"\",((((($AM12*'manual inputs_secondary'!$C$17/$E$3)/('manual inputs_secondary'!$D$23/12))/9)*$AQ$3)/'manual inputs_secondary'!$C$17)*'manual inputs_secondary'!$C$12)","v":""},{"$f":"IF($B12=\"\",\"\",(((($AM12*'manual inputs_secondary'!$C$17/$E$3)/('manual inputs_secondary'!$D$23/12))/9)*$AO$3)/'manual inputs_secondary'!$C$16)","v":""},{"$f":"IF($C$5=\"n/a\",\"\",IF(B12=\"\",\"\",IFERROR(INDEX('quantities report_secondary'!$D$2:$D$9877,SMALL(IF('quantities report_secondary'!$A$2:$A$9877=AS$3,ROW('quantities report_secondary'!$A$2:$A$9877)-1,\"\"),ROWS($B$9:$B12))),\"0\")))","v":""}," ",{"$f":"IF($C12=\"\",\" \",(AT12/('manual inputs_secondary'!$C$21/12)/9))","v":" "}]
[null,{"$f":"IFERROR(INDEX('manual inputs_secondary'!J:J,SMALL(IF('manual inputs_secondary'!J:J<>\"\",ROW('manual inputs_secondary'!J:J)),ROW('manual inputs_secondary'!7:7))),\"\")","v":""},{"$f":"IF($C$5=\"n/a\",\"\",IF(B13=\"\",\"\",IFERROR(INDEX('quantities report'!$D$2:$D$9877,SMALL(IF('quantities report'!$A$2:$A$9877=C$3,ROW('quantities report'!$A$2:$A$9877)-1,\"\"),ROWS($B$9:$B13))),\"0\")))","v":""}," ",{"$f":"IF($C13=\"\",\" \",(D13*$E$3/'manual inputs'!$C$17))","v":" "},{"$f":"IF($C$5=\"n/a\",\"\",IF(B13=\"\",\"\",IFERROR(INDEX('quantities report'!$D$2:$D$9877,SMALL(IF('quantities report'!$A$2:$A$9877=F$3,ROW('quantities report'!$A$2:$A$9877)-1,\"\"),ROWS($B$9:$B13))),\"0\")))","v":""}," ",{"$f":"IF($F13=\"\",\" \",(G13*$E$3/'manual inputs'!$C$17))","v":" "},"",{"$f":"IF($J$5=\"n/a\",\"\",IF(B13=\"\",\"\",IFERROR(INDEX('quantities report'!$D$2:$D$9877,SMALL(IF('quantities report'!$A$2:$A$9877=J$3,ROW('quantities report'!$A$2:$A$9877)-1,\"\"),ROWS($B$9:$B13))),\"0\")))","v":""}," ",{"$f":"IF($J13=\"\",\" \",(K13*$L$3/'manual inputs'!$C$17))","v":" "},{"$f":"IF($J$5=\"n/a\",\"\",IF(B13=\"\",\"\",IFERROR(INDEX('quantities report'!$D$2:$D$9877,SMALL(IF('quantities report'!$A$2:$A$9877=M$3,ROW('quantities report'!$A$2:$A$9877)-1,\"\"),ROWS($B$9:$B13))),\"0\")))","v":""}," ",{"$f":"IF($M13=\"\",\" \",(N13*$O$3/'manual inputs'!$C$17))","v":" "},"",{"$f":"IF($Q$5=\"n/a\",\"\",IF(B13=\"\",\"\",IFERROR(INDEX('quantities report'!$D$2:$D$9877,SMALL(IF('quantities report'!$A$2:$A$9877=Q$3,ROW('quantities report'!$A$2:$A$9877)-1,\"\"),ROWS($B$9:$B13))),\"0\")))","v":""}," ",{"$f":"IF($Q13=\"\",\" \",(R13*$S$3/'manual inputs'!$C$17))","v":" "},{"$f":"IF($Q$5=\"n/a\",\"\",IF(I13=\"\",\"\",IFERROR(INDEX('quantities report'!$D$2:$D$9877,SMALL(IF('quantities report'!$A$2:$A$9877=T$3,ROW('quantities report'!$A$2:$A$9877)-1,\"\"),ROWS($B$9:$B13))),\"0\")))","v":""}," ",{"$f":"IF($T13=\"\",\" \",(U13*$V$3/'manual inputs'!$C$17))","v":" "},"",{"$f":"IF($X$5=\"n/a\",\"\",IF(B13=\"\",\"\",IFERROR(INDEX('quantities report'!$D$2:$D$9877,SMALL(IF('quantities report'!$A$2:$A$9877=X$3,ROW('quantities report'!$A$2:$A$9877)-1,\"\"),ROWS($B$9:$B13))),\"0\")))","v":""}," ",{"$f":"IF($X13=\"\",\" \",(Y13*$Z$3/'manual inputs'!$C$17))","v":" "},{"$f":"IF($X$5=\"n/a\",\"\",IF(B13=\"\",\"\",IFERROR(INDEX('quantities report'!$D$2:$D$9877,SMALL(IF('quantities report'!$A$2:$A$9877=AA$3,ROW('quantities report'!$A$2:$A$9877)-1,\"\"),ROWS($B$9:$B13))),\"0\")))","v":""}," ",{"$f":"IF($AA13=\"\",\" \",(AB13*$AC$3/'manual inputs'!$C$17))","v":" "},"",{"$f":"IF($AE$5=\"n/a\",\"\",IF(B13=\"\",\"\",IFERROR(INDEX('quantities report'!$D$2:$D$9877,SMALL(IF('quantities report'!$A$2:$A$9877=AE$3,ROW('quantities report'!$A$2:$A$9877)-1,\"\"),ROWS($B$9:$B13))),\"0\")))","v":""}," ",{"$f":"IF($AE13=\"\",\" \",(AF13*$AG$3/'manual inputs'!$C$17))","v":" "},{"$f":"IF($AE$5=\"n/a\",\"\",IF(B13=\"\",\"\",IFERROR(INDEX('quantities report'!$D$2:$D$9877,SMALL(IF('quantities report'!$A$2:$A$9877=AH$3,ROW('quantities report'!$A$2:$A$9877)-1,\"\"),ROWS($B$9:$B13))),\"0\")))","v":""}," ",{"$f":"IF($AE13=\"\",\" \",(AI13*$AJ$3/'manual inputs'!$C$17))","v":" "},""," "," ",{"$f":"IF(B13=\"\",\"\",(AM13*'manual inputs_secondary'!$C$6))","v":""},{"$f":"IF($B13=\"\",\"\",(((($AM13*'manual inputs_secondary'!$C$17/$E$3)/('manual inputs_secondary'!$D$23/12))/9)*$AO$3)/'manual inputs_secondary'!$C$16)","v":""},{"$f":"IF($B13=\"\",\"\",(((($AM13*'manual inputs_secondary'!$C$17/$E$3)/('manual inputs_secondary'!$D$23/12))/9)))","v":""},{"$f":"IF($B13=\"\",\"\",((((($AM13*'manual inputs_secondary'!$C$17/$E$3)/('manual inputs_secondary'!$D$23/12))/9)*$AQ$3)/'manual inputs_secondary'!$C$17)*'manual inputs_secondary'!$C$12)","v":""},{"$f":"IF($B13=\"\",\"\",(((($AM13*'manual inputs_secondary'!$C$17/$E$3)/('manual inputs_secondary'!$D$23/12))/9)*$AO$3)/'manual inputs_secondary'!$C$16)","v":""},{"$f":"IF($C$5=\"n/a\",\"\",IF(B13=\"\",\"\",IFERROR(INDEX('quantities report_secondary'!$D$2:$D$9877,SMALL(IF('quantities report_secondary'!$A$2:$A$9877=AS$3,ROW('quantities report_secondary'!$A$2:$A$9877)-1,\"\"),ROWS($B$9:$B13))),\"0\")))","v":""}," ",{"$f":"IF($C13=\"\",\" \",(AT13/('manual inputs_secondary'!$C$21/12)/9))","v":" "}]
[null,{"$f":"IFERROR(INDEX('manual inputs_secondary'!J:J,SMALL(IF('manual inputs_secondary'!J:J<>\"\",ROW('manual inputs_secondary'!J:J)),ROW('manual inputs_secondary'!8:8))),\"\")","v":""},{"$f":"IF($C$5=\"n/a\",\"\",IF(B14=\"\",\"\",IFERROR(INDEX('quantities report'!$D$2:$D$9877,SMALL(IF('quantities report'!$A$2:$A$9877=C$3,ROW('quantities report'!$A$2:$A$9877)-1,\"\"),ROWS($B$9:$B14))),\"0\")))","v":""}," ",{"$f":"IF($C14=\"\",\" \",(D14*$E$3/'manual inputs'!$C$17))","v":" "},{"$f":"IF($C$5=\"n/a\",\"\",IF(B14=\"\",\"\",IFERROR(INDEX('quantities report'!$D$2:$D$9877,SMALL(IF('quantities report'!$A$2:$A$9877=F$3,ROW('quantities report'!$A$2:$A$9877)-1,\"\"),ROWS($B$9:$B14))),\"0\")))","v":""}," ",{"$f":"IF($F14=\"\",\" \",(G14*$E$3/'manual inputs'!$C$17))","v":" "},"",{"$f":"IF($J$5=\"n/a\",\"\",IF(B14=\"\",\"\",IFERROR(INDEX('quantities report'!$D$2:$D$9877,SMALL(IF('quantities report'!$A$2:$A$9877=J$3,ROW('quantities report'!$A$2:$A$9877)-1,\"\"),ROWS($B$9:$B14))),\"0\")))","v":""}," ",{"$f":"IF($J14=\"\",\" \",(K14*$L$3/'manual inputs'!$C$17))","v":" "},{"$f":"IF($J$5=\"n/a\",\"\",IF(B14=\"\",\"\",IFERROR(INDEX('quantities report'!$D$2:$D$9877,SMALL(IF('quantities report'!$A$2:$A$9877=M$3,ROW('quantities report'!$A$2:$A$9877)-1,\"\"),ROWS($B$9:$B14))),\"0\")))","v":""}," ",{"$f":"IF($M14=\"\",\" \",(N14*$O$3/'manual inputs'!$C$17))","v":" "},"",{"$f":"IF($Q$5=\"n/a\",\"\",IF(B14=\"\",\"\",IFERROR(INDEX('quantities report'!$D$2:$D$9877,SMALL(IF('quantities report'!$A$2:$A$9877=Q$3,ROW('quantities report'!$A$2:$A$9877)-1,\"\"),ROWS($B$9:$B14))),\"0\")))","v":""}," ",{"$f":"IF($Q14=\"\",\" \",(R14*$S$3/'manual inputs'!$C$17))","v":" "},{"$f":"IF($Q$5=\"n/a\",\"\",IF(I14=\"\",\"\",IFERROR(INDEX('quantities report'!$D$2:$D$9877,SMALL(IF('quantities report'!$A$2:$A$9877=T$3,ROW('quantities report'!$A$2:$A$9877)-1,\"\"),ROWS($B$9:$B14))),\"0\")))","v":""}," ",{"$f":"IF($T14=\"\",\" \",(U14*$V$3/'manual inputs'!$C$17))","v":" "},"",{"$f":"IF($X$5=\"n/a\",\"\",IF(B14=\"\",\"\",IFERROR(INDEX('quantities report'!$D$2:$D$9877,SMALL(IF('quantities report'!$A$2:$A$9877=X$3,ROW('quantities report'!$A$2:$A$9877)-1,\"\"),ROWS($B$9:$B14))),\"0\")))","v":""}," ",{"$f":"IF($X14=\"\",\" \",(Y14*$Z$3/'manual inputs'!$C$17))","v":" "},{"$f":"IF($X$5=\"n/a\",\"\",IF(B14=\"\",\"\",IFERROR(INDEX('quantities report'!$D$2:$D$9877,SMALL(IF('quantities report'!$A$2:$A$9877=AA$3,ROW('quantities report'!$A$2:$A$9877)-1,\"\"),ROWS($B$9:$B14))),\"0\")))","v":""}," ",{"$f":"IF($AA14=\"\",\" \",(AB14*$AC$3/'manual inputs'!$C$17))","v":" "},"",{"$f":"IF($AE$5=\"n/a\",\"\",IF(B14=\"\",\"\",IFERROR(INDEX('quantities report'!$D$2:$D$9877,SMALL(IF('quantities report'!$A$2:$A$9877=AE$3,ROW('quantities report'!$A$2:$A$9877)-1,\"\"),ROWS($B$9:$B14))),\"0\")))","v":""}," ",{"$f":"IF($AE14=\"\",\" \",(AF14*$AG$3/'manual inputs'!$C$17))","v":" "},{"$f":"IF($AE$5=\"n/a\",\"\",IF(B14=\"\",\"\",IFERROR(INDEX('quantities report'!$D$2:$D$9877,SMALL(IF('quantities report'!$A$2:$A$9877=AH$3,ROW('quantities report'!$A$2:$A$9877)-1,\"\"),ROWS($B$9:$B14))),\"0\")))","v":""}," ",{"$f":"IF($AE14=\"\",\" \",(AI14*$AJ$3/'manual inputs'!$C$17))","v":" "},""," "," ",{"$f":"IF(B14=\"\",\"\",(AM14*'manual inputs_secondary'!$C$6))","v":""},{"$f":"IF($B14=\"\",\"\",(((($AM14*'manual inputs_secondary'!$C$17/$E$3)/('manual inputs_secondary'!$D$23/12))/9)*$AO$3)/'manual inputs_secondary'!$C$16)","v":""},{"$f":"IF($B14=\"\",\"\",(((($AM14*'manual inputs_secondary'!$C$17/$E$3)/('manual inputs_secondary'!$D$23/12))/9)))","v":""},{"$f":"IF($B14=\"\",\"\",((((($AM14*'manual inputs_secondary'!$C$17/$E$3)/('manual inputs_secondary'!$D$23/12))/9)*$AQ$3)/'manual inputs_secondary'!$C$17)*'manual inputs_secondary'!$C$12)","v":""},{"$f":"IF($B14=\"\",\"\",(((($AM14*'manual inputs_secondary'!$C$17/$E$3)/('manual inputs_secondary'!$D$23/12))/9)*$AO$3)/'manual inputs_secondary'!$C$16)","v":""},{"$f":"IF($C$5=\"n/a\",\"\",IF(B14=\"\",\"\",IFERROR(INDEX('quantities report_secondary'!$D$2:$D$9877,SMALL(IF('quantities report_secondary'!$A$2:$A$9877=AS$3,ROW('quantities report_secondary'!$A$2:$A$9877)-1,\"\"),ROWS($B$9:$B14))),\"0\")))","v":""}," ",{"$f":"IF($C14=\"\",\" \",(AT14/('manual inputs_secondary'!$C$21/12)/9))","v":" "}]
[null,{"$f":"IFERROR(INDEX('manual inputs_secondary'!J:J,SMALL(IF('manual inputs_secondary'!J:J<>\"\",ROW('manual inputs_secondary'!J:J)),ROW('manual inputs_secondary'!9:9))),\"\")","v":""},{"$f":"IF($C$5=\"n/a\",\"\",IF(B15=\"\",\"\",IFERROR(INDEX('quantities report'!$D$2:$D$9877,SMALL(IF('quantities report'!$A$2:$A$9877=C$3,ROW('quantities report'!$A$2:$A$9877)-1,\"\"),ROWS($B$9:$B15))),\"0\")))","v":""}," ",{"$f":"IF($C15=\"\",\" \",(D15*$E$3/'manual inputs'!$C$17))","v":" "},{"$f":"IF($C$5=\"n/a\",\"\",IF(B15=\"\",\"\",IFERROR(INDEX('quantities report'!$D$2:$D$9877,SMALL(IF('quantities report'!$A$2:$A$9877=F$3,ROW('quantities report'!$A$2:$A$9877)-1,\"\"),ROWS($B$9:$B15))),\"0\")))","v":""}," ",{"$f":"IF($F15=\"\",\" \",(G15*$E$3/'manual inputs'!$C$17))","v":" "},"",{"$f":"IF($J$5=\"n/a\",\"\",IF(B15=\"\",\"\",IFERROR(INDEX('quantities report'!$D$2:$D$9877,SMALL(IF('quantities report'!$A$2:$A$9877=J$3,ROW('quantities report'!$A$2:$A$9877)-1,\"\"),ROWS($B$9:$B15))),\"0\")))","v":""}," ",{"$f":"IF($J15=\"\",\" \",(K15*$L$3/'manual inputs'!$C$17))","v":" "},{"$f":"IF($J$5=\"n/a\",\"\",IF(B15=\"\",\"\",IFERROR(INDEX('quantities report'!$D$2:$D$9877,SMALL(IF('quantities report'!$A$2:$A$9877=M$3,ROW('quantities report'!$A$2:$A$9877)-1,\"\"),ROWS($B$9:$B15))),\"0\")))","v":""}," ",{"$f":"IF($M15=\"\",\" \",(N15*$O$3/'manual inputs'!$C$17))","v":" "},"",{"$f":"IF($Q$5=\"n/a\",\"\",IF(B15=\"\",\"\",IFERROR(INDEX('quantities report'!$D$2:$D$9877,SMALL(IF('quantities report'!$A$2:$A$9877=Q$3,ROW('quantities report'!$A$2:$A$9877)-1,\"\"),ROWS($B$9:$B15))),\"0\")))","v":""}," ",{"$f":"IF($Q15=\"\",\" \",(R15*$S$3/'manual inputs'!$C$17))","v":" "},{"$f":"IF($Q$5=\"n/a\",\"\",IF(I15=\"\",\"\",IFERROR(INDEX('quantities report'!$D$2:$D$9877,SMALL(IF('quantities report'!$A$2:$A$9877=T$3,ROW('quantities report'!$A$2:$A$9877)-1,\"\"),ROWS($B$9:$B15))),\"0\")))","v":""}," ",{"$f":"IF($T15=\"\",\" \",(U15*$V$3/'manual inputs'!$C$17))","v":" "},"",{"$f":"IF($X$5=\"n/a\",\"\",IF(B15=\"\",\"\",IFERROR(INDEX('quantities report'!$D$2:$D$9877,SMALL(IF('quantities report'!$A$2:$A$9877=X$3,ROW('quantities report'!$A$2:$A$9877)-1,\"\"),ROWS($B$9:$B15))),\"0\")))","v":""}," ",{"$f":"IF($X15=\"\",\" \",(Y15*$Z$3/'manual inputs'!$C$17))","v":" "},{"$f":"IF($X$5=\"n/a\",\"\",IF(B15=\"\",\"\",IFERROR(INDEX('quantities report'!$D$2:$D$9877,SMALL(IF('quantities report'!$A$2:$A$9877=AA$3,ROW('quantities report'!$A$2:$A$9877)-1,\"\"),ROWS($B$9:$B15))),\"0\")))","v":""}," ",{"$f":"IF($AA15=\"\",\" \",(AB15*$AC$3/'manual inputs'!$C$17))","v":" "},"",{"$f":"IF($AE$5=\"n/a\",\"\",IF(B15=\"\",\"\",IFERROR(INDEX('quantities report'!$D$2:$D$9877,SMALL(IF('quantities report'!$A$2:$A$9877=AE$3,ROW('quantities report'!$A$2:$A$9877)-1,\"\"),ROWS($B$9:$B15))),\"0\")))","v":""}," ",{"$f":"IF($AE15=\"\",\" \",(AF15*$AG$3/'manual inputs'!$C$17))","v":" "},{"$f":"IF($AE$5=\"n/a\",\"\",IF(B15=\"\",\"\",IFERROR(INDEX('quantities report'!$D$2:$D$9877,SMALL(IF('quantities report'!$A$2:$A$9877=AH$3,ROW('quantities report'!$A$2:$A$9877)-1,\"\"),ROWS($B$9:$B15))),\"0\")))","v":""}," ",{"$f":"IF($AE15=\"\",\" \",(AI15*$AJ$3/'manual inputs'!$C$17))","v":" "},""," "," ",{"$f":"IF(B15=\"\",\"\",(AM15*'manual inputs_secondary'!$C$6))","v":""},{"$f":"IF($B15=\"\",\"\",(((($AM15*'manual inputs_secondary'!$C$17/$E$3)/('manual inputs_secondary'!$D$23/12))/9)*$AO$3)/'manual inputs_secondary'!$C$16)","v":""},{"$f":"IF($B15=\"\",\"\",(((($AM15*'manual inputs_secondary'!$C$17/$E$3)/('manual inputs_secondary'!$D$23/12))/9)))","v":""},{"$f":"IF($B15=\"\",\"\",((((($AM15*'manual inputs_secondary'!$C$17/$E$3)/('manual inputs_secondary'!$D$23/12))/9)*$AQ$3)/'manual inputs_secondary'!$C$17)*'manual inputs_secondary'!$C$12)","v":""},{"$f":"IF($B15=\"\",\"\",(((($AM15*'manual inputs_secondary'!$C$17/$E$3)/('manual inputs_secondary'!$D$23/12))/9)*$AO$3)/'manual inputs_secondary'!$C$16)","v":""},{"$f":"IF($C$5=\"n/a\",\"\",IF(B15=\"\",\"\",IFERROR(INDEX('quantities report_secondary'!$D$2:$D$9877,SMALL(IF('quantities report_secondary'!$A$2:$A$9877=AS$3,ROW('quantities report_secondary'!$A$2:$A$9877)-1,\"\"),ROWS($B$9:$B15))),\"0\")))","v":""}," ",{"$f":"IF($C15=\"\",\" \",(AT15/('manual inputs_secondary'!$C$21/12)/9))","v":" "}]
[null,{"$f":"IFERROR(INDEX('manual inputs_secondary'!J:J,SMALL(IF('manual inputs_secondary'!J:J<>\"\",ROW('manual inputs_secondary'!J:J)),ROW('manual inputs_secondary'!10:10))),\"\")","v":""},{"$f":"IF($C$5=\"n/a\",\"\",IF(B16=\"\",\"\",IFERROR(INDEX('quantities report'!$D$2:$D$9877,SMALL(IF('quantities report'!$A$2:$A$9877=C$3,ROW('quantities report'!$A$2:$A$9877)-1,\"\"),ROWS($B$9:$B16))),\"0\")))","v":""}," ",{"$f":"IF($C16=\"\",\" \",(D16*$E$3/'manual inputs'!$C$17))","v":" "},{"$f":"IF($C$5=\"n/a\",\"\",IF(B16=\"\",\"\",IFERROR(INDEX('quantities report'!$D$2:$D$9877,SMALL(IF('quantities report'!$A$2:$A$9877=F$3,ROW('quantities report'!$A$2:$A$9877)-1,\"\"),ROWS($B$9:$B16))),\"0\")))","v":""}," ",{"$f":"IF($F16=\"\",\" \",(G16*$E$3/'manual inputs'!$C$17))","v":" "},"",{"$f":"IF($J$5=\"n/a\",\"\",IF(B16=\"\",\"\",IFERROR(INDEX('quantities report'!$D$2:$D$9877,SMALL(IF('quantities report'!$A$2:$A$9877=J$3,ROW('quantities report'!$A$2:$A$9877)-1,\"\"),ROWS($B$9:$B16))),\"0\")))","v":""}," ",{"$f":"IF($J16=\"\",\" \",(K16*$L$3/'manual inputs'!$C$17))","v":" "},{"$f":"IF($J$5=\"n/a\",\"\",IF(B16=\"\",\"\",IFERROR(INDEX('quantities report'!$D$2:$D$9877,SMALL(IF('quantities report'!$A$2:$A$9877=M$3,ROW('quantities report'!$A$2:$A$9877)-1,\"\"),ROWS($B$9:$B16))),\"0\")))","v":""}," ",{"$f":"IF($M16=\"\",\" \",(N16*$O$3/'manual inputs'!$C$17))","v":" "},"",{"$f":"IF($Q$5=\"n/a\",\"\",IF(B16=\"\",\"\",IFERROR(INDEX('quantities report'!$D$2:$D$9877,SMALL(IF('quantities report'!$A$2:$A$9877=Q$3,ROW('quantities report'!$A$2:$A$9877)-1,\"\"),ROWS($B$9:$B16))),\"0\")))","v":""}," ",{"$f":"IF($Q16=\"\",\" \",(R16*$S$3/'manual inputs'!$C$17))","v":" "},{"$f":"IF($Q$5=\"n/a\",\"\",IF(I16=\"\",\"\",IFERROR(INDEX('quantities report'!$D$2:$D$9877,SMALL(IF('quantities report'!$A$2:$A$9877=T$3,ROW('quantities report'!$A$2:$A$9877)-1,\"\"),ROWS($B$9:$B16))),\"0\")))","v":""}," ",{"$f":"IF($T16=\"\",\" \",(U16*$V$3/'manual inputs'!$C$17))","v":" "},"",{"$f":"IF($X$5=\"n/a\",\"\",IF(B16=\"\",\"\",IFERROR(INDEX('quantities report'!$D$2:$D$9877,SMALL(IF('quantities report'!$A$2:$A$9877=X$3,ROW('quantities report'!$A$2:$A$9877)-1,\"\"),ROWS($B$9:$B16))),\"0\")))","v":""}," ",{"$f":"IF($X16=\"\",\" \",(Y16*$Z$3/'manual inputs'!$C$17))","v":" "},{"$f":"IF($X$5=\"n/a\",\"\",IF(B16=\"\",\"\",IFERROR(INDEX('quantities report'!$D$2:$D$9877,SMALL(IF('quantities report'!$A$2:$A$9877=AA$3,ROW('quantities report'!$A$2:$A$9877)-1,\"\"),ROWS($B$9:$B16))),\"0\")))","v":""}," ",{"$f":"IF($AA16=\"\",\" \",(AB16*$AC$3/'manual inputs'!$C$17))","v":" "},"",{"$f":"IF($AE$5=\"n/a\",\"\",IF(B16=\"\",\"\",IFERROR(INDEX('quantities report'!$D$2:$D$9877,SMALL(IF('quantities report'!$A$2:$A$9877=AE$3,ROW('quantities report'!$A$2:$A$9877)-1,\"\"),ROWS($B$9:$B16))),\"0\")))","v":""}," ",{"$f":"IF($AE16=\"\",\" \",(AF16*$AG$3/'manual inputs'!$C$17))","v":" "},{"$f":"IF($AE$5=\"n/a\",\"\",IF(B16=\"\",\"\",IFERROR(INDEX('quantities report'!$D$2:$D$9877,SMALL(IF('quantities report'!$A$2:$A$9877=AH$3,ROW('quantities report'!$A$2:$A$9877)-1,\"\"),ROWS($B$9:$B16))),\"0\")))","v":""}," ",{"$f":"IF($AE16=\"\",\" \",(AI16*$AJ$3/'manual inputs'!$C$17))","v":" "},""," "," ",{"$f":"IF(B16=\"\",\"\",(AM16*'manual inputs_secondary'!$C$6))","v":""},{"$f":"IF($B16=\"\",\"\",(((($AM16*'manual inputs_secondary'!$C$17/$E$3)/('manual inputs_secondary'!$D$23/12))/9)*$AO$3)/'manual inputs_secondary'!$C$16)","v":""},{"$f":"IF($B16=\"\",\"\",(((($AM16*'manual inputs_secondary'!$C$17/$E$3)/('manual inputs_secondary'!$D$23/12))/9)))","v":""},{"$f":"IF($B16=\"\",\"\",((((($AM16*'manual inputs_secondary'!$C$17/$E$3)/('manual inputs_secondary'!$D$23/12))/9)*$AQ$3)/'manual inputs_secondary'!$C$17)*'manual inputs_secondary'!$C$12)","v":""},{"$f":"IF($B16=\"\",\"\",(((($AM16*'manual inputs_secondary'!$C$17/$E$3)/('manual inputs_secondary'!$D$23/12))/9)*$AO$3)/'manual inputs_secondary'!$C$16)","v":""},{"$f":"IF($C$5=\"n/a\",\"\",IF(B16=\"\",\"\",IFERROR(INDEX('quantities report_secondary'!$D$2:$D$9877,SMALL(IF('quantities report_secondary'!$A$2:$A$9877=AS$3,ROW('quantities report_secondary'!$A$2:$A$9877)-1,\"\"),ROWS($B$9:$B16))),\"0\")))","v":""}," ",{"$f":"IF($C16=\"\",\" \",(AT16/('manual inputs_secondary'!$C$21/12)/9))","v":" "}]
[null,{"$f":"IFERROR(INDEX('manual inputs_secondary'!J:J,SMALL(IF('manual inputs_secondary'!J:J<>\"\",ROW('manual inputs_secondary'!J:J)),ROW('manual inputs_secondary'!11:11))),\"\")","v":""},{"$f":"IF($C$5=\"n/a\",\"\",IF(B17=\"\",\"\",IFERROR(INDEX('quantities report'!$D$2:$D$9877,SMALL(IF('quantities report'!$A$2:$A$9877=C$3,ROW('quantities report'!$A$2:$A$9877)-1,\"\"),ROWS($B$9:$B17))),\"0\")))","v":""}," ",{"$f":"IF($C17=\"\",\" \",(D17*$E$3/'manual inputs'!$C$17))","v":" "},{"$f":"IF($C$5=\"n/a\",\"\",IF(B17=\"\",\"\",IFERROR(INDEX('quantities report'!$D$2:$D$9877,SMALL(IF('quantities report'!$A$2:$A$9877=F$3,ROW('quantities report'!$A$2:$A$9877)-1,\"\"),ROWS($B$9:$B17))),\"0\")))","v":""}," ",{"$f":"IF($F17=\"\",\" \",(G17*$E$3/'manual inputs'!$C$17))","v":" "},"",{"$f":"IF($J$5=\"n/a\",\"\",IF(B17=\"\",\"\",IFERROR(INDEX('quantities report'!$D$2:$D$9877,SMALL(IF('quantities report'!$A$2:$A$9877=J$3,ROW('quantities report'!$A$2:$A$9877)-1,\"\"),ROWS($B$9:$B17))),\"0\")))","v":""}," ",{"$f":"IF($J17=\"\",\" \",(K17*$L$3/'manual inputs'!$C$17))","v":" "},{"$f":"IF($J$5=\"n/a\",\"\",IF(B17=\"\",\"\",IFERROR(INDEX('quantities report'!$D$2:$D$9877,SMALL(IF('quantities report'!$A$2:$A$9877=M$3,ROW('quantities report'!$A$2:$A$9877)-1,\"\"),ROWS($B$9:$B17))),\"0\")))","v":""}," ",{"$f":"IF($M17=\"\",\" \",(N17*$O$3/'manual inputs'!$C$17))","v":" "},"",{"$f":"IF($Q$5=\"n/a\",\"\",IF(B17=\"\",\"\",IFERROR(INDEX('quantities report'!$D$2:$D$9877,SMALL(IF('quantities report'!$A$2:$A$9877=Q$3,ROW('quantities report'!$A$2:$A$9877)-1,\"\"),ROWS($B$9:$B17))),\"0\")))","v":""}," ",{"$f":"IF($Q17=\"\",\" \",(R17*$S$3/'manual inputs'!$C$17))","v":" "},{"$f":"IF($Q$5=\"n/a\",\"\",IF(I17=\"\",\"\",IFERROR(INDEX('quantities report'!$D$2:$D$9877,SMALL(IF('quantities report'!$A$2:$A$9877=T$3,ROW('quantities report'!$A$2:$A$9877)-1,\"\"),ROWS($B$9:$B17))),\"0\")))","v":""}," ",{"$f":"IF($T17=\"\",\" \",(U17*$V$3/'manual inputs'!$C$17))","v":" "},"",{"$f":"IF($X$5=\"n/a\",\"\",IF(B17=\"\",\"\",IFERROR(INDEX('quantities report'!$D$2:$D$9877,SMALL(IF('quantities report'!$A$2:$A$9877=X$3,ROW('quantities report'!$A$2:$A$9877)-1,\"\"),ROWS($B$9:$B17))),\"0\")))","v":""}," ",{"$f":"IF($X17=\"\",\" \",(Y17*$Z$3/'manual inputs'!$C$17))","v":" "},{"$f":"IF($X$5=\"n/a\",\"\",IF(B17=\"\",\"\",IFERROR(INDEX('quantities report'!$D$2:$D$9877,SMALL(IF('quantities report'!$A$2:$A$9877=AA$3,ROW('quantities report'!$A$2:$A$9877)-1,\"\"),ROWS($B$9:$B17))),\"0\")))","v":""}," ",{"$f":"IF($AA17=\"\",\" \",(AB17*$AC$3/'manual inputs'!$C$17))","v":" "},"",{"$f":"IF($AE$5=\"n/a\",\"\",IF(B17=\"\",\"\",IFERROR(INDEX('quantities report'!$D$2:$D$9877,SMALL(IF('quantities report'!$A$2:$A$9877=AE$3,ROW('quantities report'!$A$2:$A$9877)-1,\"\"),ROWS($B$9:$B17))),\"0\")))","v":""}," ",{"$f":"IF($AE17=\"\",\" \",(AF17*$AG$3/'manual inputs'!$C$17))","v":" "},{"$f":"IF($AE$5=\"n/a\",\"\",IF(B17=\"\",\"\",IFERROR(INDEX('quantities report'!$D$2:$D$9877,SMALL(IF('quantities report'!$A$2:$A$9877=AH$3,ROW('quantities report'!$A$2:$A$9877)-1,\"\"),ROWS($B$9:$B17))),\"0\")))","v":""}," ",{"$f":"IF($AE17=\"\",\" \",(AI17*$AJ$3/'manual inputs'!$C$17))","v":" "},""," "," ",{"$f":"IF(B17=\"\",\"\",(AM17*'manual inputs_secondary'!$C$6))","v":""},{"$f":"IF($B17=\"\",\"\",(((($AM17*'manual inputs_secondary'!$C$17/$E$3)/('manual inputs_secondary'!$D$23/12))/9)*$AO$3)/'manual inputs_secondary'!$C$16)","v":""},{"$f":"IF($B17=\"\",\"\",(((($AM17*'manual inputs_secondary'!$C$17/$E$3)/('manual inputs_secondary'!$D$23/12))/9)))","v":""},{"$f":"IF($B17=\"\",\"\",((((($AM17*'manual inputs_secondary'!$C$17/$E$3)/('manual inputs_secondary'!$D$23/12))/9)*$AQ$3)/'manual inputs_secondary'!$C$17)*'manual inputs_secondary'!$C$12)","v":""},{"$f":"IF($B17=\"\",\"\",(((($AM17*'manual inputs_secondary'!$C$17/$E$3)/('manual inputs_secondary'!$D$23/12))/9)*$AO$3)/'manual inputs_secondary'!$C$16)","v":""},{"$f":"IF($C$5=\"n/a\",\"\",IF(B17=\"\",\"\",IFERROR(INDEX('quantities report_secondary'!$D$2:$D$9877,SMALL(IF('quantities report_secondary'!$A$2:$A$9877=AS$3,ROW('quantities report_secondary'!$A$2:$A$9877)-1,\"\"),ROWS($B$9:$B17))),\"0\")))","v":""}," ",{"$f":"IF($C17=\"\",\" \",(AT17/('manual inputs_secondary'!$C$21/12)/9))","v":" "}]
[null,{"$f":"IFERROR(INDEX('manual inputs_secondary'!J:J,SMALL(IF('manual inputs_secondary'!J:J<>\"\",ROW('manual inputs_secondary'!J:J)),ROW('manual inputs_secondary'!12:12))),\"\")","v":""},{"$f":"IF($C$5=\"n/a\",\"\",IF(B18=\"\",\"\",IFERROR(INDEX('quantities report'!$D$2:$D$9877,SMALL(IF('quantities report'!$A$2:$A$9877=C$3,ROW('quantities report'!$A$2:$A$9877)-1,\"\"),ROWS($B$9:$B18))),\"0\")))","v":""}," ",{"$f":"IF($C18=\"\",\" \",(D18*$E$3/'manual inputs'!$C$17))","v":" "},{"$f":"IF($C$5=\"n/a\",\"\",IF(B18=\"\",\"\",IFERROR(INDEX('quantities report'!$D$2:$D$9877,SMALL(IF('quantities report'!$A$2:$A$9877=F$3,ROW('quantities report'!$A$2:$A$9877)-1,\"\"),ROWS($B$9:$B18))),\"0\")))","v":""}," ",{"$f":"IF($F18=\"\",\" \",(G18*$E$3/'manual inputs'!$C$17))","v":" "},"",{"$f":"IF($J$5=\"n/a\",\"\",IF(B18=\"\",\"\",IFERROR(INDEX('quantities report'!$D$2:$D$9877,SMALL(IF('quantities report'!$A$2:$A$9877=J$3,ROW('quantities report'!$A$2:$A$9877)-1,\"\"),ROWS($B$9:$B18))),\"0\")))","v":""}," ",{"$f":"IF($J18=\"\",\" \",(K18*$L$3/'manual inputs'!$C$17))","v":" "},{"$f":"IF($J$5=\"n/a\",\"\",IF(B18=\"\",\"\",IFERROR(INDEX('quantities report'!$D$2:$D$9877,SMALL(IF('quantities report'!$A$2:$A$9877=M$3,ROW('quantities report'!$A$2:$A$9877)-1,\"\"),ROWS($B$9:$B18))),\"0\")))","v":""}," ",{"$f":"IF($M18=\"\",\" \",(N18*$O$3/'manual inputs'!$C$17))","v":" "},"",{"$f":"IF($Q$5=\"n/a\",\"\",IF(B18=\"\",\"\",IFERROR(INDEX('quantities report'!$D$2:$D$9877,SMALL(IF('quantities report'!$A$2:$A$9877=Q$3,ROW('quantities report'!$A$2:$A$9877)-1,\"\"),ROWS($B$9:$B18))),\"0\")))","v":""}," ",{"$f":"IF($Q18=\"\",\" \",(R18*$S$3/'manual inputs'!$C$17))","v":" "},{"$f":"IF($Q$5=\"n/a\",\"\",IF(I18=\"\",\"\",IFERROR(INDEX('quantities report'!$D$2:$D$9877,SMALL(IF('quantities report'!$A$2:$A$9877=T$3,ROW('quantities report'!$A$2:$A$9877)-1,\"\"),ROWS($B$9:$B18))),\"0\")))","v":""}," ",{"$f":"IF($T18=\"\",\" \",(U18*$V$3/'manual inputs'!$C$17))","v":" "},"",{"$f":"IF($X$5=\"n/a\",\"\",IF(B18=\"\",\"\",IFERROR(INDEX('quantities report'!$D$2:$D$9877,SMALL(IF('quantities report'!$A$2:$A$9877=X$3,ROW('quantities report'!$A$2:$A$9877)-1,\"\"),ROWS($B$9:$B18))),\"0\")))","v":""}," ",{"$f":"IF($X18=\"\",\" \",(Y18*$Z$3/'manual inputs'!$C$17))","v":" "},{"$f":"IF($X$5=\"n/a\",\"\",IF(B18=\"\",\"\",IFERROR(INDEX('quantities report'!$D$2:$D$9877,SMALL(IF('quantities report'!$A$2:$A$9877=AA$3,ROW('quantities report'!$A$2:$A$9877)-1,\"\"),ROWS($B$9:$B18))),\"0\")))","v":""}," ",{"$f":"IF($AA18=\"\",\" \",(AB18*$AC$3/'manual inputs'!$C$17))","v":" "},"",{"$f":"IF($AE$5=\"n/a\",\"\",IF(B18=\"\",\"\",IFERROR(INDEX('quantities report'!$D$2:$D$9877,SMALL(IF('quantities report'!$A$2:$A$9877=AE$3,ROW('quantities report'!$A$2:$A$9877)-1,\"\"),ROWS($B$9:$B18))),\"0\")))","v":""}," ",{"$f":"IF($AE18=\"\",\" \",(AF18*$AG$3/'manual inputs'!$C$17))","v":" "},{"$f":"IF($AE$5=\"n/a\",\"\",IF(B18=\"\",\"\",IFERROR(INDEX('quantities report'!$D$2:$D$9877,SMALL(IF('quantities report'!$A$2:$A$9877=AH$3,ROW('quantities report'!$A$2:$A$9877)-1,\"\"),ROWS($B$9:$B18))),\"0\")))","v":""}," ",{"$f":"IF($AE18=\"\",\" \",(AI18*$AJ$3/'manual inputs'!$C$17))","v":" "},""," "," ",{"$f":"IF(B18=\"\",\"\",(AM18*'manual inputs_secondary'!$C$6))","v":""},{"$f":"IF($B18=\"\",\"\",(((($AM18*'manual inputs_secondary'!$C$17/$E$3)/('manual inputs_secondary'!$D$23/12))/9)*$AO$3)/'manual inputs_secondary'!$C$16)","v":""},{"$f":"IF($B18=\"\",\"\",(((($AM18*'manual inputs_secondary'!$C$17/$E$3)/('manual inputs_secondary'!$D$23/12))/9)))","v":""},{"$f":"IF($B18=\"\",\"\",((((($AM18*'manual inputs_secondary'!$C$17/$E$3)/('manual inputs_secondary'!$D$23/12))/9)*$AQ$3)/'manual inputs_secondary'!$C$17)*'manual inputs_secondary'!$C$12)","v":""},{"$f":"IF($B18=\"\",\"\",(((($AM18*'manual inputs_secondary'!$C$17/$E$3)/('manual inputs_secondary'!$D$23/12))/9)*$AO$3)/'manual inputs_secondary'!$C$16)","v":""},{"$f":"IF($C$5=\"n/a\",\"\",IF(B18=\"\",\"\",IFERROR(INDEX('quantities report_secondary'!$D$2:$D$9877,SMALL(IF('quantities report_secondary'!$A$2:$A$9877=AS$3,ROW('quantities report_secondary'!$A$2:$A$9877)-1,\"\"),ROWS($B$9:$B18))),\"0\")))","v":""}," ",{"$f":"IF($C18=\"\",\" \",(AT18/('manual inputs_secondary'!$C$21/12)/9))","v":" "}]
[null,{"$f":"IFERROR(INDEX('manual inputs_secondary'!J:J,SMALL(IF('manual inputs_secondary'!J:J<>\"\",ROW('manual inputs_secondary'!J:J)),ROW('manual inputs_secondary'!13:13))),\"\")","v":""},{"$f":"IF($C$5=\"n/a\",\"\",IF(B19=\"\",\"\",IFERROR(INDEX('quantities report'!$D$2:$D$9877,SMALL(IF('quantities report'!$A$2:$A$9877=C$3,ROW('quantities report'!$A$2:$A$9877)-1,\"\"),ROWS($B$9:$B19))),\"0\")))","v":""}," ",{"$f":"IF($C19=\"\",\" \",(D19*$E$3/'manual inputs'!$C$17))","v":" "},{"$f":"IF($C$5=\"n/a\",\"\",IF(B19=\"\",\"\",IFERROR(INDEX('quantities report'!$D$2:$D$9877,SMALL(IF('quantities report'!$A$2:$A$9877=F$3,ROW('quantities report'!$A$2:$A$9877)-1,\"\"),ROWS($B$9:$B19))),\"0\")))","v":""}," ",{"$f":"IF($F19=\"\",\" \",(G19*$E$3/'manual inputs'!$C$17))","v":" "},"",{"$f":"IF($J$5=\"n/a\",\"\",IF(B19=\"\",\"\",IFERROR(INDEX('quantities report'!$D$2:$D$9877,SMALL(IF('quantities report'!$A$2:$A$9877=J$3,ROW('quantities report'!$A$2:$A$9877)-1,\"\"),ROWS($B$9:$B19))),\"0\")))","v":""}," ",{"$f":"IF($J19=\"\",\" \",(K19*$L$3/'manual inputs'!$C$17))","v":" "},{"$f":"IF($J$5=\"n/a\",\"\",IF(B19=\"\",\"\",IFERROR(INDEX('quantities report'!$D$2:$D$9877,SMALL(IF('quantities report'!$A$2:$A$9877=M$3,ROW('quantities report'!$A$2:$A$9877)-1,\"\"),ROWS($B$9:$B19))),\"0\")))","v":""}," ",{"$f":"IF($M19=\"\",\" \",(N19*$O$3/'manual inputs'!$C$17))","v":" "},"",{"$f":"IF($Q$5=\"n/a\",\"\",IF(B19=\"\",\"\",IFERROR(INDEX('quantities report'!$D$2:$D$9877,SMALL(IF('quantities report'!$A$2:$A$9877=Q$3,ROW('quantities report'!$A$2:$A$9877)-1,\"\"),ROWS($B$9:$B19))),\"0\")))","v":""}," ",{"$f":"IF($Q19=\"\",\" \",(R19*$S$3/'manual inputs'!$C$17))","v":" "},{"$f":"IF($Q$5=\"n/a\",\"\",IF(I19=\"\",\"\",IFERROR(INDEX('quantities report'!$D$2:$D$9877,SMALL(IF('quantities report'!$A$2:$A$9877=T$3,ROW('quantities report'!$A$2:$A$9877)-1,\"\"),ROWS($B$9:$B19))),\"0\")))","v":""}," ",{"$f":"IF($T19=\"\",\" \",(U19*$V$3/'manual inputs'!$C$17))","v":" "},"",{"$f":"IF($X$5=\"n/a\",\"\",IF(B19=\"\",\"\",IFERROR(INDEX('quantities report'!$D$2:$D$9877,SMALL(IF('quantities report'!$A$2:$A$9877=X$3,ROW('quantities report'!$A$2:$A$9877)-1,\"\"),ROWS($B$9:$B19))),\"0\")))","v":""}," ",{"$f":"IF($X19=\"\",\" \",(Y19*$Z$3/'manual inputs'!$C$17))","v":" "},{"$f":"IF($X$5=\"n/a\",\"\",IF(B19=\"\",\"\",IFERROR(INDEX('quantities report'!$D$2:$D$9877,SMALL(IF('quantities report'!$A$2:$A$9877=AA$3,ROW('quantities report'!$A$2:$A$9877)-1,\"\"),ROWS($B$9:$B19))),\"0\")))","v":""}," ",{"$f":"IF($AA19=\"\",\" \",(AB19*$AC$3/'manual inputs'!$C$17))","v":" "},"",{"$f":"IF($AE$5=\"n/a\",\"\",IF(B19=\"\",\"\",IFERROR(INDEX('quantities report'!$D$2:$D$9877,SMALL(IF('quantities report'!$A$2:$A$9877=AE$3,ROW('quantities report'!$A$2:$A$9877)-1,\"\"),ROWS($B$9:$B19))),\"0\")))","v":""}," ",{"$f":"IF($AE19=\"\",\" \",(AF19*$AG$3/'manual inputs'!$C$17))","v":" "},{"$f":"IF($AE$5=\"n/a\",\"\",IF(B19=\"\",\"\",IFERROR(INDEX('quantities report'!$D$2:$D$9877,SMALL(IF('quantities report'!$A$2:$A$9877=AH$3,ROW('quantities report'!$A$2:$A$9877)-1,\"\"),ROWS($B$9:$B19))),\"0\")))","v":""}," ",{"$f":"IF($AE19=\"\",\" \",(AI19*$AJ$3/'manual inputs'!$C$17))","v":" "},""," "," ",{"$f":"IF(B19=\"\",\"\",(AM19*'manual inputs_secondary'!$C$6))","v":""},{"$f":"IF($B19=\"\",\"\",(((($AM19*'manual inputs_secondary'!$C$17/$E$3)/('manual inputs_secondary'!$D$23/12))/9)*$AO$3)/'manual inputs_secondary'!$C$16)","v":""},{"$f":"IF($B19=\"\",\"\",(((($AM19*'manual inputs_secondary'!$C$17/$E$3)/('manual inputs_secondary'!$D$23/12))/9)))","v":""},{"$f":"IF($B19=\"\",\"\",((((($AM19*'manual inputs_secondary'!$C$17/$E$3)/('manual inputs_secondary'!$D$23/12))/9)*$AQ$3)/'manual inputs_secondary'!$C$17)*'manual inputs_secondary'!$C$12)","v":""},{"$f":"IF($B19=\"\",\"\",(((($AM19*'manual inputs_secondary'!$C$17/$E$3)/('manual inputs_secondary'!$D$23/12))/9)*$AO$3)/'manual inputs_secondary'!$C$16)","v":""},{"$f":"IF($C$5=\"n/a\",\"\",IF(B19=\"\",\"\",IFERROR(INDEX('quantities report_secondary'!$D$2:$D$9877,SMALL(IF('quantities report_secondary'!$A$2:$A$9877=AS$3,ROW('quantities report_secondary'!$A$2:$A$9877)-1,\"\"),ROWS($B$9:$B19))),\"0\")))","v":""}," ",{"$f":"IF($C19=\"\",\" \",(AT19/('manual inputs_secondary'!$C$21/12)/9))","v":" "}]
[null,{"$f":"IFERROR(INDEX('manual inputs_secondary'!J:J,SMALL(IF('manual inputs_secondary'!J:J<>\"\",ROW('manual inputs_secondary'!J:J)),ROW('manual inputs_secondary'!14:14))),\"\")","v":""},{"$f":"IF($C$5=\"n/a\",\"\",IF(B20=\"\",\"\",IFERROR(INDEX('quantities report'!$D$2:$D$9877,SMALL(IF('quantities report'!$A$2:$A$9877=C$3,ROW('quantities report'!$A$2:$A$9877)-1,\"\"),ROWS($B$9:$B20))),\"0\")))","v":""}," ",{"$f":"IF($C20=\"\",\" \",(D20*$E$3/'manual inputs'!$C$17))","v":" "},{"$f":"IF($C$5=\"n/a\",\"\",IF(B20=\"\",\"\",IFERROR(INDEX('quantities report'!$D$2:$D$9877,SMALL(IF('quantities report'!$A$2:$A$9877=F$3,ROW('quantities report'!$A$2:$A$9877)-1,\"\"),ROWS($B$9:$B20))),\"0\")))","v":""}," ",{"$f":"IF($F20=\"\",\" \",(G20*$E$3/'manual inputs'!$C$17))","v":" "},"",{"$f":"IF($J$5=\"n/a\",\"\",IF(B20=\"\",\"\",IFERROR(INDEX('quantities report'!$D$2:$D$9877,SMALL(IF('quantities report'!$A$2:$A$9877=J$3,ROW('quantities report'!$A$2:$A$9877)-1,\"\"),ROWS($B$9:$B20))),\"0\")))","v":""}," ",{"$f":"IF($J20=\"\",\" \",(K20*$L$3/'manual inputs'!$C$17))","v":" "},{"$f":"IF($J$5=\"n/a\",\"\",IF(B20=\"\",\"\",IFERROR(INDEX('quantities report'!$D$2:$D$9877,SMALL(IF('quantities report'!$A$2:$A$9877=M$3,ROW('quantities report'!$A$2:$A$9877)-1,\"\"),ROWS($B$9:$B20))),\"0\")))","v":""}," ",{"$f":"IF($M20=\"\",\" \",(N20*$O$3/'manual inputs'!$C$17))","v":" "},"",{"$f":"IF($Q$5=\"n/a\",\"\",IF(B20=\"\",\"\",IFERROR(INDEX('quantities report'!$D$2:$D$9877,SMALL(IF('quantities report'!$A$2:$A$9877=Q$3,ROW('quantities report'!$A$2:$A$9877)-1,\"\"),ROWS($B$9:$B20))),\"0\")))","v":""}," ",{"$f":"IF($Q20=\"\",\" \",(R20*$S$3/'manual inputs'!$C$17))","v":" "},{"$f":"IF($Q$5=\"n/a\",\"\",IF(I20=\"\",\"\",IFERROR(INDEX('quantities report'!$D$2:$D$9877,SMALL(IF('quantities report'!$A$2:$A$9877=T$3,ROW('quantities report'!$A$2:$A$9877)-1,\"\"),ROWS($B$9:$B20))),\"0\")))","v":""}," ",{"$f":"IF($T20=\"\",\" \",(U20*$V$3/'manual inputs'!$C$17))","v":" "},"",{"$f":"IF($X$5=\"n/a\",\"\",IF(B20=\"\",\"\",IFERROR(INDEX('quantities report'!$D$2:$D$9877,SMALL(IF('quantities report'!$A$2:$A$9877=X$3,ROW('quantities report'!$A$2:$A$9877)-1,\"\"),ROWS($B$9:$B20))),\"0\")))","v":""}," ",{"$f":"IF($X20=\"\",\" \",(Y20*$Z$3/'manual inputs'!$C$17))","v":" "},{"$f":"IF($X$5=\"n/a\",\"\",IF(B20=\"\",\"\",IFERROR(INDEX('quantities report'!$D$2:$D$9877,SMALL(IF('quantities report'!$A$2:$A$9877=AA$3,ROW('quantities report'!$A$2:$A$9877)-1,\"\"),ROWS($B$9:$B20))),\"0\")))","v":""}," ",{"$f":"IF($AA20=\"\",\" \",(AB20*$AC$3/'manual inputs'!$C$17))","v":" "},"",{"$f":"IF($AE$5=\"n/a\",\"\",IF(B20=\"\",\"\",IFERROR(INDEX('quantities report'!$D$2:$D$9877,SMALL(IF('quantities report'!$A$2:$A$9877=AE$3,ROW('quantities report'!$A$2:$A$9877)-1,\"\"),ROWS($B$9:$B20))),\"0\")))","v":""}," ",{"$f":"IF($AE20=\"\",\" \",(AF20*$AG$3/'manual inputs'!$C$17))","v":" "},{"$f":"IF($AE$5=\"n/a\",\"\",IF(B20=\"\",\"\",IFERROR(INDEX('quantities report'!$D$2:$D$9877,SMALL(IF('quantities report'!$A$2:$A$9877=AH$3,ROW('quantities report'!$A$2:$A$9877)-1,\"\"),ROWS($B$9:$B20))),\"0\")))","v":""}," ",{"$f":"IF($AE20=\"\",\" \",(AI20*$AJ$3/'manual inputs'!$C$17))","v":" "},""," "," ",{"$f":"IF(B20=\"\",\"\",(AM20*'manual inputs_secondary'!$C$6))","v":""},{"$f":"IF($B20=\"\",\"\",(((($AM20*'manual inputs_secondary'!$C$17/$E$3)/('manual inputs_secondary'!$D$23/12))/9)*$AO$3)/'manual inputs_secondary'!$C$16)","v":""},{"$f":"IF($B20=\"\",\"\",(((($AM20*'manual inputs_secondary'!$C$17/$E$3)/('manual inputs_secondary'!$D$23/12))/9)))","v":""},{"$f":"IF($B20=\"\",\"\",((((($AM20*'manual inputs_secondary'!$C$17/$E$3)/('manual inputs_secondary'!$D$23/12))/9)*$AQ$3)/'manual inputs_secondary'!$C$17)*'manual inputs_secondary'!$C$12)","v":""},{"$f":"IF($B20=\"\",\"\",(((($AM20*'manual inputs_secondary'!$C$17/$E$3)/('manual inputs_secondary'!$D$23/12))/9)*$AO$3)/'manual inputs_secondary'!$C$16)","v":""},{"$f":"IF($C$5=\"n/a\",\"\",IF(B20=\"\",\"\",IFERROR(INDEX('quantities report_secondary'!$D$2:$D$9877,SMALL(IF('quantities report_secondary'!$A$2:$A$9877=AS$3,ROW('quantities report_secondary'!$A$2:$A$9877)-1,\"\"),ROWS($B$9:$B20))),\"0\")))","v":""}," ",{"$f":"IF($C20=\"\",\" \",(AT20/('manual inputs_secondary'!$C$21/12)/9))","v":" "}]
[null,{"$f":"IFERROR(INDEX('manual inputs_secondary'!J:J,SMALL(IF('manual inputs_secondary'!J:J<>\"\",ROW('manual inputs_secondary'!J:J)),ROW('manual inputs_secondary'!15:15))),\"\")","v":""},{"$f":"IF($C$5=\"n/a\",\"\",IF(B21=\"\",\"\",IFERROR(INDEX('quantities report'!$D$2:$D$9877,SMALL(IF('quantities report'!$A$2:$A$9877=C$3,ROW('quantities report'!$A$2:$A$9877)-1,\"\"),ROWS($B$9:$B21))),\"0\")))","v":""}," ",{"$f":"IF($C21=\"\",\" \",(D21*$E$3/'manual inputs'!$C$17))","v":" "},{"$f":"IF($C$5=\"n/a\",\"\",IF(B21=\"\",\"\",IFERROR(INDEX('quantities report'!$D$2:$D$9877,SMALL(IF('quantities report'!$A$2:$A$9877=F$3,ROW('quantities report'!$A$2:$A$9877)-1,\"\"),ROWS($B$9:$B21))),\"0\")))","v":""}," ",{"$f":"IF($F21=\"\",\" \",(G21*$E$3/'manual inputs'!$C$17))","v":" "},"",{"$f":"IF($J$5=\"n/a\",\"\",IF(B21=\"\",\"\",IFERROR(INDEX('quantities report'!$D$2:$D$9877,SMALL(IF('quantities report'!$A$2:$A$9877=J$3,ROW('quantities report'!$A$2:$A$9877)-1,\"\"),ROWS($B$9:$B21))),\"0\")))","v":""}," ",{"$f":"IF($J21=\"\",\" \",(K21*$L$3/'manual inputs'!$C$17))","v":" "},{"$f":"IF($J$5=\"n/a\",\"\",IF(B21=\"\",\"\",IFERROR(INDEX('quantities report'!$D$2:$D$9877,SMALL(IF('quantities report'!$A$2:$A$9877=M$3,ROW('quantities report'!$A$2:$A$9877)-1,\"\"),ROWS($B$9:$B21))),\"0\")))","v":""}," ",{"$f":"IF($M21=\"\",\" \",(N21*$O$3/'manual inputs'!$C$17))","v":" "},"",{"$f":"IF($Q$5=\"n/a\",\"\",IF(B21=\"\",\"\",IFERROR(INDEX('quantities report'!$D$2:$D$9877,SMALL(IF('quantities report'!$A$2:$A$9877=Q$3,ROW('quantities report'!$A$2:$A$9877)-1,\"\"),ROWS($B$9:$B21))),\"0\")))","v":""}," ",{"$f":"IF($Q21=\"\",\" \",(R21*$S$3/'manual inputs'!$C$17))","v":" "},{"$f":"IF($Q$5=\"n/a\",\"\",IF(I21=\"\",\"\",IFERROR(INDEX('quantities report'!$D$2:$D$9877,SMALL(IF('quantities report'!$A$2:$A$9877=T$3,ROW('quantities report'!$A$2:$A$9877)-1,\"\"),ROWS($B$9:$B21))),\"0\")))","v":""}," ",{"$f":"IF($T21=\"\",\" \",(U21*$V$3/'manual inputs'!$C$17))","v":" "},"",{"$f":"IF($X$5=\"n/a\",\"\",IF(B21=\"\",\"\",IFERROR(INDEX('quantities report'!$D$2:$D$9877,SMALL(IF('quantities report'!$A$2:$A$9877=X$3,ROW('quantities report'!$A$2:$A$9877)-1,\"\"),ROWS($B$9:$B21))),\"0\")))","v":""}," ",{"$f":"IF($X21=\"\",\" \",(Y21*$Z$3/'manual inputs'!$C$17))","v":" "},{"$f":"IF($X$5=\"n/a\",\"\",IF(B21=\"\",\"\",IFERROR(INDEX('quantities report'!$D$2:$D$9877,SMALL(IF('quantities report'!$A$2:$A$9877=AA$3,ROW('quantities report'!$A$2:$A$9877)-1,\"\"),ROWS($B$9:$B21))),\"0\")))","v":""}," ",{"$f":"IF($AA21=\"\",\" \",(AB21*$AC$3/'manual inputs'!$C$17))","v":" "},"",{"$f":"IF($AE$5=\"n/a\",\"\",IF(B21=\"\",\"\",IFERROR(INDEX('quantities report'!$D$2:$D$9877,SMALL(IF('quantities report'!$A$2:$A$9877=AE$3,ROW('quantities report'!$A$2:$A$9877)-1,\"\"),ROWS($B$9:$B21))),\"0\")))","v":""}," ",{"$f":"IF($AE21=\"\",\" \",(AF21*$AG$3/'manual inputs'!$C$17))","v":" "},{"$f":"IF($AE$5=\"n/a\",\"\",IF(B21=\"\",\"\",IFERROR(INDEX('quantities report'!$D$2:$D$9877,SMALL(IF('quantities report'!$A$2:$A$9877=AH$3,ROW('quantities report'!$A$2:$A$9877)-1,\"\"),ROWS($B$9:$B21))),\"0\")))","v":""}," ",{"$f":"IF($AE21=\"\",\" \",(AI21*$AJ$3/'manual inputs'!$C$17))","v":" "},""," "," ",{"$f":"IF(B21=\"\",\"\",(AM21*'manual inputs_secondary'!$C$6))","v":""},{"$f":"IF($B21=\"\",\"\",(((($AM21*'manual inputs_secondary'!$C$17/$E$3)/('manual inputs_secondary'!$D$23/12))/9)*$AO$3)/'manual inputs_secondary'!$C$16)","v":""},{"$f":"IF($B21=\"\",\"\",(((($AM21*'manual inputs_secondary'!$C$17/$E$3)/('manual inputs_secondary'!$D$23/12))/9)))","v":""},{"$f":"IF($B21=\"\",\"\",((((($AM21*'manual inputs_secondary'!$C$17/$E$3)/('manual inputs_secondary'!$D$23/12))/9)*$AQ$3)/'manual inputs_secondary'!$C$17)*'manual inputs_secondary'!$C$12)","v":""},{"$f":"IF($B21=\"\",\"\",(((($AM21*'manual inputs_secondary'!$C$17/$E$3)/('manual inputs_secondary'!$D$23/12))/9)*$AO$3)/'manual inputs_secondary'!$C$16)","v":""},{"$f":"IF($C$5=\"n/a\",\"\",IF(B21=\"\",\"\",IFERROR(INDEX('quantities report_secondary'!$D$2:$D$9877,SMALL(IF('quantities report_secondary'!$A$2:$A$9877=AS$3,ROW('quantities report_secondary'!$A$2:$A$9877)-1,\"\"),ROWS($B$9:$B21))),\"0\")))","v":""}," ",{"$f":"IF($C21=\"\",\" \",(AT21/('manual inputs_secondary'!$C$21/12)/9))","v":" "}]
[null,{"$f":"IFERROR(INDEX('manual inputs_secondary'!J:J,SMALL(IF('manual inputs_secondary'!J:J<>\"\",ROW('manual inputs_secondary'!J:J)),ROW('manual inputs_secondary'!16:16))),\"\")","v":""},{"$f":"IF($C$5=\"n/a\",\"\",IF(B22=\"\",\"\",IFERROR(INDEX('quantities report'!$D$2:$D$9877,SMALL(IF('quantities report'!$A$2:$A$9877=C$3,ROW('quantities report'!$A$2:$A$9877)-1,\"\"),ROWS($B$9:$B22))),\"0\")))","v":""}," ",{"$f":"IF($C22=\"\",\" \",(D22*$E$3/'manual inputs'!$C$17))","v":" "},{"$f":"IF($C$5=\"n/a\",\"\",IF(B22=\"\",\"\",IFERROR(INDEX('quantities report'!$D$2:$D$9877,SMALL(IF('quantities report'!$A$2:$A$9877=F$3,ROW('quantities report'!$A$2:$A$9877)-1,\"\"),ROWS($B$9:$B22))),\"0\")))","v":""}," ",{"$f":"IF($F22=\"\",\" \",(G22*$E$3/'manual inputs'!$C$17))","v":" "},"",{"$f":"IF($J$5=\"n/a\",\"\",IF(B22=\"\",\"\",IFERROR(INDEX('quantities report'!$D$2:$D$9877,SMALL(IF('quantities report'!$A$2:$A$9877=J$3,ROW('quantities report'!$A$2:$A$9877)-1,\"\"),ROWS($B$9:$B22))),\"0\")))","v":""}," ",{"$f":"IF($J22=\"\",\" \",(K22*$L$3/'manual inputs'!$C$17))","v":" "},{"$f":"IF($J$5=\"n/a\",\"\",IF(B22=\"\",\"\",IFERROR(INDEX('quantities report'!$D$2:$D$9877,SMALL(IF('quantities report'!$A$2:$A$9877=M$3,ROW('quantities report'!$A$2:$A$9877)-1,\"\"),ROWS($B$9:$B22))),\"0\")))","v":""}," ",{"$f":"IF($M22=\"\",\" \",(N22*$O$3/'manual inputs'!$C$17))","v":" "},"",{"$f":"IF($Q$5=\"n/a\",\"\",IF(B22=\"\",\"\",IFERROR(INDEX('quantities report'!$D$2:$D$9877,SMALL(IF('quantities report'!$A$2:$A$9877=Q$3,ROW('quantities report'!$A$2:$A$9877)-1,\"\"),ROWS($B$9:$B22))),\"0\")))","v":""}," ",{"$f":"IF($Q22=\"\",\" \",(R22*$S$3/'manual inputs'!$C$17))","v":" "},{"$f":"IF($Q$5=\"n/a\",\"\",IF(I22=\"\",\"\",IFERROR(INDEX('quantities report'!$D$2:$D$9877,SMALL(IF('quantities report'!$A$2:$A$9877=T$3,ROW('quantities report'!$A$2:$A$9877)-1,\"\"),ROWS($B$9:$B22))),\"0\")))","v":""}," ",{"$f":"IF($T22=\"\",\" \",(U22*$V$3/'manual inputs'!$C$17))","v":" "},"",{"$f":"IF($X$5=\"n/a\",\"\",IF(B22=\"\",\"\",IFERROR(INDEX('quantities report'!$D$2:$D$9877,SMALL(IF('quantities report'!$A$2:$A$9877=X$3,ROW('quantities report'!$A$2:$A$9877)-1,\"\"),ROWS($B$9:$B22))),\"0\")))","v":""}," ",{"$f":"IF($X22=\"\",\" \",(Y22*$Z$3/'manual inputs'!$C$17))","v":" "},{"$f":"IF($X$5=\"n/a\",\"\",IF(B22=\"\",\"\",IFERROR(INDEX('quantities report'!$D$2:$D$9877,SMALL(IF('quantities report'!$A$2:$A$9877=AA$3,ROW('quantities report'!$A$2:$A$9877)-1,\"\"),ROWS($B$9:$B22))),\"0\")))","v":""}," ",{"$f":"IF($AA22=\"\",\" \",(AB22*$AC$3/'manual inputs'!$C$17))","v":" "},"",{"$f":"IF($AE$5=\"n/a\",\"\",IF(B22=\"\",\"\",IFERROR(INDEX('quantities report'!$D$2:$D$9877,SMALL(IF('quantities report'!$A$2:$A$9877=AE$3,ROW('quantities report'!$A$2:$A$9877)-1,\"\"),ROWS($B$9:$B22))),\"0\")))","v":""}," ",{"$f":"IF($AE22=\"\",\" \",(AF22*$AG$3/'manual inputs'!$C$17))","v":" "},{"$f":"IF($AE$5=\"n/a\",\"\",IF(B22=\"\",\"\",IFERROR(INDEX('quantities report'!$D$2:$D$9877,SMALL(IF('quantities report'!$A$2:$A$9877=AH$3,ROW('quantities report'!$A$2:$A$9877)-1,\"\"),ROWS($B$9:$B22))),\"0\")))","v":""}," ",{"$f":"IF($AE22=\"\",\" \",(AI22*$AJ$3/'manual inputs'!$C$17))","v":" "},""," "," ",{"$f":"IF(B22=\"\",\"\",(AM22*'manual inputs_secondary'!$C$6))","v":""},{"$f":"IF($B22=\"\",\"\",(((($AM22*'manual inputs_secondary'!$C$17/$E$3)/('manual inputs_secondary'!$D$23/12))/9)*$AO$3)/'manual inputs_secondary'!$C$16)","v":""},{"$f":"IF($B22=\"\",\"\",(((($AM22*'manual inputs_secondary'!$C$17/$E$3)/('manual inputs_secondary'!$D$23/12))/9)))","v":""},{"$f":"IF($B22=\"\",\"\",((((($AM22*'manual inputs_secondary'!$C$17/$E$3)/('manual inputs_secondary'!$D$23/12))/9)*$AQ$3)/'manual inputs_secondary'!$C$17)*'manual inputs_secondary'!$C$12)","v":""},{"$f":"IF($B22=\"\",\"\",(((($AM22*'manual inputs_secondary'!$C$17/$E$3)/('manual inputs_secondary'!$D$23/12))/9)*$AO$3)/'manual inputs_secondary'!$C$16)","v":""},{"$f":"IF($C$5=\"n/a\",\"\",IF(B22=\"\",\"\",IFERROR(INDEX('quantities report_secondary'!$D$2:$D$9877,SMALL(IF('quantities report_secondary'!$A$2:$A$9877=AS$3,ROW('quantities report_secondary'!$A$2:$A$9877)-1,\"\"),ROWS($B$9:$B22))),\"0\")))","v":""}," ",{"$f":"IF($C22=\"\",\" \",(AT22/('manual inputs_secondary'!$C$21/12)/9))","v":" "}]
[null,{"$f":"IFERROR(INDEX('manual inputs_secondary'!J:J,SMALL(IF('manual inputs_secondary'!J:J<>\"\",ROW('manual inputs_secondary'!J:J)),ROW('manual inputs_secondary'!17:17))),\"\")","v":""},{"$f":"IF($C$5=\"n/a\",\"\",IF(B23=\"\",\"\",IFERROR(INDEX('quantities report'!$D$2:$D$9877,SMALL(IF('quantities report'!$A$2:$A$9877=C$3,ROW('quantities report'!$A$2:$A$9877)-1,\"\"),ROWS($B$9:$B23))),\"0\")))","v":""}," ",{"$f":"IF($C23=\"\",\" \",(D23*$E$3/'manual inputs'!$C$17))","v":" "},{"$f":"IF($C$5=\"n/a\",\"\",IF(B23=\"\",\"\",IFERROR(INDEX('quantities report'!$D$2:$D$9877,SMALL(IF('quantities report'!$A$2:$A$9877=F$3,ROW('quantities report'!$A$2:$A$9877)-1,\"\"),ROWS($B$9:$B23))),\"0\")))","v":""}," ",{"$f":"IF($F23=\"\",\" \",(G23*$E$3/'manual inputs'!$C$17))","v":" "},"",{"$f":"IF($J$5=\"n/a\",\"\",IF(B23=\"\",\"\",IFERROR(INDEX('quantities report'!$D$2:$D$9877,SMALL(IF('quantities report'!$A$2:$A$9877=J$3,ROW('quantities report'!$A$2:$A$9877)-1,\"\"),ROWS($B$9:$B23))),\"0\")))","v":""}," ",{"$f":"IF($J23=\"\",\" \",(K23*$L$3/'manual inputs'!$C$17))","v":" "},{"$f":"IF($J$5=\"n/a\",\"\",IF(B23=\"\",\"\",IFERROR(INDEX('quantities report'!$D$2:$D$9877,SMALL(IF('quantities report'!$A$2:$A$9877=M$3,ROW('quantities report'!$A$2:$A$9877)-1,\"\"),ROWS($B$9:$B23))),\"0\")))","v":""}," ",{"$f":"IF($M23=\"\",\" \",(N23*$O$3/'manual inputs'!$C$17))","v":" "},"",{"$f":"IF($Q$5=\"n/a\",\"\",IF(B23=\"\",\"\",IFERROR(INDEX('quantities report'!$D$2:$D$9877,SMALL(IF('quantities report'!$A$2:$A$9877=Q$3,ROW('quantities report'!$A$2:$A$9877)-1,\"\"),ROWS($B$9:$B23))),\"0\")))","v":""}," ",{"$f":"IF($Q23=\"\",\" \",(R23*$S$3/'manual inputs'!$C$17))","v":" "},{"$f":"IF($Q$5=\"n/a\",\"\",IF(I23=\"\",\"\",IFERROR(INDEX('quantities report'!$D$2:$D$9877,SMALL(IF('quantities report'!$A$2:$A$9877=T$3,ROW('quantities report'!$A$2:$A$9877)-1,\"\"),ROWS($B$9:$B23))),\"0\")))","v":""}," ",{"$f":"IF($T23=\"\",\" \",(U23*$V$3/'manual inputs'!$C$17))","v":" "},"",{"$f":"IF($X$5=\"n/a\",\"\",IF(B23=\"\",\"\",IFERROR(INDEX('quantities report'!$D$2:$D$9877,SMALL(IF('quantities report'!$A$2:$A$9877=X$3,ROW('quantities report'!$A$2:$A$9877)-1,\"\"),ROWS($B$9:$B23))),\"0\")))","v":""}," ",{"$f":"IF($X23=\"\",\" \",(Y23*$Z$3/'manual inputs'!$C$17))","v":" "},{"$f":"IF($X$5=\"n/a\",\"\",IF(B23=\"\",\"\",IFERROR(INDEX('quantities report'!$D$2:$D$9877,SMALL(IF('quantities report'!$A$2:$A$9877=AA$3,ROW('quantities report'!$A$2:$A$9877)-1,\"\"),ROWS($B$9:$B23))),\"0\")))","v":""}," ",{"$f":"IF($AA23=\"\",\" \",(AB23*$AC$3/'manual inputs'!$C$17))","v":" "},"",{"$f":"IF($AE$5=\"n/a\",\"\",IF(B23=\"\",\"\",IFERROR(INDEX('quantities report'!$D$2:$D$9877,SMALL(IF('quantities report'!$A$2:$A$9877=AE$3,ROW('quantities report'!$A$2:$A$9877)-1,\"\"),ROWS($B$9:$B23))),\"0\")))","v":""}," ",{"$f":"IF($AE23=\"\",\" \",(AF23*$AG$3/'manual inputs'!$C$17))","v":" "},{"$f":"IF($AE$5=\"n/a\",\"\",IF(B23=\"\",\"\",IFERROR(INDEX('quantities report'!$D$2:$D$9877,SMALL(IF('quantities report'!$A$2:$A$9877=AH$3,ROW('quantities report'!$A$2:$A$9877)-1,\"\"),ROWS($B$9:$B23))),\"0\")))","v":""}," ",{"$f":"IF($AE23=\"\",\" \",(AI23*$AJ$3/'manual inputs'!$C$17))","v":" "},""," "," ",{"$f":"IF(B23=\"\",\"\",(AM23*'manual inputs_secondary'!$C$6))","v":""},{"$f":"IF($B23=\"\",\"\",(((($AM23*'manual inputs_secondary'!$C$17/$E$3)/('manual inputs_secondary'!$D$23/12))/9)*$AO$3)/'manual inputs_secondary'!$C$16)","v":""},{"$f":"IF($B23=\"\",\"\",(((($AM23*'manual inputs_secondary'!$C$17/$E$3)/('manual inputs_secondary'!$D$23/12))/9)))","v":""},{"$f":"IF($B23=\"\",\"\",((((($AM23*'manual inputs_secondary'!$C$17/$E$3)/('manual inputs_secondary'!$D$23/12))/9)*$AQ$3)/'manual inputs_secondary'!$C$17)*'manual inputs_secondary'!$C$12)","v":""},{"$f":"IF($B23=\"\",\"\",(((($AM23*'manual inputs_secondary'!$C$17/$E$3)/('manual inputs_secondary'!$D$23/12))/9)*$AO$3)/'manual inputs_secondary'!$C$16)","v":""},{"$f":"IF($C$5=\"n/a\",\"\",IF(B23=\"\",\"\",IFERROR(INDEX('quantities report_secondary'!$D$2:$D$9877,SMALL(IF('quantities report_secondary'!$A$2:$A$9877=AS$3,ROW('quantities report_secondary'!$A$2:$A$9877)-1,\"\"),ROWS($B$9:$B23))),\"0\")))","v":""}," ",{"$f":"IF($C23=\"\",\" \",(AT23/('manual inputs_secondary'!$C$21/12)/9))","v":" "}]
[null,{"$f":"IFERROR(INDEX('manual inputs_secondary'!J:J,SMALL(IF('manual inputs_secondary'!J:J<>\"\",ROW('manual inputs_secondary'!J:J)),ROW('manual inputs_secondary'!18:18))),\"\")","v":""},{"$f":"IF($C$5=\"n/a\",\"\",IF(B24=\"\",\"\",IFERROR(INDEX('quantities report'!$D$2:$D$9877,SMALL(IF('quantities report'!$A$2:$A$9877=C$3,ROW('quantities report'!$A$2:$A$9877)-1,\"\"),ROWS($B$9:$B24))),\"0\")))","v":""}," ",{"$f":"IF($C24=\"\",\" \",(D24*$E$3/'manual inputs'!$C$17))","v":" "},{"$f":"IF($C$5=\"n/a\",\"\",IF(B24=\"\",\"\",IFERROR(INDEX('quantities report'!$D$2:$D$9877,SMALL(IF('quantities report'!$A$2:$A$9877=F$3,ROW('quantities report'!$A$2:$A$9877)-1,\"\"),ROWS($B$9:$B24))),\"0\")))","v":""}," ",{"$f":"IF($F24=\"\",\" \",(G24*$E$3/'manual inputs'!$C$17))","v":" "},"",{"$f":"IF($J$5=\"n/a\",\"\",IF(B24=\"\",\"\",IFERROR(INDEX('quantities report'!$D$2:$D$9877,SMALL(IF('quantities report'!$A$2:$A$9877=J$3,ROW('quantities report'!$A$2:$A$9877)-1,\"\"),ROWS($B$9:$B24))),\"0\")))","v":""}," ",{"$f":"IF($J24=\"\",\" \",(K24*$L$3/'manual inputs'!$C$17))","v":" "},{"$f":"IF($J$5=\"n/a\",\"\",IF(B24=\"\",\"\",IFERROR(INDEX('quantities report'!$D$2:$D$9877,SMALL(IF('quantities report'!$A$2:$A$9877=M$3,ROW('quantities report'!$A$2:$A$9877)-1,\"\"),ROWS($B$9:$B24))),\"0\")))","v":""}," ",{"$f":"IF($M24=\"\",\" \",(N24*$O$3/'manual inputs'!$C$17))","v":" "},"",{"$f":"IF($Q$5=\"n/a\",\"\",IF(B24=\"\",\"\",IFERROR(INDEX('quantities report'!$D$2:$D$9877,SMALL(IF('quantities report'!$A$2:$A$9877=Q$3,ROW('quantities report'!$A$2:$A$9877)-1,\"\"),ROWS($B$9:$B24))),\"0\")))","v":""}," ",{"$f":"IF($Q24=\"\",\" \",(R24*$S$3/'manual inputs'!$C$17))","v":" "},{"$f":"IF($Q$5=\"n/a\",\"\",IF(I24=\"\",\"\",IFERROR(INDEX('quantities report'!$D$2:$D$9877,SMALL(IF('quantities report'!$A$2:$A$9877=T$3,ROW('quantities report'!$A$2:$A$9877)-1,\"\"),ROWS($B$9:$B24))),\"0\")))","v":""}," ",{"$f":"IF($T24=\"\",\" \",(U24*$V$3/'manual inputs'!$C$17))","v":" "},"",{"$f":"IF($X$5=\"n/a\",\"\",IF(B24=\"\",\"\",IFERROR(INDEX('quantities report'!$D$2:$D$9877,SMALL(IF('quantities report'!$A$2:$A$9877=X$3,ROW('quantities report'!$A$2:$A$9877)-1,\"\"),ROWS($B$9:$B24))),\"0\")))","v":""}," ",{"$f":"IF($X24=\"\",\" \",(Y24*$Z$3/'manual inputs'!$C$17))","v":" "},{"$f":"IF($X$5=\"n/a\",\"\",IF(B24=\"\",\"\",IFERROR(INDEX('quantities report'!$D$2:$D$9877,SMALL(IF('quantities report'!$A$2:$A$9877=AA$3,ROW('quantities report'!$A$2:$A$9877)-1,\"\"),ROWS($B$9:$B24))),\"0\")))","v":""}," ",{"$f":"IF($AA24=\"\",\" \",(AB24*$AC$3/'manual inputs'!$C$17))","v":" "},"",{"$f":"IF($AE$5=\"n/a\",\"\",IF(B24=\"\",\"\",IFERROR(INDEX('quantities report'!$D$2:$D$9877,SMALL(IF('quantities report'!$A$2:$A$9877=AE$3,ROW('quantities report'!$A$2:$A$9877)-1,\"\"),ROWS($B$9:$B24))),\"0\")))","v":""}," ",{"$f":"IF($AE24=\"\",\" \",(AF24*$AG$3/'manual inputs'!$C$17))","v":" "},{"$f":"IF($AE$5=\"n/a\",\"\",IF(B24=\"\",\"\",IFERROR(INDEX('quantities report'!$D$2:$D$9877,SMALL(IF('quantities report'!$A$2:$A$9877=AH$3,ROW('quantities report'!$A$2:$A$9877)-1,\"\"),ROWS($B$9:$B24))),\"0\")))","v":""}," ",{"$f":"IF($AE24=\"\",\" \",(AI24*$AJ$3/'manual inputs'!$C$17))","v":" "},""," "," ",{"$f":"IF(B24=\"\",\"\",(AM24*'manual inputs_secondary'!$C$6))","v":""},{"$f":"IF($B24=\"\",\"\",(((($AM24*'manual inputs_secondary'!$C$17/$E$3)/('manual inputs_secondary'!$D$23/12))/9)*$AO$3)/'manual inputs_secondary'!$C$16)","v":""},{"$f":"IF($B24=\"\",\"\",(((($AM24*'manual inputs_secondary'!$C$17/$E$3)/('manual inputs_secondary'!$D$23/12))/9)))","v":""},{"$f":"IF($B24=\"\",\"\",((((($AM24*'manual inputs_secondary'!$C$17/$E$3)/('manual inputs_secondary'!$D$23/12))/9)*$AQ$3)/'manual inputs_secondary'!$C$17)*'manual inputs_secondary'!$C$12)","v":""},{"$f":"IF($B24=\"\",\"\",(((($AM24*'manual inputs_secondary'!$C$17/$E$3)/('manual inputs_secondary'!$D$23/12))/9)*$AO$3)/'manual inputs_secondary'!$C$16)","v":""},{"$f":"IF($C$5=\"n/a\",\"\",IF(B24=\"\",\"\",IFERROR(INDEX('quantities report_secondary'!$D$2:$D$9877,SMALL(IF('quantities report_secondary'!$A$2:$A$9877=AS$3,ROW('quantities report_secondary'!$A$2:$A$9877)-1,\"\"),ROWS($B$9:$B24))),\"0\")))","v":""}," ",{"$f":"IF($C24=\"\",\" \",(AT24/('manual inputs_secondary'!$C$21/12)/9))","v":" "}]
[null,{"$f":"IFERROR(INDEX('manual inputs_secondary'!J:J,SMALL(IF('manual inputs_secondary'!J:J<>\"\",ROW('manual inputs_secondary'!J:J)),ROW('manual inputs_secondary'!19:19))),\"\")","v":""},{"$f":"IF($C$5=\"n/a\",\"\",IF(B25=\"\",\"\",IFERROR(INDEX('quantities report'!$D$2:$D$9877,SMALL(IF('quantities report'!$A$2:$A$9877=C$3,ROW('quantities report'!$A$2:$A$9877)-1,\"\"),ROWS($B$9:$B25))),\"0\")))","v":""}," ",{"$f":"IF($C25=\"\",\" \",(D25*$E$3/'manual inputs'!$C$17))","v":" "},{"$f":"IF($C$5=\"n/a\",\"\",IF(B25=\"\",\"\",IFERROR(INDEX('quantities report'!$D$2:$D$9877,SMALL(IF('quantities report'!$A$2:$A$9877=F$3,ROW('quantities report'!$A$2:$A$9877)-1,\"\"),ROWS($B$9:$B25))),\"0\")))","v":""}," ",{"$f":"IF($F25=\"\",\" \",(G25*$E$3/'manual inputs'!$C$17))","v":" "},"",{"$f":"IF($J$5=\"n/a\",\"\",IF(B25=\"\",\"\",IFERROR(INDEX('quantities report'!$D$2:$D$9877,SMALL(IF('quantities report'!$A$2:$A$9877=J$3,ROW('quantities report'!$A$2:$A$9877)-1,\"\"),ROWS($B$9:$B25))),\"0\")))","v":""}," ",{"$f":"IF($J25=\"\",\" \",(K25*$L$3/'manual inputs'!$C$17))","v":" "},{"$f":"IF($J$5=\"n/a\",\"\",IF(B25=\"\",\"\",IFERROR(INDEX('quantities report'!$D$2:$D$9877,SMALL(IF('quantities report'!$A$2:$A$9877=M$3,ROW('quantities report'!$A$2:$A$9877)-1,\"\"),ROWS($B$9:$B25))),\"0\")))","v":""}," ",{"$f":"IF($M25=\"\",\" \",(N25*$O$3/'manual inputs'!$C$17))","v":" "},"",{"$f":"IF($Q$5=\"n/a\",\"\",IF(B25=\"\",\"\",IFERROR(INDEX('quantities report'!$D$2:$D$9877,SMALL(IF('quantities report'!$A$2:$A$9877=Q$3,ROW('quantities report'!$A$2:$A$9877)-1,\"\"),ROWS($B$9:$B25))),\"0\")))","v":""}," ",{"$f":"IF($Q25=\"\",\" \",(R25*$S$3/'manual inputs'!$C$17))","v":" "},{"$f":"IF($Q$5=\"n/a\",\"\",IF(I25=\"\",\"\",IFERROR(INDEX('quantities report'!$D$2:$D$9877,SMALL(IF('quantities report'!$A$2:$A$9877=T$3,ROW('quantities report'!$A$2:$A$9877)-1,\"\"),ROWS($B$9:$B25))),\"0\")))","v":""}," ",{"$f":"IF($T25=\"\",\" \",(U25*$V$3/'manual inputs'!$C$17))","v":" "},"",{"$f":"IF($X$5=\"n/a\",\"\",IF(B25=\"\",\"\",IFERROR(INDEX('quantities report'!$D$2:$D$9877,SMALL(IF('quantities report'!$A$2:$A$9877=X$3,ROW('quantities report'!$A$2:$A$9877)-1,\"\"),ROWS($B$9:$B25))),\"0\")))","v":""}," ",{"$f":"IF($X25=\"\",\" \",(Y25*$Z$3/'manual inputs'!$C$17))","v":" "},{"$f":"IF($X$5=\"n/a\",\"\",IF(B25=\"\",\"\",IFERROR(INDEX('quantities report'!$D$2:$D$9877,SMALL(IF('quantities report'!$A$2:$A$9877=AA$3,ROW('quantities report'!$A$2:$A$9877)-1,\"\"),ROWS($B$9:$B25))),\"0\")))","v":""}," ",{"$f":"IF($AA25=\"\",\" \",(AB25*$AC$3/'manual inputs'!$C$17))","v":" "},"",{"$f":"IF($AE$5=\"n/a\",\"\",IF(B25=\"\",\"\",IFERROR(INDEX('quantities report'!$D$2:$D$9877,SMALL(IF('quantities report'!$A$2:$A$9877=AE$3,ROW('quantities report'!$A$2:$A$9877)-1,\"\"),ROWS($B$9:$B25))),\"0\")))","v":""}," ",{"$f":"IF($AE25=\"\",\" \",(AF25*$AG$3/'manual inputs'!$C$17))","v":" "},{"$f":"IF($AE$5=\"n/a\",\"\",IF(B25=\"\",\"\",IFERROR(INDEX('quantities report'!$D$2:$D$9877,SMALL(IF('quantities report'!$A$2:$A$9877=AH$3,ROW('quantities report'!$A$2:$A$9877)-1,\"\"),ROWS($B$9:$B25))),\"0\")))","v":""}," ",{"$f":"IF($AE25=\"\",\" \",(AI25*$AJ$3/'manual inputs'!$C$17))","v":" "},""," "," ",{"$f":"IF(B25=\"\",\"\",(AM25*'manual inputs_secondary'!$C$6))","v":""},{"$f":"IF($B25=\"\",\"\",(((($AM25*'manual inputs_secondary'!$C$17/$E$3)/('manual inputs_secondary'!$D$23/12))/9)*$AO$3)/'manual inputs_secondary'!$C$16)","v":""},{"$f":"IF($B25=\"\",\"\",(((($AM25*'manual inputs_secondary'!$C$17/$E$3)/('manual inputs_secondary'!$D$23/12))/9)))","v":""},{"$f":"IF($B25=\"\",\"\",((((($AM25*'manual inputs_secondary'!$C$17/$E$3)/('manual inputs_secondary'!$D$23/12))/9)*$AQ$3)/'manual inputs_secondary'!$C$17)*'manual inputs_secondary'!$C$12)","v":""},{"$f":"IF($B25=\"\",\"\",(((($AM25*'manual inputs_secondary'!$C$17/$E$3)/('manual inputs_secondary'!$D$23/12))/9)*$AO$3)/'manual inputs_secondary'!$C$16)","v":""},{"$f":"IF($C$5=\"n/a\",\"\",IF(B25=\"\",\"\",IFERROR(INDEX('quantities report_secondary'!$D$2:$D$9877,SMALL(IF('quantities report_secondary'!$A$2:$A$9877=AS$3,ROW('quantities report_secondary'!$A$2:$A$9877)-1,\"\"),ROWS($B$9:$B25))),\"0\")))","v":""}," ",{"$f":"IF($C25=\"\",\" \",(AT25/('manual inputs_secondary'!$C$21/12)/9))","v":" "}]
[null,{"$f":"IFERROR(INDEX('manual inputs_secondary'!J:J,SMALL(IF('manual inputs_secondary'!J:J<>\"\",ROW('manual inputs_secondary'!J:J)),ROW('manual inputs_secondary'!20:20))),\"\")","v":""},{"$f":"IF($C$5=\"n/a\",\"\",IF(B26=\"\",\"\",IFERROR(INDEX('quantities report'!$D$2:$D$9877,SMALL(IF('quantities report'!$A$2:$A$9877=C$3,ROW('quantities report'!$A$2:$A$9877)-1,\"\"),ROWS($B$9:$B26))),\"0\")))","v":""}," ",{"$f":"IF($C26=\"\",\" \",(D26*$E$3/'manual inputs'!$C$17))","v":" "},{"$f":"IF($C$5=\"n/a\",\"\",IF(B26=\"\",\"\",IFERROR(INDEX('quantities report'!$D$2:$D$9877,SMALL(IF('quantities report'!$A$2:$A$9877=F$3,ROW('quantities report'!$A$2:$A$9877)-1,\"\"),ROWS($B$9:$B26))),\"0\")))","v":""}," ",{"$f":"IF($F26=\"\",\" \",(G26*$E$3/'manual inputs'!$C$17))","v":" "},"",{"$f":"IF($J$5=\"n/a\",\"\",IF(B26=\"\",\"\",IFERROR(INDEX('quantities report'!$D$2:$D$9877,SMALL(IF('quantities report'!$A$2:$A$9877=J$3,ROW('quantities report'!$A$2:$A$9877)-1,\"\"),ROWS($B$9:$B26))),\"0\")))","v":""}," ",{"$f":"IF($J26=\"\",\" \",(K26*$L$3/'manual inputs'!$C$17))","v":" "},{"$f":"IF($J$5=\"n/a\",\"\",IF(B26=\"\",\"\",IFERROR(INDEX('quantities report'!$D$2:$D$9877,SMALL(IF('quantities report'!$A$2:$A$9877=M$3,ROW('quantities report'!$A$2:$A$9877)-1,\"\"),ROWS($B$9:$B26))),\"0\")))","v":""}," ",{"$f":"IF($M26=\"\",\" \",(N26*$O$3/'manual inputs'!$C$17))","v":" "},"",{"$f":"IF($Q$5=\"n/a\",\"\",IF(B26=\"\",\"\",IFERROR(INDEX('quantities report'!$D$2:$D$9877,SMALL(IF('quantities report'!$A$2:$A$9877=Q$3,ROW('quantities report'!$A$2:$A$9877)-1,\"\"),ROWS($B$9:$B26))),\"0\")))","v":""}," ",{"$f":"IF($Q26=\"\",\" \",(R26*$S$3/'manual inputs'!$C$17))","v":" "},{"$f":"IF($Q$5=\"n/a\",\"\",IF(I26=\"\",\"\",IFERROR(INDEX('quantities report'!$D$2:$D$9877,SMALL(IF('quantities report'!$A$2:$A$9877=T$3,ROW('quantities report'!$A$2:$A$9877)-1,\"\"),ROWS($B$9:$B26))),\"0\")))","v":""}," ",{"$f":"IF($T26=\"\",\" \",(U26*$V$3/'manual inputs'!$C$17))","v":" "},"",{"$f":"IF($X$5=\"n/a\",\"\",IF(B26=\"\",\"\",IFERROR(INDEX('quantities report'!$D$2:$D$9877,SMALL(IF('quantities report'!$A$2:$A$9877=X$3,ROW('quantities report'!$A$2:$A$9877)-1,\"\"),ROWS($B$9:$B26))),\"0\")))","v":""}," ",{"$f":"IF($X26=\"\",\" \",(Y26*$Z$3/'manual inputs'!$C$17))","v":" "},{"$f":"IF($X$5=\"n/a\",\"\",IF(B26=\"\",\"\",IFERROR(INDEX('quantities report'!$D$2:$D$9877,SMALL(IF('quantities report'!$A$2:$A$9877=AA$3,ROW('quantities report'!$A$2:$A$9877)-1,\"\"),ROWS($B$9:$B26))),\"0\")))","v":""}," ",{"$f":"IF($AA26=\"\",\" \",(AB26*$AC$3/'manual inputs'!$C$17))","v":" "},"",{"$f":"IF($AE$5=\"n/a\",\"\",IF(B26=\"\",\"\",IFERROR(INDEX('quantities report'!$D$2:$D$9877,SMALL(IF('quantities report'!$A$2:$A$9877=AE$3,ROW('quantities report'!$A$2:$A$9877)-1,\"\"),ROWS($B$9:$B26))),\"0\")))","v":""}," ",{"$f":"IF($AE26=\"\",\" \",(AF26*$AG$3/'manual inputs'!$C$17))","v":" "},{"$f":"IF($AE$5=\"n/a\",\"\",IF(B26=\"\",\"\",IFERROR(INDEX('quantities report'!$D$2:$D$9877,SMALL(IF('quantities report'!$A$2:$A$9877=AH$3,ROW('quantities report'!$A$2:$A$9877)-1,\"\"),ROWS($B$9:$B26))),\"0\")))","v":""}," ",{"$f":"IF($AE26=\"\",\" \",(AI26*$AJ$3/'manual inputs'!$C$17))","v":" "},""," "," ",{"$f":"IF(B26=\"\",\"\",(AM26*'manual inputs_secondary'!$C$6))","v":""},{"$f":"IF($B26=\"\",\"\",(((($AM26*'manual inputs_secondary'!$C$17/$E$3)/('manual inputs_secondary'!$D$23/12))/9)*$AO$3)/'manual inputs_secondary'!$C$16)","v":""},{"$f":"IF($B26=\"\",\"\",(((($AM26*'manual inputs_secondary'!$C$17/$E$3)/('manual inputs_secondary'!$D$23/12))/9)))","v":""},{"$f":"IF($B26=\"\",\"\",((((($AM26*'manual inputs_secondary'!$C$17/$E$3)/('manual inputs_secondary'!$D$23/12))/9)*$AQ$3)/'manual inputs_secondary'!$C$17)*'manual inputs_secondary'!$C$12)","v":""},{"$f":"IF($B26=\"\",\"\",(((($AM26*'manual inputs_secondary'!$C$17/$E$3)/('manual inputs_secondary'!$D$23/12))/9)*$AO$3)/'manual inputs_secondary'!$C$16)","v":""},{"$f":"IF($C$5=\"n/a\",\"\",IF(B26=\"\",\"\",IFERROR(INDEX('quantities report_secondary'!$D$2:$D$9877,SMALL(IF('quantities report_secondary'!$A$2:$A$9877=AS$3,ROW('quantities report_secondary'!$A$2:$A$9877)-1,\"\"),ROWS($B$9:$B26))),\"0\")))","v":""}," ",{"$f":"IF($C26=\"\",\" \",(AT26/('manual inputs_secondary'!$C$21/12)/9))","v":" "}]
[null,{"$f":"IFERROR(INDEX('manual inputs_secondary'!J:J,SMALL(IF('manual inputs_secondary'!J:J<>\"\",ROW('manual inputs_secondary'!J:J)),ROW('manual inputs_secondary'!21:21))),\"\")","v":""},{"$f":"IF($C$5=\"n/a\",\"\",IF(B27=\"\",\"\",IFERROR(INDEX('quantities report'!$D$2:$D$9877,SMALL(IF('quantities report'!$A$2:$A$9877=C$3,ROW('quantities report'!$A$2:$A$9877)-1,\"\"),ROWS($B$9:$B27))),\"0\")))","v":""}," ",{"$f":"IF($C27=\"\",\" \",(D27*$E$3/'manual inputs'!$C$17))","v":" "},{"$f":"IF($C$5=\"n/a\",\"\",IF(B27=\"\",\"\",IFERROR(INDEX('quantities report'!$D$2:$D$9877,SMALL(IF('quantities report'!$A$2:$A$9877=F$3,ROW('quantities report'!$A$2:$A$9877)-1,\"\"),ROWS($B$9:$B27))),\"0\")))","v":""}," ",{"$f":"IF($F27=\"\",\" \",(G27*$E$3/'manual inputs'!$C$17))","v":" "},"",{"$f":"IF($J$5=\"n/a\",\"\",IF(B27=\"\",\"\",IFERROR(INDEX('quantities report'!$D$2:$D$9877,SMALL(IF('quantities report'!$A$2:$A$9877=J$3,ROW('quantities report'!$A$2:$A$9877)-1,\"\"),ROWS($B$9:$B27))),\"0\")))","v":""}," ",{"$f":"IF($J27=\"\",\" \",(K27*$L$3/'manual inputs'!$C$17))","v":" "},{"$f":"IF($J$5=\"n/a\",\"\",IF(B27=\"\",\"\",IFERROR(INDEX('quantities report'!$D$2:$D$9877,SMALL(IF('quantities report'!$A$2:$A$9877=M$3,ROW('quantities report'!$A$2:$A$9877)-1,\"\"),ROWS($B$9:$B27))),\"0\")))","v":""}," ",{"$f":"IF($M27=\"\",\" \",(N27*$O$3/'manual inputs'!$C$17))","v":" "},"",{"$f":"IF($Q$5=\"n/a\",\"\",IF(B27=\"\",\"\",IFERROR(INDEX('quantities report'!$D$2:$D$9877,SMALL(IF('quantities report'!$A$2:$A$9877=Q$3,ROW('quantities report'!$A$2:$A$9877)-1,\"\"),ROWS($B$9:$B27))),\"0\")))","v":""}," ",{"$f":"IF($Q27=\"\",\" \",(R27*$S$3/'manual inputs'!$C$17))","v":" "},{"$f":"IF($Q$5=\"n/a\",\"\",IF(I27=\"\",\"\",IFERROR(INDEX('quantities report'!$D$2:$D$9877,SMALL(IF('quantities report'!$A$2:$A$9877=T$3,ROW('quantities report'!$A$2:$A$9877)-1,\"\"),ROWS($B$9:$B27))),\"0\")))","v":""}," ",{"$f":"IF($T27=\"\",\" \",(U27*$V$3/'manual inputs'!$C$17))","v":" "},"",{"$f":"IF($X$5=\"n/a\",\"\",IF(B27=\"\",\"\",IFERROR(INDEX('quantities report'!$D$2:$D$9877,SMALL(IF('quantities report'!$A$2:$A$9877=X$3,ROW('quantities report'!$A$2:$A$9877)-1,\"\"),ROWS($B$9:$B27))),\"0\")))","v":""}," ",{"$f":"IF($X27=\"\",\" \",(Y27*$Z$3/'manual inputs'!$C$17))","v":" "},{"$f":"IF($X$5=\"n/a\",\"\",IF(B27=\"\",\"\",IFERROR(INDEX('quantities report'!$D$2:$D$9877,SMALL(IF('quantities report'!$A$2:$A$9877=AA$3,ROW('quantities report'!$A$2:$A$9877)-1,\"\"),ROWS($B$9:$B27))),\"0\")))","v":""}," ",{"$f":"IF($AA27=\"\",\" \",(AB27*$AC$3/'manual inputs'!$C$17))","v":" "},"",{"$f":"IF($AE$5=\"n/a\",\"\",IF(B27=\"\",\"\",IFERROR(INDEX('quantities report'!$D$2:$D$9877,SMALL(IF('quantities report'!$A$2:$A$9877=AE$3,ROW('quantities report'!$A$2:$A$9877)-1,\"\"),ROWS($B$9:$B27))),\"0\")))","v":""}," ",{"$f":"IF($AE27=\"\",\" \",(AF27*$AG$3/'manual inputs'!$C$17))","v":" "},{"$f":"IF($AE$5=\"n/a\",\"\",IF(B27=\"\",\"\",IFERROR(INDEX('quantities report'!$D$2:$D$9877,SMALL(IF('quantities report'!$A$2:$A$9877=AH$3,ROW('quantities report'!$A$2:$A$9877)-1,\"\"),ROWS($B$9:$B27))),\"0\")))","v":""}," ",{"$f":"IF($AE27=\"\",\" \",(AI27*$AJ$3/'manual inputs'!$C$17))","v":" "},""," "," ",{"$f":"IF(B27=\"\",\"\",(AM27*'manual inputs_secondary'!$C$6))","v":""},{"$f":"IF($B27=\"\",\"\",(((($AM27*'manual inputs_secondary'!$C$17/$E$3)/('manual inputs_secondary'!$D$23/12))/9)*$AO$3)/'manual inputs_secondary'!$C$16)","v":""},{"$f":"IF($B27=\"\",\"\",(((($AM27*'manual inputs_secondary'!$C$17/$E$3)/('manual inputs_secondary'!$D$23/12))/9)))","v":""},{"$f":"IF($B27=\"\",\"\",((((($AM27*'manual inputs_secondary'!$C$17/$E$3)/('manual inputs_secondary'!$D$23/12))/9)*$AQ$3)/'manual inputs_secondary'!$C$17)*'manual inputs_secondary'!$C$12)","v":""},{"$f":"IF($B27=\"\",\"\",(((($AM27*'manual inputs_secondary'!$C$17/$E$3)/('manual inputs_secondary'!$D$23/12))/9)*$AO$3)/'manual inputs_secondary'!$C$16)","v":""},{"$f":"IF($C$5=\"n/a\",\"\",IF(B27=\"\",\"\",IFERROR(INDEX('quantities report_secondary'!$D$2:$D$9877,SMALL(IF('quantities report_secondary'!$A$2:$A$9877=AS$3,ROW('quantities report_secondary'!$A$2:$A$9877)-1,\"\"),ROWS($B$9:$B27))),\"0\")))","v":""}," ",{"$f":"IF($C27=\"\",\" \",(AT27/('manual inputs_secondary'!$C$21/12)/9))","v":" "}]
[null,{"$f":"IFERROR(INDEX('manual inputs_secondary'!J:J,SMALL(IF('manual inputs_secondary'!J:J<>\"\",ROW('manual inputs_secondary'!J:J)),ROW('manual inputs_secondary'!22:22))),\"\")","v":""},{"$f":"IF($C$5=\"n/a\",\"\",IF(B28=\"\",\"\",IFERROR(INDEX('quantities report'!$D$2:$D$9877,SMALL(IF('quantities report'!$A$2:$A$9877=C$3,ROW('quantities report'!$A$2:$A$9877)-1,\"\"),ROWS($B$9:$B28))),\"0\")))","v":""}," ",{"$f":"IF($C28=\"\",\" \",(D28*$E$3/'manual inputs'!$C$17))","v":" "},{"$f":"IF($C$5=\"n/a\",\"\",IF(B28=\"\",\"\",IFERROR(INDEX('quantities report'!$D$2:$D$9877,SMALL(IF('quantities report'!$A$2:$A$9877=F$3,ROW('quantities report'!$A$2:$A$9877)-1,\"\"),ROWS($B$9:$B28))),\"0\")))","v":""}," ",{"$f":"IF($F28=\"\",\" \",(G28*$E$3/'manual inputs'!$C$17))","v":" "},"",{"$f":"IF($J$5=\"n/a\",\"\",IF(B28=\"\",\"\",IFERROR(INDEX('quantities report'!$D$2:$D$9877,SMALL(IF('quantities report'!$A$2:$A$9877=J$3,ROW('quantities report'!$A$2:$A$9877)-1,\"\"),ROWS($B$9:$B28))),\"0\")))","v":""}," ",{"$f":"IF($J28=\"\",\" \",(K28*$L$3/'manual inputs'!$C$17))","v":" "},{"$f":"IF($J$5=\"n/a\",\"\",IF(B28=\"\",\"\",IFERROR(INDEX('quantities report'!$D$2:$D$9877,SMALL(IF('quantities report'!$A$2:$A$9877=M$3,ROW('quantities report'!$A$2:$A$9877)-1,\"\"),ROWS($B$9:$B28))),\"0\")))","v":""}," ",{"$f":"IF($M28=\"\",\" \",(N28*$O$3/'manual inputs'!$C$17))","v":" "},"",{"$f":"IF($Q$5=\"n/a\",\"\",IF(B28=\"\",\"\",IFERROR(INDEX('quantities report'!$D$2:$D$9877,SMALL(IF('quantities report'!$A$2:$A$9877=Q$3,ROW('quantities report'!$A$2:$A$9877)-1,\"\"),ROWS($B$9:$B28))),\"0\")))","v":""}," ",{"$f":"IF($Q28=\"\",\" \",(R28*$S$3/'manual inputs'!$C$17))","v":" "},{"$f":"IF($Q$5=\"n/a\",\"\",IF(I28=\"\",\"\",IFERROR(INDEX('quantities report'!$D$2:$D$9877,SMALL(IF('quantities report'!$A$2:$A$9877=T$3,ROW('quantities report'!$A$2:$A$9877)-1,\"\"),ROWS($B$9:$B28))),\"0\")))","v":""}," ",{"$f":"IF($T28=\"\",\" \",(U28*$V$3/'manual inputs'!$C$17))","v":" "},"",{"$f":"IF($X$5=\"n/a\",\"\",IF(B28=\"\",\"\",IFERROR(INDEX('quantities report'!$D$2:$D$9877,SMALL(IF('quantities report'!$A$2:$A$9877=X$3,ROW('quantities report'!$A$2:$A$9877)-1,\"\"),ROWS($B$9:$B28))),\"0\")))","v":""}," ",{"$f":"IF($X28=\"\",\" \",(Y28*$Z$3/'manual inputs'!$C$17))","v":" "},{"$f":"IF($X$5=\"n/a\",\"\",IF(B28=\"\",\"\",IFERROR(INDEX('quantities report'!$D$2:$D$9877,SMALL(IF('quantities report'!$A$2:$A$9877=AA$3,ROW('quantities report'!$A$2:$A$9877)-1,\"\"),ROWS($B$9:$B28))),\"0\")))","v":""}," ",{"$f":"IF($AA28=\"\",\" \",(AB28*$AC$3/'manual inputs'!$C$17))","v":" "},"",{"$f":"IF($AE$5=\"n/a\",\"\",IF(B28=\"\",\"\",IFERROR(INDEX('quantities report'!$D$2:$D$9877,SMALL(IF('quantities report'!$A$2:$A$9877=AE$3,ROW('quantities report'!$A$2:$A$9877)-1,\"\"),ROWS($B$9:$B28))),\"0\")))","v":""}," ",{"$f":"IF($AE28=\"\",\" \",(AF28*$AG$3/'manual inputs'!$C$17))","v":" "},{"$f":"IF($AE$5=\"n/a\",\"\",IF(B28=\"\",\"\",IFERROR(INDEX('quantities report'!$D$2:$D$9877,SMALL(IF('quantities report'!$A$2:$A$9877=AH$3,ROW('quantities report'!$A$2:$A$9877)-1,\"\"),ROWS($B$9:$B28))),\"0\")))","v":""}," ",{"$f":"IF($AE28=\"\",\" \",(AI28*$AJ$3/'manual inputs'!$C$17))","v":" "},""," "," ",{"$f":"IF(B28=\"\",\"\",(AM28*'manual inputs_secondary'!$C$6))","v":""},{"$f":"IF($B28=\"\",\"\",(((($AM28*'manual inputs_secondary'!$C$17/$E$3)/('manual inputs_secondary'!$D$23/12))/9)*$AO$3)/'manual inputs_secondary'!$C$16)","v":""},{"$f":"IF($B28=\"\",\"\",(((($AM28*'manual inputs_secondary'!$C$17/$E$3)/('manual inputs_secondary'!$D$23/12))/9)))","v":""},{"$f":"IF($B28=\"\",\"\",((((($AM28*'manual inputs_secondary'!$C$17/$E$3)/('manual inputs_secondary'!$D$23/12))/9)*$AQ$3)/'manual inputs_secondary'!$C$17)*'manual inputs_secondary'!$C$12)","v":""},{"$f":"IF($B28=\"\",\"\",(((($AM28*'manual inputs_secondary'!$C$17/$E$3)/('manual inputs_secondary'!$D$23/12))/9)*$AO$3)/'manual inputs_secondary'!$C$16)","v":""},{"$f":"IF($C$5=\"n/a\",\"\",IF(B28=\"\",\"\",IFERROR(INDEX('quantities report_secondary'!$D$2:$D$9877,SMALL(IF('quantities report_secondary'!$A$2:$A$9877=AS$3,ROW('quantities report_secondary'!$A$2:$A$9877)-1,\"\"),ROWS($B$9:$B28))),\"0\")))","v":""}," ",{"$f":"IF($C28=\"\",\" \",(AT28/('manual inputs_secondary'!$C$21/12)/9))","v":" "}]
[null,{"$f":"IFERROR(INDEX('manual inputs_secondary'!J:J,SMALL(IF('manual inputs_secondary'!J:J<>\"\",ROW('manual inputs_secondary'!J:J)),ROW('manual inputs_secondary'!23:23))),\"\")","v":""},{"$f":"IF($C$5=\"n/a\",\"\",IF(B29=\"\",\"\",IFERROR(INDEX('quantities report'!$D$2:$D$9877,SMALL(IF('quantities report'!$A$2:$A$9877=C$3,ROW('quantities report'!$A$2:$A$9877)-1,\"\"),ROWS($B$9:$B29))),\"0\")))","v":""}," ",{"$f":"IF($C29=\"\",\" \",(D29*$E$3/'manual inputs'!$C$17))","v":" "},{"$f":"IF($C$5=\"n/a\",\"\",IF(B29=\"\",\"\",IFERROR(INDEX('quantities report'!$D$2:$D$9877,SMALL(IF('quantities report'!$A$2:$A$9877=F$3,ROW('quantities report'!$A$2:$A$9877)-1,\"\"),ROWS($B$9:$B29))),\"0\")))","v":""}," ",{"$f":"IF($F29=\"\",\" \",(G29*$E$3/'manual inputs'!$C$17))","v":" "},"",{"$f":"IF($J$5=\"n/a\",\"\",IF(B29=\"\",\"\",IFERROR(INDEX('quantities report'!$D$2:$D$9877,SMALL(IF('quantities report'!$A$2:$A$9877=J$3,ROW('quantities report'!$A$2:$A$9877)-1,\"\"),ROWS($B$9:$B29))),\"0\")))","v":""}," ",{"$f":"IF($J29=\"\",\" \",(K29*$L$3/'manual inputs'!$C$17))","v":" "},{"$f":"IF($J$5=\"n/a\",\"\",IF(B29=\"\",\"\",IFERROR(INDEX('quantities report'!$D$2:$D$9877,SMALL(IF('quantities report'!$A$2:$A$9877=M$3,ROW('quantities report'!$A$2:$A$9877)-1,\"\"),ROWS($B$9:$B29))),\"0\")))","v":""}," ",{"$f":"IF($M29=\"\",\" \",(N29*$O$3/'manual inputs'!$C$17))","v":" "},"",{"$f":"IF($Q$5=\"n/a\",\"\",IF(B29=\"\",\"\",IFERROR(INDEX('quantities report'!$D$2:$D$9877,SMALL(IF('quantities report'!$A$2:$A$9877=Q$3,ROW('quantities report'!$A$2:$A$9877)-1,\"\"),ROWS($B$9:$B29))),\"0\")))","v":""}," ",{"$f":"IF($Q29=\"\",\" \",(R29*$S$3/'manual inputs'!$C$17))","v":" "},{"$f":"IF($Q$5=\"n/a\",\"\",IF(I29=\"\",\"\",IFERROR(INDEX('quantities report'!$D$2:$D$9877,SMALL(IF('quantities report'!$A$2:$A$9877=T$3,ROW('quantities report'!$A$2:$A$9877)-1,\"\"),ROWS($B$9:$B29))),\"0\")))","v":""}," ",{"$f":"IF($T29=\"\",\" \",(U29*$V$3/'manual inputs'!$C$17))","v":" "},"",{"$f":"IF($X$5=\"n/a\",\"\",IF(B29=\"\",\"\",IFERROR(INDEX('quantities report'!$D$2:$D$9877,SMALL(IF('quantities report'!$A$2:$A$9877=X$3,ROW('quantities report'!$A$2:$A$9877)-1,\"\"),ROWS($B$9:$B29))),\"0\")))","v":""}," ",{"$f":"IF($X29=\"\",\" \",(Y29*$Z$3/'manual inputs'!$C$17))","v":" "},{"$f":"IF($X$5=\"n/a\",\"\",IF(B29=\"\",\"\",IFERROR(INDEX('quantities report'!$D$2:$D$9877,SMALL(IF('quantities report'!$A$2:$A$9877=AA$3,ROW('quantities report'!$A$2:$A$9877)-1,\"\"),ROWS($B$9:$B29))),\"0\")))","v":""}," ",{"$f":"IF($AA29=\"\",\" \",(AB29*$AC$3/'manual inputs'!$C$17))","v":" "},"",{"$f":"IF($AE$5=\"n/a\",\"\",IF(B29=\"\",\"\",IFERROR(INDEX('quantities report'!$D$2:$D$9877,SMALL(IF('quantities report'!$A$2:$A$9877=AE$3,ROW('quantities report'!$A$2:$A$9877)-1,\"\"),ROWS($B$9:$B29))),\"0\")))","v":""}," ",{"$f":"IF($AE29=\"\",\" \",(AF29*$AG$3/'manual inputs'!$C$17))","v":" "},{"$f":"IF($AE$5=\"n/a\",\"\",IF(B29=\"\",\"\",IFERROR(INDEX('quantities report'!$D$2:$D$9877,SMALL(IF('quantities report'!$A$2:$A$9877=AH$3,ROW('quantities report'!$A$2:$A$9877)-1,\"\"),ROWS($B$9:$B29))),\"0\")))","v":""}," ",{"$f":"IF($AE29=\"\",\" \",(AI29*$AJ$3/'manual inputs'!$C$17))","v":" "},""," "," ",{"$f":"IF(B29=\"\",\"\",(AM29*'manual inputs_secondary'!$C$6))","v":""},{"$f":"IF($B29=\"\",\"\",(((($AM29*'manual inputs_secondary'!$C$17/$E$3)/('manual inputs_secondary'!$D$23/12))/9)*$AO$3)/'manual inputs_secondary'!$C$16)","v":""},{"$f":"IF($B29=\"\",\"\",(((($AM29*'manual inputs_secondary'!$C$17/$E$3)/('manual inputs_secondary'!$D$23/12))/9)))","v":""},{"$f":"IF($B29=\"\",\"\",((((($AM29*'manual inputs_secondary'!$C$17/$E$3)/('manual inputs_secondary'!$D$23/12))/9)*$AQ$3)/'manual inputs_secondary'!$C$17)*'manual inputs_secondary'!$C$12)","v":""},{"$f":"IF($B29=\"\",\"\",(((($AM29*'manual inputs_secondary'!$C$17/$E$3)/('manual inputs_secondary'!$D$23/12))/9)*$AO$3)/'manual inputs_secondary'!$C$16)","v":""},{"$f":"IF($C$5=\"n/a\",\"\",IF(B29=\"\",\"\",IFERROR(INDEX('quantities report_secondary'!$D$2:$D$9877,SMALL(IF('quantities report_secondary'!$A$2:$A$9877=AS$3,ROW('quantities report_secondary'!$A$2:$A$9877)-1,\"\"),ROWS($B$9:$B29))),\"0\")))","v":""}," ",{"$f":"IF($C29=\"\",\" \",(AT29/('manual inputs_secondary'!$C$21/12)/9))","v":" "}]
[null,{"$f":"IFERROR(INDEX('manual inputs_secondary'!J:J,SMALL(IF('manual inputs_secondary'!J:J<>\"\",ROW('manual inputs_secondary'!J:J)),ROW('manual inputs_secondary'!24:24))),\"\")","v":""},{"$f":"IF($C$5=\"n/a\",\"\",IF(B30=\"\",\"\",IFERROR(INDEX('quantities report'!$D$2:$D$9877,SMALL(IF('quantities report'!$A$2:$A$9877=C$3,ROW('quantities report'!$A$2:$A$9877)-1,\"\"),ROWS($B$9:$B30))),\"0\")))","v":""}," ",{"$f":"IF($C30=\"\",\" \",(D30*$E$3/'manual inputs'!$C$17))","v":" "},{"$f":"IF($C$5=\"n/a\",\"\",IF(B30=\"\",\"\",IFERROR(INDEX('quantities report'!$D$2:$D$9877,SMALL(IF('quantities report'!$A$2:$A$9877=F$3,ROW('quantities report'!$A$2:$A$9877)-1,\"\"),ROWS($B$9:$B30))),\"0\")))","v":""}," ",{"$f":"IF($F30=\"\",\" \",(G30*$E$3/'manual inputs'!$C$17))","v":" "},"",{"$f":"IF($J$5=\"n/a\",\"\",IF(B30=\"\",\"\",IFERROR(INDEX('quantities report'!$D$2:$D$9877,SMALL(IF('quantities report'!$A$2:$A$9877=J$3,ROW('quantities report'!$A$2:$A$9877)-1,\"\"),ROWS($B$9:$B30))),\"0\")))","v":""}," ",{"$f":"IF($J30=\"\",\" \",(K30*$L$3/'manual inputs'!$C$17))","v":" "},{"$f":"IF($J$5=\"n/a\",\"\",IF(B30=\"\",\"\",IFERROR(INDEX('quantities report'!$D$2:$D$9877,SMALL(IF('quantities report'!$A$2:$A$9877=M$3,ROW('quantities report'!$A$2:$A$9877)-1,\"\"),ROWS($B$9:$B30))),\"0\")))","v":""}," ",{"$f":"IF($M30=\"\",\" \",(N30*$O$3/'manual inputs'!$C$17))","v":" "},"",{"$f":"IF($Q$5=\"n/a\",\"\",IF(B30=\"\",\"\",IFERROR(INDEX('quantities report'!$D$2:$D$9877,SMALL(IF('quantities report'!$A$2:$A$9877=Q$3,ROW('quantities report'!$A$2:$A$9877)-1,\"\"),ROWS($B$9:$B30))),\"0\")))","v":""}," ",{"$f":"IF($Q30=\"\",\" \",(R30*$S$3/'manual inputs'!$C$17))","v":" "},{"$f":"IF($Q$5=\"n/a\",\"\",IF(I30=\"\",\"\",IFERROR(INDEX('quantities report'!$D$2:$D$9877,SMALL(IF('quantities report'!$A$2:$A$9877=T$3,ROW('quantities report'!$A$2:$A$9877)-1,\"\"),ROWS($B$9:$B30))),\"0\")))","v":""}," ",{"$f":"IF($T30=\"\",\" \",(U30*$V$3/'manual inputs'!$C$17))","v":" "},"",{"$f":"IF($X$5=\"n/a\",\"\",IF(B30=\"\",\"\",IFERROR(INDEX('quantities report'!$D$2:$D$9877,SMALL(IF('quantities report'!$A$2:$A$9877=X$3,ROW('quantities report'!$A$2:$A$9877)-1,\"\"),ROWS($B$9:$B30))),\"0\")))","v":""}," ",{"$f":"IF($X30=\"\",\" \",(Y30*$Z$3/'manual inputs'!$C$17))","v":" "},{"$f":"IF($X$5=\"n/a\",\"\",IF(B30=\"\",\"\",IFERROR(INDEX('quantities report'!$D$2:$D$9877,SMALL(IF('quantities report'!$A$2:$A$9877=AA$3,ROW('quantities report'!$A$2:$A$9877)-1,\"\"),ROWS($B$9:$B30))),\"0\")))","v":""}," ",{"$f":"IF($AA30=\"\",\" \",(AB30*$AC$3/'manual inputs'!$C$17))","v":" "},"",{"$f":"IF($AE$5=\"n/a\",\"\",IF(B30=\"\",\"\",IFERROR(INDEX('quantities report'!$D$2:$D$9877,SMALL(IF('quantities report'!$A$2:$A$9877=AE$3,ROW('quantities report'!$A$2:$A$9877)-1,\"\"),ROWS($B$9:$B30))),\"0\")))","v":""}," ",{"$f":"IF($AE30=\"\",\" \",(AF30*$AG$3/'manual inputs'!$C$17))","v":" "},{"$f":"IF($AE$5=\"n/a\",\"\",IF(B30=\"\",\"\",IFERROR(INDEX('quantities report'!$D$2:$D$9877,SMALL(IF('quantities report'!$A$2:$A$9877=AH$3,ROW('quantities report'!$A$2:$A$9877)-1,\"\"),ROWS($B$9:$B30))),\"0\")))","v":""}," ",{"$f":"IF($AE30=\"\",\" \",(AI30*$AJ$3/'manual inputs'!$C$17))","v":" "},""," "," ",{"$f":"IF(B30=\"\",\"\",(AM30*'manual inputs_secondary'!$C$6))","v":""},{"$f":"IF($B30=\"\",\"\",(((($AM30*'manual inputs_secondary'!$C$17/$E$3)/('manual inputs_secondary'!$D$23/12))/9)*$AO$3)/'manual inputs_secondary'!$C$16)","v":""},{"$f":"IF($B30=\"\",\"\",(((($AM30*'manual inputs_secondary'!$C$17/$E$3)/('manual inputs_secondary'!$D$23/12))/9)))","v":""},{"$f":"IF($B30=\"\",\"\",((((($AM30*'manual inputs_secondary'!$C$17/$E$3)/('manual inputs_secondary'!$D$23/12))/9)*$AQ$3)/'manual inputs_secondary'!$C$17)*'manual inputs_secondary'!$C$12)","v":""},{"$f":"IF($B30=\"\",\"\",(((($AM30*'manual inputs_secondary'!$C$17/$E$3)/('manual inputs_secondary'!$D$23/12))/9)*$AO$3)/'manual inputs_secondary'!$C$16)","v":""},{"$f":"IF($C$5=\"n/a\",\"\",IF(B30=\"\",\"\",IFERROR(INDEX('quantities report_secondary'!$D$2:$D$9877,SMALL(IF('quantities report_secondary'!$A$2:$A$9877=AS$3,ROW('quantities report_secondary'!$A$2:$A$9877)-1,\"\"),ROWS($B$9:$B30))),\"0\")))","v":""}," ",{"$f":"IF($C30=\"\",\" \",(AT30/('manual inputs_secondary'!$C$21/12)/9))","v":" "}]
[null,{"$f":"IFERROR(INDEX('manual inputs_secondary'!J:J,SMALL(IF('manual inputs_secondary'!J:J<>\"\",ROW('manual inputs_secondary'!J:J)),ROW('manual inputs_secondary'!25:25))),\"\")","v":""},{"$f":"IF($C$5=\"n/a\",\"\",IF(B31=\"\",\"\",IFERROR(INDEX('quantities report'!$D$2:$D$9877,SMALL(IF('quantities report'!$A$2:$A$9877=C$3,ROW('quantities report'!$A$2:$A$9877)-1,\"\"),ROWS($B$9:$B31))),\"0\")))","v":""}," ",{"$f":"IF($C31=\"\",\" \",(D31*$E$3/'manual inputs'!$C$17))","v":" "},{"$f":"IF($C$5=\"n/a\",\"\",IF(B31=\"\",\"\",IFERROR(INDEX('quantities report'!$D$2:$D$9877,SMALL(IF('quantities report'!$A$2:$A$9877=F$3,ROW('quantities report'!$A$2:$A$9877)-1,\"\"),ROWS($B$9:$B31))),\"0\")))","v":""}," ",{"$f":"IF($F31=\"\",\" \",(G31*$E$3/'manual inputs'!$C$17))","v":" "},"",{"$f":"IF($J$5=\"n/a\",\"\",IF(B31=\"\",\"\",IFERROR(INDEX('quantities report'!$D$2:$D$9877,SMALL(IF('quantities report'!$A$2:$A$9877=J$3,ROW('quantities report'!$A$2:$A$9877)-1,\"\"),ROWS($B$9:$B31))),\"0\")))","v":""}," ",{"$f":"IF($J31=\"\",\" \",(K31*$L$3/'manual inputs'!$C$17))","v":" "},{"$f":"IF($J$5=\"n/a\",\"\",IF(B31=\"\",\"\",IFERROR(INDEX('quantities report'!$D$2:$D$9877,SMALL(IF('quantities report'!$A$2:$A$9877=M$3,ROW('quantities report'!$A$2:$A$9877)-1,\"\"),ROWS($B$9:$B31))),\"0\")))","v":""}," ",{"$f":"IF($M31=\"\",\" \",(N31*$O$3/'manual inputs'!$C$17))","v":" "},"",{"$f":"IF($Q$5=\"n/a\",\"\",IF(B31=\"\",\"\",IFERROR(INDEX('quantities report'!$D$2:$D$9877,SMALL(IF('quantities report'!$A$2:$A$9877=Q$3,ROW('quantities report'!$A$2:$A$9877)-1,\"\"),ROWS($B$9:$B31))),\"0\")))","v":""}," ",{"$f":"IF($Q31=\"\",\" \",(R31*$S$3/'manual inputs'!$C$17))","v":" "},{"$f":"IF($Q$5=\"n/a\",\"\",IF(I31=\"\",\"\",IFERROR(INDEX('quantities report'!$D$2:$D$9877,SMALL(IF('quantities report'!$A$2:$A$9877=T$3,ROW('quantities report'!$A$2:$A$9877)-1,\"\"),ROWS($B$9:$B31))),\"0\")))","v":""}," ",{"$f":"IF($T31=\"\",\" \",(U31*$V$3/'manual inputs'!$C$17))","v":" "},"",{"$f":"IF($X$5=\"n/a\",\"\",IF(B31=\"\",\"\",IFERROR(INDEX('quantities report'!$D$2:$D$9877,SMALL(IF('quantities report'!$A$2:$A$9877=X$3,ROW('quantities report'!$A$2:$A$9877)-1,\"\"),ROWS($B$9:$B31))),\"0\")))","v":""}," ",{"$f":"IF($X31=\"\",\" \",(Y31*$Z$3/'manual inputs'!$C$17))","v":" "},{"$f":"IF($X$5=\"n/a\",\"\",IF(B31=\"\",\"\",IFERROR(INDEX('quantities report'!$D$2:$D$9877,SMALL(IF('quantities report'!$A$2:$A$9877=AA$3,ROW('quantities report'!$A$2:$A$9877)-1,\"\"),ROWS($B$9:$B31))),\"0\")))","v":""}," ",{"$f":"IF($AA31=\"\",\" \",(AB31*$AC$3/'manual inputs'!$C$17))","v":" "},"",{"$f":"IF($AE$5=\"n/a\",\"\",IF(B31=\"\",\"\",IFERROR(INDEX('quantities report'!$D$2:$D$9877,SMALL(IF('quantities report'!$A$2:$A$9877=AE$3,ROW('quantities report'!$A$2:$A$9877)-1,\"\"),ROWS($B$9:$B31))),\"0\")))","v":""}," ",{"$f":"IF($AE31=\"\",\" \",(AF31*$AG$3/'manual inputs'!$C$17))","v":" "},{"$f":"IF($AE$5=\"n/a\",\"\",IF(B31=\"\",\"\",IFERROR(INDEX('quantities report'!$D$2:$D$9877,SMALL(IF('quantities report'!$A$2:$A$9877=AH$3,ROW('quantities report'!$A$2:$A$9877)-1,\"\"),ROWS($B$9:$B31))),\"0\")))","v":""}," ",{"$f":"IF($AE31=\"\",\" \",(AI31*$AJ$3/'manual inputs'!$C$17))","v":" "},""," "," ",{"$f":"IF(B31=\"\",\"\",(AM31*'manual inputs_secondary'!$C$6))","v":""},{"$f":"IF($B31=\"\",\"\",(((($AM31*'manual inputs_secondary'!$C$17/$E$3)/('manual inputs_secondary'!$D$23/12))/9)*$AO$3)/'manual inputs_secondary'!$C$16)","v":""},{"$f":"IF($B31=\"\",\"\",(((($AM31*'manual inputs_secondary'!$C$17/$E$3)/('manual inputs_secondary'!$D$23/12))/9)))","v":""},{"$f":"IF($B31=\"\",\"\",((((($AM31*'manual inputs_secondary'!$C$17/$E$3)/('manual inputs_secondary'!$D$23/12))/9)*$AQ$3)/'manual inputs_secondary'!$C$17)*'manual inputs_secondary'!$C$12)","v":""},{"$f":"IF($B31=\"\",\"\",(((($AM31*'manual inputs_secondary'!$C$17/$E$3)/('manual inputs_secondary'!$D$23/12))/9)*$AO$3)/'manual inputs_secondary'!$C$16)","v":""},{"$f":"IF($C$5=\"n/a\",\"\",IF(B31=\"\",\"\",IFERROR(INDEX('quantities report_secondary'!$D$2:$D$9877,SMALL(IF('quantities report_secondary'!$A$2:$A$9877=AS$3,ROW('quantities report_secondary'!$A$2:$A$9877)-1,\"\"),ROWS($B$9:$B31))),\"0\")))","v":""}," ",{"$f":"IF($C31=\"\",\" \",(AT31/('manual inputs_secondary'!$C$21/12)/9))","v":" "}]
[null,{"$f":"IFERROR(INDEX('manual inputs_secondary'!J:J,SMALL(IF('manual inputs_secondary'!J:J<>\"\",ROW('manual inputs_secondary'!J:J)),ROW('manual inputs_secondary'!26:26))),\"\")","v":""},{"$f":"IF($C$5=\"n/a\",\"\",IF(B32=\"\",\"\",IFERROR(INDEX('quantities report'!$D$2:$D$9877,SMALL(IF('quantities report'!$A$2:$A$9877=C$3,ROW('quantities report'!$A$2:$A$9877)-1,\"\"),ROWS($B$9:$B32))),\"0\")))","v":""}," ",{"$f":"IF($C32=\"\",\" \",(D32*$E$3/'manual inputs'!$C$17))","v":" "},{"$f":"IF($C$5=\"n/a\",\"\",IF(B32=\"\",\"\",IFERROR(INDEX('quantities report'!$D$2:$D$9877,SMALL(IF('quantities report'!$A$2:$A$9877=F$3,ROW('quantities report'!$A$2:$A$9877)-1,\"\"),ROWS($B$9:$B32))),\"0\")))","v":""}," ",{"$f":"IF($F32=\"\",\" \",(G32*$E$3/'manual inputs'!$C$17))","v":" "},"",{"$f":"IF($J$5=\"n/a\",\"\",IF(B32=\"\",\"\",IFERROR(INDEX('quantities report'!$D$2:$D$9877,SMALL(IF('quantities report'!$A$2:$A$9877=J$3,ROW('quantities report'!$A$2:$A$9877)-1,\"\"),ROWS($B$9:$B32))),\"0\")))","v":""}," ",{"$f":"IF($J32=\"\",\" \",(K32*$L$3/'manual inputs'!$C$17))","v":" "},{"$f":"IF($J$5=\"n/a\",\"\",IF(B32=\"\",\"\",IFERROR(INDEX('quantities report'!$D$2:$D$9877,SMALL(IF('quantities report'!$A$2:$A$9877=M$3,ROW('quantities report'!$A$2:$A$9877)-1,\"\"),ROWS($B$9:$B32))),\"0\")))","v":""}," ",{"$f":"IF($M32=\"\",\" \",(N32*$O$3/'manual inputs'!$C$17))","v":" "},"",{"$f":"IF($Q$5=\"n/a\",\"\",IF(B32=\"\",\"\",IFERROR(INDEX('quantities report'!$D$2:$D$9877,SMALL(IF('quantities report'!$A$2:$A$9877=Q$3,ROW('quantities report'!$A$2:$A$9877)-1,\"\"),ROWS($B$9:$B32))),\"0\")))","v":""}," ",{"$f":"IF($Q32=\"\",\" \",(R32*$S$3/'manual inputs'!$C$17))","v":" "},{"$f":"IF($Q$5=\"n/a\",\"\",IF(I32=\"\",\"\",IFERROR(INDEX('quantities report'!$D$2:$D$9877,SMALL(IF('quantities report'!$A$2:$A$9877=T$3,ROW('quantities report'!$A$2:$A$9877)-1,\"\"),ROWS($B$9:$B32))),\"0\")))","v":""}," ",{"$f":"IF($T32=\"\",\" \",(U32*$V$3/'manual inputs'!$C$17))","v":" "},"",{"$f":"IF($X$5=\"n/a\",\"\",IF(B32=\"\",\"\",IFERROR(INDEX('quantities report'!$D$2:$D$9877,SMALL(IF('quantities report'!$A$2:$A$9877=X$3,ROW('quantities report'!$A$2:$A$9877)-1,\"\"),ROWS($B$9:$B32))),\"0\")))","v":""}," ",{"$f":"IF($X32=\"\",\" \",(Y32*$Z$3/'manual inputs'!$C$17))","v":" "},{"$f":"IF($X$5=\"n/a\",\"\",IF(B32=\"\",\"\",IFERROR(INDEX('quantities report'!$D$2:$D$9877,SMALL(IF('quantities report'!$A$2:$A$9877=AA$3,ROW('quantities report'!$A$2:$A$9877)-1,\"\"),ROWS($B$9:$B32))),\"0\")))","v":""}," ",{"$f":"IF($AA32=\"\",\" \",(AB32*$AC$3/'manual inputs'!$C$17))","v":" "},"",{"$f":"IF($AE$5=\"n/a\",\"\",IF(B32=\"\",\"\",IFERROR(INDEX('quantities report'!$D$2:$D$9877,SMALL(IF('quantities report'!$A$2:$A$9877=AE$3,ROW('quantities report'!$A$2:$A$9877)-1,\"\"),ROWS($B$9:$B32))),\"0\")))","v":""}," ",{"$f":"IF($AE32=\"\",\" \",(AF32*$AG$3/'manual inputs'!$C$17))","v":" "},{"$f":"IF($AE$5=\"n/a\",\"\",IF(B32=\"\",\"\",IFERROR(INDEX('quantities report'!$D$2:$D$9877,SMALL(IF('quantities report'!$A$2:$A$9877=AH$3,ROW('quantities report'!$A$2:$A$9877)-1,\"\"),ROWS($B$9:$B32))),\"0\")))","v":""}," ",{"$f":"IF($AE32=\"\",\" \",(AI32*$AJ$3/'manual inputs'!$C$17))","v":" "},""," "," ",{"$f":"IF(B32=\"\",\"\",(AM32*'manual inputs_secondary'!$C$6))","v":""},{"$f":"IF($B32=\"\",\"\",(((($AM32*'manual inputs_secondary'!$C$17/$E$3)/('manual inputs_secondary'!$D$23/12))/9)*$AO$3)/'manual inputs_secondary'!$C$16)","v":""},{"$f":"IF($B32=\"\",\"\",(((($AM32*'manual inputs_secondary'!$C$17/$E$3)/('manual inputs_secondary'!$D$23/12))/9)))","v":""},{"$f":"IF($B32=\"\",\"\",((((($AM32*'manual inputs_secondary'!$C$17/$E$3)/('manual inputs_secondary'!$D$23/12))/9)*$AQ$3)/'manual inputs_secondary'!$C$17)*'manual inputs_secondary'!$C$12)","v":""},{"$f":"IF($B32=\"\",\"\",(((($AM32*'manual inputs_secondary'!$C$17/$E$3)/('manual inputs_secondary'!$D$23/12))/9)*$AO$3)/'manual inputs_secondary'!$C$16)","v":""},{"$f":"IF($C$5=\"n/a\",\"\",IF(B32=\"\",\"\",IFERROR(INDEX('quantities report_secondary'!$D$2:$D$9877,SMALL(IF('quantities report_secondary'!$A$2:$A$9877=AS$3,ROW('quantities report_secondary'!$A$2:$A$9877)-1,\"\"),ROWS($B$9:$B32))),\"0\")))","v":""}," ",{"$f":"IF($C32=\"\",\" \",(AT32/('manual inputs_secondary'!$C$21/12)/9))","v":" "}]
[null,{"$f":"IFERROR(INDEX(#REF!,SMALL(IF(#REF!<>\"\",ROW(#REF!)),ROW(28:28))),\"\")","v":""}]

{"sheet":"calc wrksht-rdwy exc Secondary","index":9,"n_rows":52,"n_cols":5,"rows_kept":52,"cut":false,"hidden":true,"merged":[[1,1,1,4]]}
[]
[null,"EARTHWORK SUMMARY\nUSING ROADWAY EXCAVATION AND EITHER BORROW OR WASTE PAY ITEMS"]
[]
[null,"EXCAVATION (unadjusted volumes)"]
[null,null,"Total Roadway Prism Excavation =",{"$f":"SUM(#REF!)","v":{"$error":"#REF!"}},"CUYD"]
[null,null,"Total Approach Road Prism Excavation =",{"$f":"#REF!","v":{"$error":"#REF!"}},"CUYD"]
[null,null,"Total Pay Item 20401-0000 Roadway Excavation =",{"$f":"SUM(D5:D6)","v":{"$error":"#REF!"}},"CUYD"]
[]
[null,"EXCAVATION MATERIAL AVAILABLE FOR FILL (unadjusted volumes)"]
[null,null,"Total Structure Excavation (walls) =",{"$f":"#REF!","v":{"$error":"#REF!"}},"CUYD"]
[null,null,"Total Excavation from Roadway Obliteration = ",{"$f":"#REF!","v":{"$error":"#REF!"}},"CUYD"]
[null,null,"Total Subexcavation =",{"$f":"#REF!","v":{"$error":"#REF!"}},"CUYD"]
[null,null,"Total =",{"$f":"SUM(D10:D12)","v":{"$error":"#REF!"}},"CUYD"]
[]
[null,"EXCAVATION MATERIAL UNAVAILABLE FOR FILL (unadjusted volumes)"]
[null,null,"Total Pavement Removal in Cuts =",{"$f":"#REF!","v":{"$error":"#REF!"}},"CUYD"]
[null,null,"Total Topsoil Stripping in Cuts =",{"$f":"#REF!","v":{"$error":"#REF!"}},"CUYD"]
[null,null,"Total Waste Subexcavation =",{"$f":"#REF!","v":{"$error":"#REF!"}},"CUYD"]
[null,null,"Total =",{"$f":"SUM(D16:D18)","v":{"$error":"#REF!"}},"CUYD"]
[]
[null,"TOTAL EXCAVATION AVAILABLE FOR FILLS (adjusted volume)"]
[null,null,"Total Volume After Adjustments Applied (Including Shrink/Swell) =",{"$f":"#REF!","v":{"$error":"#REF!"}},"CUYD"]
[]
[null,"EMBANKMENT (unadjusted volumes)"]
[null,null,"Total Roadway Prism Fill =",{"$f":"#REF!","v":{"$error":"#REF!"}},"CUYD"]
[null,null,"Total Approach Road Prism Fill =",{"$f":"#REF!","v":{"$error":"#REF!"}},"CUYD"]
[null,null,"Total =",{"$f":"SUM(D25:D26)","v":{"$error":"#REF!"}},"CUYD"]
[]
[null,"VARIOUS BACKFILL MATERIAL GENERATED ONSITE"]
[null,null,"Total Various Types of Wall Backfill Material =",{"$f":"SUM(#REF!)","v":{"$error":"#REF!"}},"CUYD"]
[null,null,"Total Backfill for Pavement Removal Under Fill =",{"$f":"#REF!","v":{"$error":"#REF!"}},"CUYD"]
[null,null,"Total Topsoil Replacement Under Fill =",{"$f":"#REF!","v":{"$error":"#REF!"}},"CUYD"]
[null,null,"Total Volume for Riprap =",{"$f":"#REF!","v":{"$error":"#REF!"}},"CUYD"]
[null,null,"Total Volume for Special Rock Embankment =",{"$f":"#REF!","v":{"$error":"#REF!"}},"CUYD"]
[null,null,"Total Embankment for Roadway Obliteration =",{"$f":"#REF!","v":{"$error":"#REF!"}},"CUYD"]
[null,null,"Total Subexcavation =",{"$f":"#REF!","v":{"$error":"#REF!"}},"CUYD"]
[null,null,"Total Volume for Topping or Select Topping =",{"$f":"#REF!","v":{"$error":"#REF!"}},"CUYD"]
[null,null,"Total Volume for Aggregate Base =",{"$f":"#REF!","v":{"$error":"#REF!"}},"CUYD"]
[null,null,"Total =",{"$f":"SUM(D30:D38)","v":{"$error":"#REF!"}},"CUYD"]
[]
[null,"EXCAVATION MINUS EMBANKMENT"]
[null,null,"Total Estimated Excavation Available for Fills =",{"$f":"D22","v":{"$error":"#REF!"}},"CUYD"]
[null,null,"Total Estimated Fill Material Required =",{"$f":"D27+D39","v":{"$error":"#REF!"}},"CUYD"]
[null,null,"Excavation - Embankment = ",{"$f":"D42-D43","v":{"$error":"#REF!"}},"CUYD"]
[]
[null,"WASTE"]
[null,null,"Estimated Total Pay Item 20441-0000 Waste =",{"$f":"IF(D44>0,D44,\"NA\")","v":{"$error":"#REF!"}},"CUYD"]
[]
[null,"BORROW"]
[null,null,"Estimated Unadjusted Volume of Unclassified Borrow Required =",{"$f":"IF(D44<0,ABS(D44), \"NA\" )","v":{"$error":"#REF!"}},"CUYD"]
[null,null,"Estimated Shrink / Swell at Borrow Pit Site =",0.9]
[null,null,"Estimated Total Pay Item 20403-0000 Unclassified Borrow  =",{"$f":"IF(D50=\"NA\",\"NA\",ABS((ROUNDUP(D50/D51,0))))","v":{"$error":"#REF!"}},"CUYD"]

{"sheet":"calc wrksht-emb const Secondary","index":10,"n_rows":52,"n_cols":5,"rows_kept":52,"cut":false,"hidden":true,"merged":[[1,1,1,4]]}
[]
[null,"EARTHWORK SUMMARY\nUSING EMBANKMENT CONSTRUCTION PAY ITEM"]
[]
[null,"EXCAVATION (unadjusted volumes)"]
[null,null,"Total Roadway Prism Excavation =",{"$f":"SUM(#REF!)","v":{"$error":"#REF!"}},"CUYD"]
[null,null,"Total Approach Road Prism Excavation =",{"$f":"#REF!","v":{"$error":"#REF!"}},"CUYD"]
[null,null,"Total =",{"$f":"SUM(D5:D6)","v":{"$error":"#REF!"}},"CUYD"]
[]
[null,"EXCAVATION MATERIAL AVAILABLE FOR FILL (unadjusted volumes)"]
[null,null,"Total Structure Excavation (walls) =",{"$f":"#REF!","v":{"$error":"#REF!"}},"CUYD"]
[null,null,"Total Excavation from Roadway Obliteration = ",{"$f":"#REF!","v":{"$error":"#REF!"}},"CUYD"]
[null,null,"Total Subexcavation =",{"$f":"#REF!","v":{"$error":"#REF!"}},"CUYD"]
[null,null,"Total =",{"$f":"SUM(D10:D12)","v":{"$error":"#REF!"}},"CUYD"]
[]
[null,"EXCAVATION MATERIAL UNAVAILABLE FOR FILL (unadjusted volumes)"]
[null,null,"Total Pavement Removal in Cuts =",{"$f":"#REF!","v":{"$error":"#REF!"}},"CUYD"]
[null,null,"Total Topsoil Stripping in Cuts =",{"$f":"#REF!","v":{"$error":"#REF!"}},"CUYD"]
[null,null,"Total Waste Subexcavation =",{"$f":"#REF!","v":{"$error":"#REF!"}},"CUYD"]
[null,null,"Total =",{"$f":"SUM(D16:D18)","v":{"$error":"#REF!"}},"CUYD"]
[]
[null,"TOTAL EXCAVATION AVAILABLE FOR FILLS (adjusted volume)"]
[null,null,"Total Volume After Adjustments Applied (Including Shrink/Swell) =",{"$f":"#REF!","v":{"$error":"#REF!"}},"CUYD"]
[]
[null,"EMBANKMENT (unadjusted volumes)"]
[null,null,"Total Roadway Prism Fill =",{"$f":"#REF!","v":{"$error":"#REF!"}},"CUYD"]
[null,null,"Total Approach Road Prism Fill =",{"$f":"#REF!","v":{"$error":"#REF!"}},"CUYD"]
[null,null,"Total =",{"$f":"SUM(D25:D26)","v":{"$error":"#REF!"}},"CUYD"]
[]
[null,"VARIOUS BACKFILL MATERIAL GENERATED ONSITE"]
[null,null,"Total Various Types of Wall Backfill Material =",{"$f":"SUM(#REF!)","v":{"$error":"#REF!"}},"CUYD"]
[null,null,"Total Backfill for Pavement Removal Under Fill =",{"$f":"#REF!","v":{"$error":"#REF!"}},"CUYD"]
[null,null,"Total Topsoil Replacement Under Fill =",{"$f":"#REF!","v":{"$error":"#REF!"}},"CUYD"]
[null,null,"Total Volume for Riprap =",{"$f":"#REF!","v":{"$error":"#REF!"}},"CUYD"]
[null,null,"Total Volume for Special Rock Embankment =",{"$f":"#REF!","v":{"$error":"#REF!"}},"CUYD"]
[null,null,"Total Embankment for Roadway Obliteration =",{"$f":"#REF!","v":{"$error":"#REF!"}},"CUYD"]
[null,null,"Total Subexcavation =",{"$f":"#REF!","v":{"$error":"#REF!"}},"CUYD"]
[null,null,"Total Volume for Topping or Select Topping =",{"$f":"#REF!","v":{"$error":"#REF!"}},"CUYD"]
[null,null,"Total Volume for Aggregate Base =",{"$f":"#REF!","v":{"$error":"#REF!"}},"CUYD"]
[null,null,"Total =",{"$f":"SUM(D30:D38)","v":{"$error":"#REF!"}},"CUYD"]
[]
[null,"EXCAVATION MINUS EMBANKMENT"]
[null,null,"Total Estimated Excavation Available for Fills =",{"$f":"D22","v":{"$error":"#REF!"}},"CUYD"]
[null,null,"Total Estimated Fill Material Required =",{"$f":"D27+D39","v":{"$error":"#REF!"}},"CUYD"]
[null,null,"Excavation - Embankment = ",{"$f":"D42-D43","v":{"$error":"#REF!"}},"CUYD"]
[]
[null,"EMBANKMENT CONSTRUCTION"]
[null,null,"Estimated Total Pay Item 20420-0000 Embankment Construction =",{"$f":"D27","v":{"$error":"#REF!"}},"CUYD"]
[]
[null,"UNCLASSIFIED BORROW"]
[null,null,"Estimated Unadjusted Volume of Unclassified Borrow Required =",{"$f":"ABS(#REF!)","v":{"$error":"#REF!"}},"CUYD"]
[null,null,"Estimated Shrink / Swell at Borrow Pit Site =",{"$f":"#REF!","v":{"$error":"#REF!"}}]
[null,null,"Estimated Quantity of Unclassified Borrow Required =",{"$f":"#REF!","v":{"$error":"#REF!"}},"CUYD"]