{"text_format":"1","workbook":"xlsx","n_sheets":23,"sheets":["Instructions","quantities report","Totals - QA_QC","manual inputs","Grading","Removals","Structure_Ex","Backfill","calc wrksht-rdwy exc pay item","Grading Summary - rdwy exc","calc wrksht-emb const pay item","Grading Summary - emb const","Conserved Topsoil Summary","Named Boundary Report","Conserved EX Pave Summary","quantities report_secondary","manual inputs_secondary","Grading_secondary","Removals_secondary","Structure_Ex_secondary","Backfill_secondary","calc wrksht-rdwy exc Secondary","calc wrksht-emb const Secondary"],"not_rendered":{"charts":0,"images":6,"macros":1,"external_links":0,"defined_names":5,"comments":0,"pivot_tables":0},"unopened":[],"bounds":{"document_bytes":16777216,"sheet_cells":100000,"rows_first":2000,"rows_last":500,"rows_between":2000,"halvings":0,"cell_chars":16384,"cell_head_chars":4096},"cells_cut":0,"cells_raw":0,"read":"whole","date_system":"1900"}

{"sheet":"Instructions","index":0,"n_rows":43,"n_cols":3,"rows_kept":43,"cut":false,"hidden":false,"merged":[[1,1,1,2],[36,2,40,2],[7,2,29,2]]}
[" "]
[null,"Instructions:"]
[null,1,"Add cut and fill volumes to the corridor"]
[null,2,"Run Quantities by Named boundary report and save file in excel format."]
[null,3,"Select the volumes report"]
[]
[null,4,"The report should be in the following format:"]
[]
[]
[]
[]
[]
[]
[]
[]
[]
[]
[]
[]
[]
[]
[]
[]
[]
[]
[]
[]
[]
[]
[]
[null,5,"Right click on the report in ORD and select Export to Excel"]
[]
[null,6,"Select entire sheet in the volumes excel spreadsheet.  (CTRL-A or select the select all button)"]
[null,7,"Paste data in the quantities report tab in the grading summary spreadsheet."]
[null,8,"Select the rows that contain the whole project totals and cut and paste to the Totals - QA_QC tab."]
[null,9,"Go to the \"Manual Inputs\" page and click on the \"Click Here to Format Worksheet\" button."]
[]
[]
[]
[]
[]
[null,9,"Determine if it is an excavation or embankment job and fill out the appropriate table."]
[null,10,"For major secondary roads use the secondary report tabs."]

{"sheet":"quantities report","index":1,"n_rows":0,"n_cols":0,"rows_kept":0,"cut":false,"hidden":false,"merged":[]}

{"sheet":"Totals - QA_QC","index":2,"n_rows":0,"n_cols":0,"rows_kept":0,"cut":false,"hidden":false,"merged":[]}

{"sheet":"manual inputs","index":3,"n_rows":39,"n_cols":13,"rows_kept":39,"cut":false,"hidden":false,"merged":[[22,1,22,3]]}
[]
[null,"Shrink/Swell Factor Summary",null,null,null,"Various Backfill Material Generated Onsite",null,null,"Number of Rows",null,null,null,"Station Range"]
[null,"Begin Station","End Station","Factor",null,"Place an 'x' in the row for any backfill material that is expected to be generated from onsite excavation.",null,null,{"$f":"LOOKUP(2,1/('quantities report'!A:A<>\"\"),ROW('quantities report'!A:A))","v":{"$error":"#N/A"}},null,null,"Add Starting Station"]
[null,null,null,null,null,"If the material below is expected to be imported because there is not any material from onsite that will meet the material quality requirements, leave the row blank."]
[]
[null,null,null,null,null,"………………..Verify with Geotech and Materials……………….."]
[null,{"$f":"IFERROR(INDEX('manual inputs'!M:M,SMALL(IF(#REF!<>\"\",ROW(#REF!)),ROW(8:8))),\"\")","v":""},null,null,null,"Material Type","Typical Uses","Generated from Onsite Material?"]
[]
[]
[null,null,null,null,null,"Wall Backfill","MSE Wall, SMSE Wall, Rockery, Concrete Retaining Wall with Parapet"]
[]
[null,null,null,null,null,"Foundation Fill","MSE Wall, SMSE Wall, Rockery, Concrete Cut Wall, Concrete Retaining Wall with Parapet, Concrete Fill Wall"]
[]
[]
[null,null,null,null,null,"Select Wall Backfill","MSE Wall, SMSE Wall, GFMSE Wall"]
[]
[null,null,null,null,null,"Rock","Rockery"]
[]
[null,null,null,null,null,"Granular Rock Backdrain","Rockery"]
[]
[null,null,null,null,null,"Structural Backfill","Guardwall, Concrete Cut Wall, Concrete Retaining Wall with Parapet, Concrete Fill Wall"]
[]
[null,"Note:  Do not use '+' sign in begin and end stations above",null,null,null,"Backfill Material","Guardwall, Concrete Retaining Wall with Parapet, Soil Nail Wall"]
[]
[null,null,null,null,null,"Granular Backfill","GFMSE Wall"]
[]
[]
[null,null,null,null,null,"Subex Backfill","Volume may be calculated by\n a. GEOPAK, \n b. Input by hand, or\n c. Both GEOPAK and hand calculations"]
[]
[]
[null,null,null,null,null,"Aggregate Base","Volume not generated by GEOPAK - input by hand."]
[]
[null,null,null,null,null,"Riprap","Volume not generated by GEOPAK - input by hand."]
[]
[null,null,null,null,null,"Special Rock Embankment","Volume not generated by GEOPAK - input by hand."]
[]
[null,null,null,null,null,"Embankment for Roadway Obliteration","Volume not generated by GEOPAK - input by hand."]
[]
[null,null,null,null,null,"Topping or Select Topping","Volume not generated by GEOPAK - input by hand."]

{"sheet":"Grading","index":4,"n_rows":32,"n_cols":42,"rows_kept":32,"cut":false,"hidden":false,"merged":[[3,18,3,33],[3,12,5,12],[3,13,5,13],[3,2,3,4],[3,6,3,8],[3,9,3,11],[3,14,3,17],[3,39,4,39],[3,40,4,40],[3,41,4,41],[3,34,4,34],[3,35,4,35],[3,36,4,36],[3,37,4,37],[3,38,4,38]]}
[null,null,null,null,null,"Pay Column",null,null,null,null,null,null,null,null,null,null,null,"Pay Column"]
[]
["TOTALS",null,{"$f":"SUM(C8:C32)","v":0},{"$f":"SUM(D8:D32)","v":0},{"$f":"SUM(E8:E32)","v":0},{"$f":"SUM(F8:F32)","v":0},{"$f":"SUM(G8:G32)","v":0},0,0,0,0,0,null,{"$f":"SUM(N8:N32)","v":0},{"$f":"SUM(O8:O32)","v":0},{"$f":"SUM(P8:P32)","v":0},{"$f":"SUM(Q8:Q32)","v":0},{"$f":"SUM(R8:R32)","v":0},{"$f":"SUM(S8:S32)","v":0},0,0,0,0,0,0,0,0,0,0,0,0,0,0,0,0,0,0,0,0,{"$f":"AVERAGE(AN8:AN186)","v":0.8999999999999998},{"$f":"SUM(AO8:AO32)","v":0}]
[null,null,"Excavation",null,null,"Total","Excavation Material Available for Fill",null,null,"Excavation Material Unavailable for Fills",null,null,"Shrink/Swell Factor","Total Excavation Available for Fills","Embankment",null,null,null,"Backfill (Needed Volume for Backfill Placed on Site)",null,null,null,null,null,null,null,null,null,null,null,null,null,null,null,"Total Embankment","Excavation \n-\nEmbankment","Waste","Embankment Construction","Unclassifed Borrow Required","Unclassified Borrow Shrink/Swell","Unclassified Borrow","Mass Ordinate"]
[null,null,"Roadway prism minus topsoil and pavement","Total Excavation\nVolumes_Cut+Existing_Payment (removed)+Topsoil (removed)","Approach Road","Total Excavation for Pay","(+)\nStructure Excavation (Walls)","(+)\nExcavation\nFrom\nRoadway\nObliteration","(+)\nSubexcavation","(-)\nPavement Removal in Cuts","(-)\nTopsoil Stripping in Cuts","(-)\nDisposal of Subexcavation Material",null,null,"Roadway Prism (Embankment) plus backfill for topsoil in fills and existing pavment in fills\n","Total Roadway Prism Fill","Approach Road","Total Roadway Prism Fill for Pay","(+)\nCommon Backfill","(+)\nFoundation\nFill","(+)\nSelect Granular\nBackfill","(+)\nRock","(+)\nGranular\nRock Backdrain","(+)\nStructural Backfill","(+)\nCommon\nBackfill","(+)\nGranular\nBackfill","\nBackfill for Pavement Removal Under Fill","\nTopsoil Replacement Under Fill","(+)\nSub-excavation","(+)\nAggregate Base","(+)\nRiprap","(+)\nSpecial Rock Embankment","(+)\nEmbankment For Roadway Obliteration","(+)\nTopping"]
["ORD Component Name",null,"Volumes_Cut: ","Total Excavation","--","Total Excavation for Pay","--","--","Subex_Exc2: ","Exist Pvmt Layer 1 (removed): ","Exist Topsoil (removed): ","Subex_Exc2: ",null,null,"Volumes_Fill: ",null,"--","Total Embankment for Pay","Wall Backfill:","--","MSE Wall Backfill 2: ","Rockery Wall Backfill: ","Rockery Wall Backfill 2: ","Wall Backfill 2: ","--","--","Exist Pvmt Layer 1 (removed and replaced): ","Exist Topsoil (removed and replaced):","Subex_Backfill1: "]
["Enter Start of Project",{"$f":"IFERROR(INDEX('manual inputs'!M:M,SMALL(IF('manual inputs'!M:M<>\"\",ROW('manual inputs'!M:M)),ROW(2:2))),\"\")","v":""}]
[null,{"$f":"IFERROR(INDEX('manual inputs'!M:M,SMALL(IF('manual inputs'!M:M<>\"\",ROW('manual inputs'!M:M)),ROW(3:3))),\"\")","v":""},{"$f":"IF(B8=\"\",\"\",IFERROR(INDEX('quantities report'!$D$2:$D$10003,SMALL(IF('quantities report'!$A$2:$A$10003=C$6,ROW('quantities report'!$A$2:$A$10003)-1,\"\"),ROWS($B$8:$B8))),\"0\"))","v":""},{"$f":"IF(B8=\"\",\"\",$C8+$J8+$K8)","v":""},null,{"$f":"IF(B8=\"\",\"\",$D8+$E8)","v":""},{"$f":"IF($B8=\"\",\"\",Structure_Ex!I8)","v":""},null,{"$f":"IF($B8=\"\",\"\",IFERROR(INDEX('quantities report'!$D$2:$D$10003,SMALL(IF('quantities report'!$A$2:$A$10003=I$6,ROW('quantities report'!$A$2:$A$10003)-1,\"\"),ROWS($B$8:$B8))),\"0\"))","v":""},{"$f":"IF($B8=\"\",\"\",Removals!$F5)","v":""},{"$f":"IF($B8=\"\",\"\",Removals!$K5)","v":""},{"$f":"IF($B8=\"\",\"\",IFERROR(INDEX('quantities report'!$D$2:$D$10003,SMALL(IF('quantities report'!$A$2:$A$10003=L$6,ROW('quantities report'!$A$2:$A$10003)-1,\"\"),ROWS($B$8:$B8))),\"0\"))","v":""},{"$f":"IF(B8=\"\",\"\",LOOKUP(B8,'manual inputs'!$B$4:$B$22,'manual inputs'!$D$4:$D$22))","v":""},{"$f":"IF(B8 =\"\",\"\",(($F8+$G8+$H8+$I8-$J8-$K8-$L8)*$M8))","v":""},{"$f":"IF($B8=\"\",\"\",IFERROR(INDEX('quantities report'!$D$2:$D$10003,SMALL(IF('quantities report'!$A$2:$A$10003=O$6,ROW('quantities report'!$A$2:$A$10003)-1,\"\"),ROWS($B$8:$B8))),\"0\"))","v":""},{"$f":"IF(B8=\"\",\"\",$O8-$AA8-$AB8)","v":""},null,{"$f":"IF(D8=\"\",\"\",$O8-$AA8-$AB8+$Q8)","v":""},{"$f":"IF($B8=\"\",\"\",IFERROR(INDEX('quantities report'!$D$2:$D$10003,SMALL(IF('quantities report'!$A$2:$A$10003=S$6,ROW('quantities report'!$A$2:$A$10003)-1,\"\"),ROWS($B$8:$B8))),\"0\"))","v":""},{"$f":"IF($B8=\"\",\"\",Backfill!H8)","v":""},{"$f":"IF($B8=\"\",\"\",IFERROR(INDEX('quantities report'!$D$2:$D$10003,SMALL(IF('quantities report'!$A$2:$A$10003=U$6,ROW('quantities report'!$A$2:$A$10003)-1,\"\"),ROWS($B$8:$B8))),\"0\"))","v":""},{"$f":"IF($B8=\"\",\"\",IFERROR(INDEX('quantities report'!$D$2:$D$10003,SMALL(IF('quantities report'!$A$2:$A$10003=V$6,ROW('quantities report'!$A$2:$A$10003)-1,\"\"),ROWS($B$8:$B8))),\"0\"))","v":""},{"$f":"IF($B8=\"\",\"\",IFERROR(INDEX('quantities report'!$D$2:$D$10003,SMALL(IF('quantities report'!$A$2:$A$10003=W$6,ROW('quantities report'!$A$2:$A$10003)-1,\"\"),ROWS($B$8:$B8))),\"0\"))","v":""},{"$f":"IF($B8=\"\",\"\",IFERROR(INDEX('quantities report'!$D$2:$D$10003,SMALL(IF('quantities report'!$A$2:$A$10003=X$6,ROW('quantities report'!$A$2:$A$10003)-1,\"\"),ROWS($B$8:$B8))),\"0\"))","v":""},{"$f":"IF($B8=\"\",\"\",Backfill!R8)","v":""},{"$f":"IF($B8=\"\",\"\",Backfill!U8)","v":""},{"$f":"IF($B8=\"\",\"\",Removals!$G5)","v":""},{"$f":"IF($B8=\"\",\"\",Removals!$L5)","v":""},{"$f":"IF($B8=\"\",\"\",IFERROR(INDEX('quantities report'!$D$2:$D$10003,SMALL(IF('quantities report'!$A$2:$A$10003=AC$6,ROW('quantities report'!$A$2:$A$10003)-1,\"\"),ROWS($B$8:$B8))),\"0\"))","v":""},{"$f":"IF($B8=\"\",\"\",IFERROR(INDEX('quantities report'!$D$2:$D$10003,SMALL(IF('quantities report'!$A$2:$A$10003=AD$6,ROW('quantities report'!$A$2:$A$10003)-1,\"\"),ROWS($B$8:$B8))),\"0\"))","v":""},{"$f":"IF($B8=\"\",\"\",IFERROR(INDEX('quantities report'!$D$2:$D$10003,SMALL(IF('quantities report'!$A$2:$A$10003=AE$6,ROW('quantities report'!$A$2:$A$10003)-1,\"\"),ROWS($B$8:$B8))),\"0\"))","v":""},{"$f":"IF($B8=\"\",\"\",IFERROR(INDEX('quantities report'!$D$2:$D$10003,SMALL(IF('quantities report'!$A$2:$A$10003=AF$6,ROW('quantities report'!$A$2:$A$10003)-1,\"\"),ROWS($B$8:$B8))),\"0\"))","v":""},{"$f":"IF($B8=\"\",\"\",IFERROR(INDEX('quantities report'!$D$2:$D$10003,SMALL(IF('quantities report'!$A$2:$A$10003=AG$6,ROW('quantities report'!$A$2:$A$10003)-1,\"\"),ROWS($B$8:$B8))),\"0\"))","v":""},{"$f":"IF($B8=\"\",\"\",IFERROR(INDEX('quantities report'!$D$2:$D$10003,SMALL(IF('quantities report'!$A$2:$A$10003=AH$6,ROW('quantities report'!$A$2:$A$10003)-1,\"\"),ROWS($B$8:$B8))),\"0\"))","v":""},{"$f":"IF(B8=\"\",\"\",$O8+$Q8+$S8+$T8+$U8+$V8+$W8+$X8+$Y8+$Z8+$AC8+$AD8+$AE8+$AF8+$AG8+$AH8)","v":""},{"$f":"IF(B8=\"\",\"\",$N8-$AI8)","v":""},{"$f":"IF(B8=\"\",\"\",$AJ8)","v":""},{"$f":"IF(B8=\"\",\"\",$O8+$Q8)","v":""},{"$f":"IF(B8=\"\",\"\",-$AJ8)","v":""},0.9,{"$f":"IF(B8=\"\",\"\",AM8/AN8)","v":""},{"$f":"IF(AJ8=\"\", \" \", ROUND($AJ8,0))","v":" "}]
[null,{"$f":"IFERROR(INDEX('manual inputs'!M:M,SMALL(IF('manual inputs'!M:M<>\"\",ROW('manual inputs'!M:M)),ROW(4:4))),\"\")","v":""},{"$f":"IF(B9=\"\",\"\",IFERROR(INDEX('quantities report'!$D$2:$D$10003,SMALL(IF('quantities report'!$A$2:$A$10003=C$6,ROW('quantities report'!$A$2:$A$10003)-1,\"\"),ROWS($B$8:$B9))),\"0\"))","v":""},{"$f":"IF(B9=\"\",\"\",$C9+$J9+$K9)","v":""},null,{"$f":"IF(B9=\"\",\"\",$D9+$E9)","v":""},{"$f":"IF($B9=\"\",\"\",Structure_Ex!I9)","v":""},null,{"$f":"IF($B9=\"\",\"\",IFERROR(INDEX('quantities report'!$D$2:$D$10003,SMALL(IF('quantities report'!$A$2:$A$10003=I$6,ROW('quantities report'!$A$2:$A$10003)-1,\"\"),ROWS($B$8:$B9))),\"0\"))","v":""},{"$f":"IF($B9=\"\",\"\",Removals!$F6)","v":""},{"$f":"IF($B9=\"\",\"\",Removals!$K6)","v":""},{"$f":"IF($B9=\"\",\"\",IFERROR(INDEX('quantities report'!$D$2:$D$10003,SMALL(IF('quantities report'!$A$2:$A$10003=L$6,ROW('quantities report'!$A$2:$A$10003)-1,\"\"),ROWS($B$8:$B9))),\"0\"))","v":""},{"$f":"IF(B9=\"\",\"\",LOOKUP(B9,'manual inputs'!$B$4:$B$22,'manual inputs'!$D$4:$D$22))","v":""},"",{"$f":"IF($B9=\"\",\"\",IFERROR(INDEX('quantities report'!$D$2:$D$10003,SMALL(IF('quantities report'!$A$2:$A$10003=O$6,ROW('quantities report'!$A$2:$A$10003)-1,\"\"),ROWS($B$8:$B9))),\"0\"))","v":""},"",null,{"$f":"IF(D9=\"\",\"\",$O9-$AA9-$AB9+$Q9)","v":""},{"$f":"IF($B9=\"\",\"\",IFERROR(INDEX('quantities report'!$D$2:$D$10003,SMALL(IF('quantities report'!$A$2:$A$10003=S$6,ROW('quantities report'!$A$2:$A$10003)-1,\"\"),ROWS($B$8:$B9))),\"0\"))","v":""},{"$f":"IF($B9=\"\",\"\",Backfill!H9)","v":""},{"$f":"IF($B9=\"\",\"\",IFERROR(INDEX('quantities report'!$D$2:$D$10003,SMALL(IF('quantities report'!$A$2:$A$10003=U$6,ROW('quantities report'!$A$2:$A$10003)-1,\"\"),ROWS($B$8:$B9))),\"0\"))","v":""},{"$f":"IF($B9=\"\",\"\",IFERROR(INDEX('quantities report'!$D$2:$D$10003,SMALL(IF('quantities report'!$A$2:$A$10003=V$6,ROW('quantities report'!$A$2:$A$10003)-1,\"\"),ROWS($B$8:$B9))),\"0\"))","v":""},{"$f":"IF($B9=\"\",\"\",IFERROR(INDEX('quantities report'!$D$2:$D$10003,SMALL(IF('quantities report'!$A$2:$A$10003=W$6,ROW('quantities report'!$A$2:$A$10003)-1,\"\"),ROWS($B$8:$B9))),\"0\"))","v":""},{"$f":"IF($B9=\"\",\"\",IFERROR(INDEX('quantities report'!$D$2:$D$10003,SMALL(IF('quantities report'!$A$2:$A$10003=X$6,ROW('quantities report'!$A$2:$A$10003)-1,\"\"),ROWS($B$8:$B9))),\"0\"))","v":""},{"$f":"IF($B9=\"\",\"\",Backfill!R9)","v":""},{"$f":"IF($B9=\"\",\"\",Backfill!U9)","v":""},{"$f":"IF($B9=\"\",\"\",Removals!$G6)","v":""},{"$f":"IF($B9=\"\",\"\",Removals!$L6)","v":""},{"$f":"IF($B9=\"\",\"\",IFERROR(INDEX('quantities report'!$D$2:$D$10003,SMALL(IF('quantities report'!$A$2:$A$10003=AC$6,ROW('quantities report'!$A$2:$A$10003)-1,\"\"),ROWS($B$8:$B9))),\"0\"))","v":""},{"$f":"IF($B9=\"\",\"\",IFERROR(INDEX('quantities report'!$D$2:$D$10003,SMALL(IF('quantities report'!$A$2:$A$10003=AD$6,ROW('quantities report'!$A$2:$A$10003)-1,\"\"),ROWS($B$8:$B9))),\"0\"))","v":""},{"$f":"IF($B9=\"\",\"\",IFERROR(INDEX('quantities report'!$D$2:$D$10003,SMALL(IF('quantities report'!$A$2:$A$10003=AE$6,ROW('quantities report'!$A$2:$A$10003)-1,\"\"),ROWS($B$8:$B9))),\"0\"))","v":""},{"$f":"IF($B9=\"\",\"\",IFERROR(INDEX('quantities report'!$D$2:$D$10003,SMALL(IF('quantities report'!$A$2:$A$10003=AF$6,ROW('quantities report'!$A$2:$A$10003)-1,\"\"),ROWS($B$8:$B9))),\"0\"))","v":""},{"$f":"IF($B9=\"\",\"\",IFERROR(INDEX('quantities report'!$D$2:$D$10003,SMALL(IF('quantities report'!$A$2:$A$10003=AG$6,ROW('quantities report'!$A$2:$A$10003)-1,\"\"),ROWS($B$8:$B9))),\"0\"))","v":""},{"$f":"IF($B9=\"\",\"\",IFERROR(INDEX('quantities report'!$D$2:$D$10003,SMALL(IF('quantities report'!$A$2:$A$10003=AH$6,ROW('quantities report'!$A$2:$A$10003)-1,\"\"),ROWS($B$8:$B9))),\"0\"))","v":""},"","","","","",0.9,"",{"$f":"IF(AJ9=\"\", \" \", ROUND($AJ9+AP8,0))","v":" "}]
[null,{"$f":"IFERROR(INDEX('manual inputs'!M:M,SMALL(IF('manual inputs'!M:M<>\"\",ROW('manual inputs'!M:M)),ROW(5:5))),\"\")","v":""},{"$f":"IF(B10=\"\",\"\",IFERROR(INDEX('quantities report'!$D$2:$D$10003,SMALL(IF('quantities report'!$A$2:$A$10003=C$6,ROW('quantities report'!$A$2:$A$10003)-1,\"\"),ROWS($B$8:$B10))),\"0\"))","v":""},"",null,"",{"$f":"IF($B10=\"\",\"\",Structure_Ex!I10)","v":""},null,{"$f":"IF($B10=\"\",\"\",IFERROR(INDEX('quantities report'!$D$2:$D$10003,SMALL(IF('quantities report'!$A$2:$A$10003=I$6,ROW('quantities report'!$A$2:$A$10003)-1,\"\"),ROWS($B$8:$B10))),\"0\"))","v":""},{"$f":"IF($B10=\"\",\"\",Removals!$F7)","v":""},{"$f":"IF($B10=\"\",\"\",Removals!$K7)","v":""},{"$f":"IF($B10=\"\",\"\",IFERROR(INDEX('quantities report'!$D$2:$D$10003,SMALL(IF('quantities report'!$A$2:$A$10003=L$6,ROW('quantities report'!$A$2:$A$10003)-1,\"\"),ROWS($B$8:$B10))),\"0\"))","v":""},{"$f":"IF(B10=\"\",\"\",LOOKUP(B10,'manual inputs'!$B$4:$B$22,'manual inputs'!$D$4:$D$22))","v":""},"",{"$f":"IF($B10=\"\",\"\",IFERROR(INDEX('quantities report'!$D$2:$D$10003,SMALL(IF('quantities report'!$A$2:$A$10003=O$6,ROW('quantities report'!$A$2:$A$10003)-1,\"\"),ROWS($B$8:$B10))),\"0\"))","v":""},"",null,"",{"$f":"IF($B10=\"\",\"\",IFERROR(INDEX('quantities report'!$D$2:$D$10003,SMALL(IF('quantities report'!$A$2:$A$10003=S$6,ROW('quantities report'!$A$2:$A$10003)-1,\"\"),ROWS($B$8:$B10))),\"0\"))","v":""},{"$f":"IF($B10=\"\",\"\",Backfill!H10)","v":""},{"$f":"IF($B10=\"\",\"\",IFERROR(INDEX('quantities report'!$D$2:$D$10003,SMALL(IF('quantities report'!$A$2:$A$10003=U$6,ROW('quantities report'!$A$2:$A$10003)-1,\"\"),ROWS($B$8:$B10))),\"0\"))","v":""},{"$f":"IF($B10=\"\",\"\",IFERROR(INDEX('quantities report'!$D$2:$D$10003,SMALL(IF('quantities report'!$A$2:$A$10003=V$6,ROW('quantities report'!$A$2:$A$10003)-1,\"\"),ROWS($B$8:$B10))),\"0\"))","v":""},{"$f":"IF($B10=\"\",\"\",IFERROR(INDEX('quantities report'!$D$2:$D$10003,SMALL(IF('quantities report'!$A$2:$A$10003=W$6,ROW('quantities report'!$A$2:$A$10003)-1,\"\"),ROWS($B$8:$B10))),\"0\"))","v":""},{"$f":"IF($B10=\"\",\"\",IFERROR(INDEX('quantities report'!$D$2:$D$10003,SMALL(IF('quantities report'!$A$2:$A$10003=X$6,ROW('quantities report'!$A$2:$A$10003)-1,\"\"),ROWS($B$8:$B10))),\"0\"))","v":""},{"$f":"IF($B10=\"\",\"\",Backfill!R10)","v":""},{"$f":"IF($B10=\"\",\"\",Backfill!U10)","v":""},{"$f":"IF($B10=\"\",\"\",Removals!$G7)","v":""},{"$f":"IF($B10=\"\",\"\",Removals!$L7)","v":""},{"$f":"IF($B10=\"\",\"\",IFERROR(INDEX('quantities report'!$D$2:$D$10003,SMALL(IF('quantities report'!$A$2:$A$10003=AC$6,ROW('quantities report'!$A$2:$A$10003)-1,\"\"),ROWS($B$8:$B10))),\"0\"))","v":""},{"$f":"IF($B10=\"\",\"\",IFERROR(INDEX('quantities report'!$D$2:$D$10003,SMALL(IF('quantities report'!$A$2:$A$10003=AD$6,ROW('quantities report'!$A$2:$A$10003)-1,\"\"),ROWS($B$8:$B10))),\"0\"))","v":""},{"$f":"IF($B10=\"\",\"\",IFERROR(INDEX('quantities report'!$D$2:$D$10003,SMALL(IF('quantities report'!$A$2:$A$10003=AE$6,ROW('quantities report'!$A$2:$A$10003)-1,\"\"),ROWS($B$8:$B10))),\"0\"))","v":""},{"$f":"IF($B10=\"\",\"\",IFERROR(INDEX('quantities report'!$D$2:$D$10003,SMALL(IF('quantities report'!$A$2:$A$10003=AF$6,ROW('quantities report'!$A$2:$A$10003)-1,\"\"),ROWS($B$8:$B10))),\"0\"))","v":""},{"$f":"IF($B10=\"\",\"\",IFERROR(INDEX('quantities report'!$D$2:$D$10003,SMALL(IF('quantities report'!$A$2:$A$10003=AG$6,ROW('quantities report'!$A$2:$A$10003)-1,\"\"),ROWS($B$8:$B10))),\"0\"))","v":""},{"$f":"IF($B10=\"\",\"\",IFERROR(INDEX('quantities report'!$D$2:$D$10003,SMALL(IF('quantities report'!$A$2:$A$10003=AH$6,ROW('quantities report'!$A$2:$A$10003)-1,\"\"),ROWS($B$8:$B10))),\"0\"))","v":""},"","","","","",0.9,"",{"$f":"IF(AJ10=\"\", \" \", ROUND($AJ10+AP9,0))","v":" "}]
[null,{"$f":"IFERROR(INDEX('manual inputs'!M:M,SMALL(IF('manual inputs'!M:M<>\"\",ROW('manual inputs'!M:M)),ROW(6:6))),\"\")","v":""},{"$f":"IF(B11=\"\",\"\",IFERROR(INDEX('quantities report'!$D$2:$D$10003,SMALL(IF('quantities report'!$A$2:$A$10003=C$6,ROW('quantities report'!$A$2:$A$10003)-1,\"\"),ROWS($B$8:$B11))),\"0\"))","v":""},"",null,"",{"$f":"IF($B11=\"\",\"\",Structure_Ex!I11)","v":""},null,{"$f":"IF($B11=\"\",\"\",IFERROR(INDEX('quantities report'!$D$2:$D$10003,SMALL(IF('quantities report'!$A$2:$A$10003=I$6,ROW('quantities report'!$A$2:$A$10003)-1,\"\"),ROWS($B$8:$B11))),\"0\"))","v":""},{"$f":"IF($B11=\"\",\"\",Removals!$F8)","v":""},{"$f":"IF($B11=\"\",\"\",Removals!$K8)","v":""},{"$f":"IF($B11=\"\",\"\",IFERROR(INDEX('quantities report'!$D$2:$D$10003,SMALL(IF('quantities report'!$A$2:$A$10003=L$6,ROW('quantities report'!$A$2:$A$10003)-1,\"\"),ROWS($B$8:$B11))),\"0\"))","v":""},{"$f":"IF(B11=\"\",\"\",LOOKUP(B11,'manual inputs'!$B$4:$B$22,'manual inputs'!$D$4:$D$22))","v":""},"",{"$f":"IF($B11=\"\",\"\",IFERROR(INDEX('quantities report'!$D$2:$D$10003,SMALL(IF('quantities report'!$A$2:$A$10003=O$6,ROW('quantities report'!$A$2:$A$10003)-1,\"\"),ROWS($B$8:$B11))),\"0\"))","v":""},"",null,"",{"$f":"IF($B11=\"\",\"\",IFERROR(INDEX('quantities report'!$D$2:$D$10003,SMALL(IF('quantities report'!$A$2:$A$10003=S$6,ROW('quantities report'!$A$2:$A$10003)-1,\"\"),ROWS($B$8:$B11))),\"0\"))","v":""},{"$f":"IF($B11=\"\",\"\",Backfill!H11)","v":""},{"$f":"IF($B11=\"\",\"\",IFERROR(INDEX('quantities report'!$D$2:$D$10003,SMALL(IF('quantities report'!$A$2:$A$10003=U$6,ROW('quantities report'!$A$2:$A$10003)-1,\"\"),ROWS($B$8:$B11))),\"0\"))","v":""},{"$f":"IF($B11=\"\",\"\",IFERROR(INDEX('quantities report'!$D$2:$D$10003,SMALL(IF('quantities report'!$A$2:$A$10003=V$6,ROW('quantities report'!$A$2:$A$10003)-1,\"\"),ROWS($B$8:$B11))),\"0\"))","v":""},{"$f":"IF($B11=\"\",\"\",IFERROR(INDEX('quantities report'!$D$2:$D$10003,SMALL(IF('quantities report'!$A$2:$A$10003=W$6,ROW('quantities report'!$A$2:$A$10003)-1,\"\"),ROWS($B$8:$B11))),\"0\"))","v":""},{"$f":"IF($B11=\"\",\"\",IFERROR(INDEX('quantities report'!$D$2:$D$10003,SMALL(IF('quantities report'!$A$2:$A$10003=X$6,ROW('quantities report'!$A$2:$A$10003)-1,\"\"),ROWS($B$8:$B11))),\"0\"))","v":""},{"$f":"IF($B11=\"\",\"\",Backfill!R11)","v":""},{"$f":"IF($B11=\"\",\"\",Backfill!U11)","v":""},{"$f":"IF($B11=\"\",\"\",Removals!$G8)","v":""},{"$f":"IF($B11=\"\",\"\",Removals!$L8)","v":""},{"$f":"IF($B11=\"\",\"\",IFERROR(INDEX('quantities report'!$D$2:$D$10003,SMALL(IF('quantities report'!$A$2:$A$10003=AC$6,ROW('quantities report'!$A$2:$A$10003)-1,\"\"),ROWS($B$8:$B11))),\"0\"))","v":""},{"$f":"IF($B11=\"\",\"\",IFERROR(INDEX('quantities report'!$D$2:$D$10003,SMALL(IF('quantities report'!$A$2:$A$10003=AD$6,ROW('quantities report'!$A$2:$A$10003)-1,\"\"),ROWS($B$8:$B11))),\"0\"))","v":""},{"$f":"IF($B11=\"\",\"\",IFERROR(INDEX('quantities report'!$D$2:$D$10003,SMALL(IF('quantities report'!$A$2:$A$10003=AE$6,ROW('quantities report'!$A$2:$A$10003)-1,\"\"),ROWS($B$8:$B11))),\"0\"))","v":""},{"$f":"IF($B11=\"\",\"\",IFERROR(INDEX('quantities report'!$D$2:$D$10003,SMALL(IF('quantities report'!$A$2:$A$10003=AF$6,ROW('quantities report'!$A$2:$A$10003)-1,\"\"),ROWS($B$8:$B11))),\"0\"))","v":""},{"$f":"IF($B11=\"\",\"\",IFERROR(INDEX('quantities report'!$D$2:$D$10003,SMALL(IF('quantities report'!$A$2:$A$10003=AG$6,ROW('quantities report'!$A$2:$A$10003)-1,\"\"),ROWS($B$8:$B11))),\"0\"))","v":""},{"$f":"IF($B11=\"\",\"\",IFERROR(INDEX('quantities report'!$D$2:$D$10003,SMALL(IF('quantities report'!$A$2:$A$10003=AH$6,ROW('quantities report'!$A$2:$A$10003)-1,\"\"),ROWS($B$8:$B11))),\"0\"))","v":""},"","","","","",0.9,""," "]
[null,{"$f":"IFERROR(INDEX('manual inputs'!M:M,SMALL(IF('manual inputs'!M:M<>\"\",ROW('manual inputs'!M:M)),ROW(7:7))),\"\")","v":""},{"$f":"IF(B12=\"\",\"\",IFERROR(INDEX('quantities report'!$D$2:$D$10003,SMALL(IF('quantities report'!$A$2:$A$10003=C$6,ROW('quantities report'!$A$2:$A$10003)-1,\"\"),ROWS($B$8:$B12))),\"0\"))","v":""},"",null,"",{"$f":"IF($B12=\"\",\"\",Structure_Ex!I12)","v":""},null,{"$f":"IF($B12=\"\",\"\",IFERROR(INDEX('quantities report'!$D$2:$D$10003,SMALL(IF('quantities report'!$A$2:$A$10003=I$6,ROW('quantities report'!$A$2:$A$10003)-1,\"\"),ROWS($B$8:$B12))),\"0\"))","v":""},{"$f":"IF($B12=\"\",\"\",Removals!$F9)","v":""},{"$f":"IF($B12=\"\",\"\",Removals!$K9)","v":""},{"$f":"IF($B12=\"\",\"\",IFERROR(INDEX('quantities report'!$D$2:$D$10003,SMALL(IF('quantities report'!$A$2:$A$10003=L$6,ROW('quantities report'!$A$2:$A$10003)-1,\"\"),ROWS($B$8:$B12))),\"0\"))","v":""},{"$f":"IF(B12=\"\",\"\",LOOKUP(B12,'manual inputs'!$B$4:$B$22,'manual inputs'!$D$4:$D$22))","v":""},"",{"$f":"IF($B12=\"\",\"\",IFERROR(INDEX('quantities report'!$D$2:$D$10003,SMALL(IF('quantities report'!$A$2:$A$10003=O$6,ROW('quantities report'!$A$2:$A$10003)-1,\"\"),ROWS($B$8:$B12))),\"0\"))","v":""},"",null,"",{"$f":"IF($B12=\"\",\"\",IFERROR(INDEX('quantities report'!$D$2:$D$10003,SMALL(IF('quantities report'!$A$2:$A$10003=S$6,ROW('quantities report'!$A$2:$A$10003)-1,\"\"),ROWS($B$8:$B12))),\"0\"))","v":""},{"$f":"IF($B12=\"\",\"\",Backfill!H12)","v":""},{"$f":"IF($B12=\"\",\"\",IFERROR(INDEX('quantities report'!$D$2:$D$10003,SMALL(IF('quantities report'!$A$2:$A$10003=U$6,ROW('quantities report'!$A$2:$A$10003)-1,\"\"),ROWS($B$8:$B12))),\"0\"))","v":""},{"$f":"IF($B12=\"\",\"\",IFERROR(INDEX('quantities report'!$D$2:$D$10003,SMALL(IF('quantities report'!$A$2:$A$10003=V$6,ROW('quantities report'!$A$2:$A$10003)-1,\"\"),ROWS($B$8:$B12))),\"0\"))","v":""},{"$f":"IF($B12=\"\",\"\",IFERROR(INDEX('quantities report'!$D$2:$D$10003,SMALL(IF('quantities report'!$A$2:$A$10003=W$6,ROW('quantities report'!$A$2:$A$10003)-1,\"\"),ROWS($B$8:$B12))),\"0\"))","v":""},{"$f":"IF($B12=\"\",\"\",IFERROR(INDEX('quantities report'!$D$2:$D$10003,SMALL(IF('quantities report'!$A$2:$A$10003=X$6,ROW('quantities report'!$A$2:$A$10003)-1,\"\"),ROWS($B$8:$B12))),\"0\"))","v":""},{"$f":"IF($B12=\"\",\"\",Backfill!R12)","v":""},{"$f":"IF($B12=\"\",\"\",Backfill!U12)","v":""},{"$f":"IF($B12=\"\",\"\",Removals!$G9)","v":""},{"$f":"IF($B12=\"\",\"\",Removals!$L9)","v":""},{"$f":"IF($B12=\"\",\"\",IFERROR(INDEX('quantities report'!$D$2:$D$10003,SMALL(IF('quantities report'!$A$2:$A$10003=AC$6,ROW('quantities report'!$A$2:$A$10003)-1,\"\"),ROWS($B$8:$B12))),\"0\"))","v":""},{"$f":"IF($B12=\"\",\"\",IFERROR(INDEX('quantities report'!$D$2:$D$10003,SMALL(IF('quantities report'!$A$2:$A$10003=AD$6,ROW('quantities report'!$A$2:$A$10003)-1,\"\"),ROWS($B$8:$B12))),\"0\"))","v":""},{"$f":"IF($B12=\"\",\"\",IFERROR(INDEX('quantities report'!$D$2:$D$10003,SMALL(IF('quantities report'!$A$2:$A$10003=AE$6,ROW('quantities report'!$A$2:$A$10003)-1,\"\"),ROWS($B$8:$B12))),\"0\"))","v":""},{"$f":"IF($B12=\"\",\"\",IFERROR(INDEX('quantities report'!$D$2:$D$10003,SMALL(IF('quantities report'!$A$2:$A$10003=AF$6,ROW('quantities report'!$A$2:$A$10003)-1,\"\"),ROWS($B$8:$B12))),\"0\"))","v":""},{"$f":"IF($B12=\"\",\"\",IFERROR(INDEX('quantities report'!$D$2:$D$10003,SMALL(IF('quantities report'!$A$2:$A$10003=AG$6,ROW('quantities report'!$A$2:$A$10003)-1,\"\"),ROWS($B$8:$B12))),\"0\"))","v":""},{"$f":"IF($B12=\"\",\"\",IFERROR(INDEX('quantities report'!$D$2:$D$10003,SMALL(IF('quantities report'!$A$2:$A$10003=AH$6,ROW('quantities report'!$A$2:$A$10003)-1,\"\"),ROWS($B$8:$B12))),\"0\"))","v":""},"","","","","",0.9,""," "]
[null,{"$f":"IFERROR(INDEX('manual inputs'!M:M,SMALL(IF('manual inputs'!M:M<>\"\",ROW('manual inputs'!M:M)),ROW(8:8))),\"\")","v":""},{"$f":"IF(B13=\"\",\"\",IFERROR(INDEX('quantities report'!$D$2:$D$10003,SMALL(IF('quantities report'!$A$2:$A$10003=C$6,ROW('quantities report'!$A$2:$A$10003)-1,\"\"),ROWS($B$8:$B13))),\"0\"))","v":""},"",null,"",{"$f":"IF($B13=\"\",\"\",Structure_Ex!I13)","v":""},null,{"$f":"IF($B13=\"\",\"\",IFERROR(INDEX('quantities report'!$D$2:$D$10003,SMALL(IF('quantities report'!$A$2:$A$10003=I$6,ROW('quantities report'!$A$2:$A$10003)-1,\"\"),ROWS($B$8:$B13))),\"0\"))","v":""},{"$f":"IF($B13=\"\",\"\",Removals!$F10)","v":""},{"$f":"IF($B13=\"\",\"\",Removals!$K10)","v":""},{"$f":"IF($B13=\"\",\"\",IFERROR(INDEX('quantities report'!$D$2:$D$10003,SMALL(IF('quantities report'!$A$2:$A$10003=L$6,ROW('quantities report'!$A$2:$A$10003)-1,\"\"),ROWS($B$8:$B13))),\"0\"))","v":""},{"$f":"IF(B13=\"\",\"\",LOOKUP(B13,'manual inputs'!$B$4:$B$22,'manual inputs'!$D$4:$D$22))","v":""},"",{"$f":"IF($B13=\"\",\"\",IFERROR(INDEX('quantities report'!$D$2:$D$10003,SMALL(IF('quantities report'!$A$2:$A$10003=O$6,ROW('quantities report'!$A$2:$A$10003)-1,\"\"),ROWS($B$8:$B13))),\"0\"))","v":""},"",null,"",{"$f":"IF($B13=\"\",\"\",IFERROR(INDEX('quantities report'!$D$2:$D$10003,SMALL(IF('quantities report'!$A$2:$A$10003=S$6,ROW('quantities report'!$A$2:$A$10003)-1,\"\"),ROWS($B$8:$B13))),\"0\"))","v":""},{"$f":"IF($B13=\"\",\"\",Backfill!H13)","v":""},{"$f":"IF($B13=\"\",\"\",IFERROR(INDEX('quantities report'!$D$2:$D$10003,SMALL(IF('quantities report'!$A$2:$A$10003=U$6,ROW('quantities report'!$A$2:$A$10003)-1,\"\"),ROWS($B$8:$B13))),\"0\"))","v":""},{"$f":"IF($B13=\"\",\"\",IFERROR(INDEX('quantities report'!$D$2:$D$10003,SMALL(IF('quantities report'!$A$2:$A$10003=V$6,ROW('quantities report'!$A$2:$A$10003)-1,\"\"),ROWS($B$8:$B13))),\"0\"))","v":""},{"$f":"IF($B13=\"\",\"\",IFERROR(INDEX('quantities report'!$D$2:$D$10003,SMALL(IF('quantities report'!$A$2:$A$10003=W$6,ROW('quantities report'!$A$2:$A$10003)-1,\"\"),ROWS($B$8:$B13))),\"0\"))","v":""},{"$f":"IF($B13=\"\",\"\",IFERROR(INDEX('quantities report'!$D$2:$D$10003,SMALL(IF('quantities report'!$A$2:$A$10003=X$6,ROW('quantities report'!$A$2:$A$10003)-1,\"\"),ROWS($B$8:$B13))),\"0\"))","v":""},{"$f":"IF($B13=\"\",\"\",Backfill!R13)","v":""},{"$f":"IF($B13=\"\",\"\",Backfill!U13)","v":""},{"$f":"IF($B13=\"\",\"\",Removals!$G10)","v":""},{"$f":"IF($B13=\"\",\"\",Removals!$L10)","v":""},{"$f":"IF($B13=\"\",\"\",IFERROR(INDEX('quantities report'!$D$2:$D$10003,SMALL(IF('quantities report'!$A$2:$A$10003=AC$6,ROW('quantities report'!$A$2:$A$10003)-1,\"\"),ROWS($B$8:$B13))),\"0\"))","v":""},{"$f":"IF($B13=\"\",\"\",IFERROR(INDEX('quantities report'!$D$2:$D$10003,SMALL(IF('quantities report'!$A$2:$A$10003=AD$6,ROW('quantities report'!$A$2:$A$10003)-1,\"\"),ROWS($B$8:$B13))),\"0\"))","v":""},{"$f":"IF($B13=\"\",\"\",IFERROR(INDEX('quantities report'!$D$2:$D$10003,SMALL(IF('quantities report'!$A$2:$A$10003=AE$6,ROW('quantities report'!$A$2:$A$10003)-1,\"\"),ROWS($B$8:$B13))),\"0\"))","v":""},{"$f":"IF($B13=\"\",\"\",IFERROR(INDEX('quantities report'!$D$2:$D$10003,SMALL(IF('quantities report'!$A$2:$A$10003=AF$6,ROW('quantities report'!$A$2:$A$10003)-1,\"\"),ROWS($B$8:$B13))),\"0\"))","v":""},{"$f":"IF($B13=\"\",\"\",IFERROR(INDEX('quantities report'!$D$2:$D$10003,SMALL(IF('quantities report'!$A$2:$A$10003=AG$6,ROW('quantities report'!$A$2:$A$10003)-1,\"\"),ROWS($B$8:$B13))),\"0\"))","v":""},{"$f":"IF($B13=\"\",\"\",IFERROR(INDEX('quantities report'!$D$2:$D$10003,SMALL(IF('quantities report'!$A$2:$A$10003=AH$6,ROW('quantities report'!$A$2:$A$10003)-1,\"\"),ROWS($B$8:$B13))),\"0\"))","v":""},"","","","","",0.9,""," "]
[null,{"$f":"IFERROR(INDEX('manual inputs'!M:M,SMALL(IF('manual inputs'!M:M<>\"\",ROW('manual inputs'!M:M)),ROW(9:9))),\"\")","v":""},{"$f":"IF(B14=\"\",\"\",IFERROR(INDEX('quantities report'!$D$2:$D$10003,SMALL(IF('quantities report'!$A$2:$A$10003=C$6,ROW('quantities report'!$A$2:$A$10003)-1,\"\"),ROWS($B$8:$B14))),\"0\"))","v":""},"",null,"",{"$f":"IF($B14=\"\",\"\",Structure_Ex!I14)","v":""},null,{"$f":"IF($B14=\"\",\"\",IFERROR(INDEX('quantities report'!$D$2:$D$10003,SMALL(IF('quantities report'!$A$2:$A$10003=I$6,ROW('quantities report'!$A$2:$A$10003)-1,\"\"),ROWS($B$8:$B14))),\"0\"))","v":""},{"$f":"IF($B14=\"\",\"\",Removals!$F11)","v":""},{"$f":"IF($B14=\"\",\"\",Removals!$K11)","v":""},{"$f":"IF($B14=\"\",\"\",IFERROR(INDEX('quantities report'!$D$2:$D$10003,SMALL(IF('quantities report'!$A$2:$A$10003=L$6,ROW('quantities report'!$A$2:$A$10003)-1,\"\"),ROWS($B$8:$B14))),\"0\"))","v":""},{"$f":"IF(B14=\"\",\"\",LOOKUP(B14,'manual inputs'!$B$4:$B$22,'manual inputs'!$D$4:$D$22))","v":""},"",{"$f":"IF($B14=\"\",\"\",IFERROR(INDEX('quantities report'!$D$2:$D$10003,SMALL(IF('quantities report'!$A$2:$A$10003=O$6,ROW('quantities report'!$A$2:$A$10003)-1,\"\"),ROWS($B$8:$B14))),\"0\"))","v":""},"",null,"",{"$f":"IF($B14=\"\",\"\",IFERROR(INDEX('quantities report'!$D$2:$D$10003,SMALL(IF('quantities report'!$A$2:$A$10003=S$6,ROW('quantities report'!$A$2:$A$10003)-1,\"\"),ROWS($B$8:$B14))),\"0\"))","v":""},{"$f":"IF($B14=\"\",\"\",Backfill!H14)","v":""},{"$f":"IF($B14=\"\",\"\",IFERROR(INDEX('quantities report'!$D$2:$D$10003,SMALL(IF('quantities report'!$A$2:$A$10003=U$6,ROW('quantities report'!$A$2:$A$10003)-1,\"\"),ROWS($B$8:$B14))),\"0\"))","v":""},{"$f":"IF($B14=\"\",\"\",IFERROR(INDEX('quantities report'!$D$2:$D$10003,SMALL(IF('quantities report'!$A$2:$A$10003=V$6,ROW('quantities report'!$A$2:$A$10003)-1,\"\"),ROWS($B$8:$B14))),\"0\"))","v":""},{"$f":"IF($B14=\"\",\"\",IFERROR(INDEX('quantities report'!$D$2:$D$10003,SMALL(IF('quantities report'!$A$2:$A$10003=W$6,ROW('quantities report'!$A$2:$A$10003)-1,\"\"),ROWS($B$8:$B14))),\"0\"))","v":""},{"$f":"IF($B14=\"\",\"\",IFERROR(INDEX('quantities report'!$D$2:$D$10003,SMALL(IF('quantities report'!$A$2:$A$10003=X$6,ROW('quantities report'!$A$2:$A$10003)-1,\"\"),ROWS($B$8:$B14))),\"0\"))","v":""},{"$f":"IF($B14=\"\",\"\",Backfill!R14)","v":""},{"$f":"IF($B14=\"\",\"\",Backfill!U14)","v":""},{"$f":"IF($B14=\"\",\"\",Removals!$G11)","v":""},{"$f":"IF($B14=\"\",\"\",Removals!$L11)","v":""},{"$f":"IF($B14=\"\",\"\",IFERROR(INDEX('quantities report'!$D$2:$D$10003,SMALL(IF('quantities report'!$A$2:$A$10003=AC$6,ROW('quantities report'!$A$2:$A$10003)-1,\"\"),ROWS($B$8:$B14))),\"0\"))","v":""},{"$f":"IF($B14=\"\",\"\",IFERROR(INDEX('quantities report'!$D$2:$D$10003,SMALL(IF('quantities report'!$A$2:$A$10003=AD$6,ROW('quantities report'!$A$2:$A$10003)-1,\"\"),ROWS($B$8:$B14))),\"0\"))","v":""},{"$f":"IF($B14=\"\",\"\",IFERROR(INDEX('quantities report'!$D$2:$D$10003,SMALL(IF('quantities report'!$A$2:$A$10003=AE$6,ROW('quantities report'!$A$2:$A$10003)-1,\"\"),ROWS($B$8:$B14))),\"0\"))","v":""},{"$f":"IF($B14=\"\",\"\",IFERROR(INDEX('quantities report'!$D$2:$D$10003,SMALL(IF('quantities report'!$A$2:$A$10003=AF$6,ROW('quantities report'!$A$2:$A$10003)-1,\"\"),ROWS($B$8:$B14))),\"0\"))","v":""},{"$f":"IF($B14=\"\",\"\",IFERROR(INDEX('quantities report'!$D$2:$D$10003,SMALL(IF('quantities report'!$A$2:$A$10003=AG$6,ROW('quantities report'!$A$2:$A$10003)-1,\"\"),ROWS($B$8:$B14))),\"0\"))","v":""},{"$f":"IF($B14=\"\",\"\",IFERROR(INDEX('quantities report'!$D$2:$D$10003,SMALL(IF('quantities report'!$A$2:$A$10003=AH$6,ROW('quantities report'!$A$2:$A$10003)-1,\"\"),ROWS($B$8:$B14))),\"0\"))","v":""},"","","","","",0.9,""," "]
[null,{"$f":"IFERROR(INDEX('manual inputs'!M:M,SMALL(IF('manual inputs'!M:M<>\"\",ROW('manual inputs'!M:M)),ROW(10:10))),\"\")","v":""},{"$f":"IF(B15=\"\",\"\",IFERROR(INDEX('quantities report'!$D$2:$D$10003,SMALL(IF('quantities report'!$A$2:$A$10003=C$6,ROW('quantities report'!$A$2:$A$10003)-1,\"\"),ROWS($B$8:$B15))),\"0\"))","v":""},"",null,"",{"$f":"IF($B15=\"\",\"\",Structure_Ex!I15)","v":""},null,{"$f":"IF($B15=\"\",\"\",IFERROR(INDEX('quantities report'!$D$2:$D$10003,SMALL(IF('quantities report'!$A$2:$A$10003=I$6,ROW('quantities report'!$A$2:$A$10003)-1,\"\"),ROWS($B$8:$B15))),\"0\"))","v":""},{"$f":"IF($B15=\"\",\"\",Removals!$F12)","v":""},{"$f":"IF($B15=\"\",\"\",Removals!$K12)","v":""},{"$f":"IF($B15=\"\",\"\",IFERROR(INDEX('quantities report'!$D$2:$D$10003,SMALL(IF('quantities report'!$A$2:$A$10003=L$6,ROW('quantities report'!$A$2:$A$10003)-1,\"\"),ROWS($B$8:$B15))),\"0\"))","v":""},{"$f":"IF(B15=\"\",\"\",LOOKUP(B15,'manual inputs'!$B$4:$B$22,'manual inputs'!$D$4:$D$22))","v":""},"",{"$f":"IF($B15=\"\",\"\",IFERROR(INDEX('quantities report'!$D$2:$D$10003,SMALL(IF('quantities report'!$A$2:$A$10003=O$6,ROW('quantities report'!$A$2:$A$10003)-1,\"\"),ROWS($B$8:$B15))),\"0\"))","v":""},"",null,"",{"$f":"IF($B15=\"\",\"\",IFERROR(INDEX('quantities report'!$D$2:$D$10003,SMALL(IF('quantities report'!$A$2:$A$10003=S$6,ROW('quantities report'!$A$2:$A$10003)-1,\"\"),ROWS($B$8:$B15))),\"0\"))","v":""},{"$f":"IF($B15=\"\",\"\",Backfill!H15)","v":""},{"$f":"IF($B15=\"\",\"\",IFERROR(INDEX('quantities report'!$D$2:$D$10003,SMALL(IF('quantities report'!$A$2:$A$10003=U$6,ROW('quantities report'!$A$2:$A$10003)-1,\"\"),ROWS($B$8:$B15))),\"0\"))","v":""},{"$f":"IF($B15=\"\",\"\",IFERROR(INDEX('quantities report'!$D$2:$D$10003,SMALL(IF('quantities report'!$A$2:$A$10003=V$6,ROW('quantities report'!$A$2:$A$10003)-1,\"\"),ROWS($B$8:$B15))),\"0\"))","v":""},{"$f":"IF($B15=\"\",\"\",IFERROR(INDEX('quantities report'!$D$2:$D$10003,SMALL(IF('quantities report'!$A$2:$A$10003=W$6,ROW('quantities report'!$A$2:$A$10003)-1,\"\"),ROWS($B$8:$B15))),\"0\"))","v":""},{"$f":"IF($B15=\"\",\"\",IFERROR(INDEX('quantities report'!$D$2:$D$10003,SMALL(IF('quantities report'!$A$2:$A$10003=X$6,ROW('quantities report'!$A$2:$A$10003)-1,\"\"),ROWS($B$8:$B15))),\"0\"))","v":""},{"$f":"IF($B15=\"\",\"\",Backfill!R15)","v":""},{"$f":"IF($B15=\"\",\"\",Backfill!U15)","v":""},{"$f":"IF($B15=\"\",\"\",Removals!$G12)","v":""},{"$f":"IF($B15=\"\",\"\",Removals!$L12)","v":""},{"$f":"IF($B15=\"\",\"\",IFERROR(INDEX('quantities report'!$D$2:$D$10003,SMALL(IF('quantities report'!$A$2:$A$10003=AC$6,ROW('quantities report'!$A$2:$A$10003)-1,\"\"),ROWS($B$8:$B15))),\"0\"))","v":""},{"$f":"IF($B15=\"\",\"\",IFERROR(INDEX('quantities report'!$D$2:$D$10003,SMALL(IF('quantities report'!$A$2:$A$10003=AD$6,ROW('quantities report'!$A$2:$A$10003)-1,\"\"),ROWS($B$8:$B15))),\"0\"))","v":""},{"$f":"IF($B15=\"\",\"\",IFERROR(INDEX('quantities report'!$D$2:$D$10003,SMALL(IF('quantities report'!$A$2:$A$10003=AE$6,ROW('quantities report'!$A$2:$A$10003)-1,\"\"),ROWS($B$8:$B15))),\"0\"))","v":""},{"$f":"IF($B15=\"\",\"\",IFERROR(INDEX('quantities report'!$D$2:$D$10003,SMALL(IF('quantities report'!$A$2:$A$10003=AF$6,ROW('quantities report'!$A$2:$A$10003)-1,\"\"),ROWS($B$8:$B15))),\"0\"))","v":""},{"$f":"IF($B15=\"\",\"\",IFERROR(INDEX('quantities report'!$D$2:$D$10003,SMALL(IF('quantities report'!$A$2:$A$10003=AG$6,ROW('quantities report'!$A$2:$A$10003)-1,\"\"),ROWS($B$8:$B15))),\"0\"))","v":""},{"$f":"IF($B15=\"\",\"\",IFERROR(INDEX('quantities report'!$D$2:$D$10003,SMALL(IF('quantities report'!$A$2:$A$10003=AH$6,ROW('quantities report'!$A$2:$A$10003)-1,\"\"),ROWS($B$8:$B15))),\"0\"))","v":""},"","","","","",0.9,""," "]
[null,{"$f":"IFERROR(INDEX('manual inputs'!M:M,SMALL(IF('manual inputs'!M:M<>\"\",ROW('manual inputs'!M:M)),ROW(11:11))),\"\")","v":""},{"$f":"IF(B16=\"\",\"\",IFERROR(INDEX('quantities report'!$D$2:$D$10003,SMALL(IF('quantities report'!$A$2:$A$10003=C$6,ROW('quantities report'!$A$2:$A$10003)-1,\"\"),ROWS($B$8:$B16))),\"0\"))","v":""},"",null,"",{"$f":"IF($B16=\"\",\"\",Structure_Ex!I16)","v":""},null,{"$f":"IF($B16=\"\",\"\",IFERROR(INDEX('quantities report'!$D$2:$D$10003,SMALL(IF('quantities report'!$A$2:$A$10003=I$6,ROW('quantities report'!$A$2:$A$10003)-1,\"\"),ROWS($B$8:$B16))),\"0\"))","v":""},{"$f":"IF($B16=\"\",\"\",Removals!$F13)","v":""},{"$f":"IF($B16=\"\",\"\",Removals!$K13)","v":""},{"$f":"IF($B16=\"\",\"\",IFERROR(INDEX('quantities report'!$D$2:$D$10003,SMALL(IF('quantities report'!$A$2:$A$10003=L$6,ROW('quantities report'!$A$2:$A$10003)-1,\"\"),ROWS($B$8:$B16))),\"0\"))","v":""},{"$f":"IF(B16=\"\",\"\",LOOKUP(B16,'manual inputs'!$B$4:$B$22,'manual inputs'!$D$4:$D$22))","v":""},"",{"$f":"IF($B16=\"\",\"\",IFERROR(INDEX('quantities report'!$D$2:$D$10003,SMALL(IF('quantities report'!$A$2:$A$10003=O$6,ROW('quantities report'!$A$2:$A$10003)-1,\"\"),ROWS($B$8:$B16))),\"0\"))","v":""},"",null,"",{"$f":"IF($B16=\"\",\"\",IFERROR(INDEX('quantities report'!$D$2:$D$10003,SMALL(IF('quantities report'!$A$2:$A$10003=S$6,ROW('quantities report'!$A$2:$A$10003)-1,\"\"),ROWS($B$8:$B16))),\"0\"))","v":""},{"$f":"IF($B16=\"\",\"\",Backfill!H16)","v":""},{"$f":"IF($B16=\"\",\"\",IFERROR(INDEX('quantities report'!$D$2:$D$10003,SMALL(IF('quantities report'!$A$2:$A$10003=U$6,ROW('quantities report'!$A$2:$A$10003)-1,\"\"),ROWS($B$8:$B16))),\"0\"))","v":""},{"$f":"IF($B16=\"\",\"\",IFERROR(INDEX('quantities report'!$D$2:$D$10003,SMALL(IF('quantities report'!$A$2:$A$10003=V$6,ROW('quantities report'!$A$2:$A$10003)-1,\"\"),ROWS($B$8:$B16))),\"0\"))","v":""},{"$f":"IF($B16=\"\",\"\",IFERROR(INDEX('quantities report'!$D$2:$D$10003,SMALL(IF('quantities report'!$A$2:$A$10003=W$6,ROW('quantities report'!$A$2:$A$10003)-1,\"\"),ROWS($B$8:$B16))),\"0\"))","v":""},{"$f":"IF($B16=\"\",\"\",IFERROR(INDEX('quantities report'!$D$2:$D$10003,SMALL(IF('quantities report'!$A$2:$A$10003=X$6,ROW('quantities report'!$A$2:$A$10003)-1,\"\"),ROWS($B$8:$B16))),\"0\"))","v":""},{"$f":"IF($B16=\"\",\"\",Backfill!R16)","v":""},{"$f":"IF($B16=\"\",\"\",Backfill!U16)","v":""},{"$f":"IF($B16=\"\",\"\",Removals!$G13)","v":""},{"$f":"IF($B16=\"\",\"\",Removals!$L13)","v":""},{"$f":"IF($B16=\"\",\"\",IFERROR(INDEX('quantities report'!$D$2:$D$10003,SMALL(IF('quantities report'!$A$2:$A$10003=AC$6,ROW('quantities report'!$A$2:$A$10003)-1,\"\"),ROWS($B$8:$B16))),\"0\"))","v":""},{"$f":"IF($B16=\"\",\"\",IFERROR(INDEX('quantities report'!$D$2:$D$10003,SMALL(IF('quantities report'!$A$2:$A$10003=AD$6,ROW('quantities report'!$A$2:$A$10003)-1,\"\"),ROWS($B$8:$B16))),\"0\"))","v":""},{"$f":"IF($B16=\"\",\"\",IFERROR(INDEX('quantities report'!$D$2:$D$10003,SMALL(IF('quantities report'!$A$2:$A$10003=AE$6,ROW('quantities report'!$A$2:$A$10003)-1,\"\"),ROWS($B$8:$B16))),\"0\"))","v":""},{"$f":"IF($B16=\"\",\"\",IFERROR(INDEX('quantities report'!$D$2:$D$10003,SMALL(IF('quantities report'!$A$2:$A$10003=AF$6,ROW('quantities report'!$A$2:$A$10003)-1,\"\"),ROWS($B$8:$B16))),\"0\"))","v":""},{"$f":"IF($B16=\"\",\"\",IFERROR(INDEX('quantities report'!$D$2:$D$10003,SMALL(IF('quantities report'!$A$2:$A$10003=AG$6,ROW('quantities report'!$A$2:$A$10003)-1,\"\"),ROWS($B$8:$B16))),\"0\"))","v":""},{"$f":"IF($B16=\"\",\"\",IFERROR(INDEX('quantities report'!$D$2:$D$10003,SMALL(IF('quantities report'!$A$2:$A$10003=AH$6,ROW('quantities report'!$A$2:$A$10003)-1,\"\"),ROWS($B$8:$B16))),\"0\"))","v":""},"","","","","",0.9,""," "]
[null,{"$f":"IFERROR(INDEX('manual inputs'!M:M,SMALL(IF('manual inputs'!M:M<>\"\",ROW('manual inputs'!M:M)),ROW(12:12))),\"\")","v":""},{"$f":"IF(B17=\"\",\"\",IFERROR(INDEX('quantities report'!$D$2:$D$10003,SMALL(IF('quantities report'!$A$2:$A$10003=C$6,ROW('quantities report'!$A$2:$A$10003)-1,\"\"),ROWS($B$8:$B17))),\"0\"))","v":""},"",null,"",{"$f":"IF($B17=\"\",\"\",Structure_Ex!I17)","v":""},null,{"$f":"IF($B17=\"\",\"\",IFERROR(INDEX('quantities report'!$D$2:$D$10003,SMALL(IF('quantities report'!$A$2:$A$10003=I$6,ROW('quantities report'!$A$2:$A$10003)-1,\"\"),ROWS($B$8:$B17))),\"0\"))","v":""},{"$f":"IF($B17=\"\",\"\",Removals!$F14)","v":""},{"$f":"IF($B17=\"\",\"\",Removals!$K14)","v":""},{"$f":"IF($B17=\"\",\"\",IFERROR(INDEX('quantities report'!$D$2:$D$10003,SMALL(IF('quantities report'!$A$2:$A$10003=L$6,ROW('quantities report'!$A$2:$A$10003)-1,\"\"),ROWS($B$8:$B17))),\"0\"))","v":""},{"$f":"IF(B17=\"\",\"\",LOOKUP(B17,'manual inputs'!$B$4:$B$22,'manual inputs'!$D$4:$D$22))","v":""},"",{"$f":"IF($B17=\"\",\"\",IFERROR(INDEX('quantities report'!$D$2:$D$10003,SMALL(IF('quantities report'!$A$2:$A$10003=O$6,ROW('quantities report'!$A$2:$A$10003)-1,\"\"),ROWS($B$8:$B17))),\"0\"))","v":""},"",null,"",{"$f":"IF($B17=\"\",\"\",IFERROR(INDEX('quantities report'!$D$2:$D$10003,SMALL(IF('quantities report'!$A$2:$A$10003=S$6,ROW('quantities report'!$A$2:$A$10003)-1,\"\"),ROWS($B$8:$B17))),\"0\"))","v":""},{"$f":"IF($B17=\"\",\"\",Backfill!H17)","v":""},{"$f":"IF($B17=\"\",\"\",IFERROR(INDEX('quantities report'!$D$2:$D$10003,SMALL(IF('quantities report'!$A$2:$A$10003=U$6,ROW('quantities report'!$A$2:$A$10003)-1,\"\"),ROWS($B$8:$B17))),\"0\"))","v":""},{"$f":"IF($B17=\"\",\"\",IFERROR(INDEX('quantities report'!$D$2:$D$10003,SMALL(IF('quantities report'!$A$2:$A$10003=V$6,ROW('quantities report'!$A$2:$A$10003)-1,\"\"),ROWS($B$8:$B17))),\"0\"))","v":""},{"$f":"IF($B17=\"\",\"\",IFERROR(INDEX('quantities report'!$D$2:$D$10003,SMALL(IF('quantities report'!$A$2:$A$10003=W$6,ROW('quantities report'!$A$2:$A$10003)-1,\"\"),ROWS($B$8:$B17))),\"0\"))","v":""},{"$f":"IF($B17=\"\",\"\",IFERROR(INDEX('quantities report'!$D$2:$D$10003,SMALL(IF('quantities report'!$A$2:$A$10003=X$6,ROW('quantities report'!$A$2:$A$10003)-1,\"\"),ROWS($B$8:$B17))),\"0\"))","v":""},{"$f":"IF($B17=\"\",\"\",Backfill!R17)","v":""},{"$f":"IF($B17=\"\",\"\",Backfill!U17)","v":""},{"$f":"IF($B17=\"\",\"\",Removals!$G14)","v":""},{"$f":"IF($B17=\"\",\"\",Removals!$L14)","v":""},{"$f":"IF($B17=\"\",\"\",IFERROR(INDEX('quantities report'!$D$2:$D$10003,SMALL(IF('quantities report'!$A$2:$A$10003=AC$6,ROW('quantities report'!$A$2:$A$10003)-1,\"\"),ROWS($B$8:$B17))),\"0\"))","v":""},{"$f":"IF($B17=\"\",\"\",IFERROR(INDEX('quantities report'!$D$2:$D$10003,SMALL(IF('quantities report'!$A$2:$A$10003=AD$6,ROW('quantities report'!$A$2:$A$10003)-1,\"\"),ROWS($B$8:$B17))),\"0\"))","v":""},{"$f":"IF($B17=\"\",\"\",IFERROR(INDEX('quantities report'!$D$2:$D$10003,SMALL(IF('quantities report'!$A$2:$A$10003=AE$6,ROW('quantities report'!$A$2:$A$10003)-1,\"\"),ROWS($B$8:$B17))),\"0\"))","v":""},{"$f":"IF($B17=\"\",\"\",IFERROR(INDEX('quantities report'!$D$2:$D$10003,SMALL(IF('quantities report'!$A$2:$A$10003=AF$6,ROW('quantities report'!$A$2:$A$10003)-1,\"\"),ROWS($B$8:$B17))),\"0\"))","v":""},{"$f":"IF($B17=\"\",\"\",IFERROR(INDEX('quantities report'!$D$2:$D$10003,SMALL(IF('quantities report'!$A$2:$A$10003=AG$6,ROW('quantities report'!$A$2:$A$10003)-1,\"\"),ROWS($B$8:$B17))),\"0\"))","v":""},{"$f":"IF($B17=\"\",\"\",IFERROR(INDEX('quantities report'!$D$2:$D$10003,SMALL(IF('quantities report'!$A$2:$A$10003=AH$6,ROW('quantities report'!$A$2:$A$10003)-1,\"\"),ROWS($B$8:$B17))),\"0\"))","v":""},"","","","","",0.9,""," "]
[null,{"$f":"IFERROR(INDEX('manual inputs'!M:M,SMALL(IF('manual inputs'!M:M<>\"\",ROW('manual inputs'!M:M)),ROW(13:13))),\"\")","v":""},{"$f":"IF(B18=\"\",\"\",IFERROR(INDEX('quantities report'!$D$2:$D$10003,SMALL(IF('quantities report'!$A$2:$A$10003=C$6,ROW('quantities report'!$A$2:$A$10003)-1,\"\"),ROWS($B$8:$B18))),\"0\"))","v":""},"",null,"",{"$f":"IF($B18=\"\",\"\",Structure_Ex!I18)","v":""},null,{"$f":"IF($B18=\"\",\"\",IFERROR(INDEX('quantities report'!$D$2:$D$10003,SMALL(IF('quantities report'!$A$2:$A$10003=I$6,ROW('quantities report'!$A$2:$A$10003)-1,\"\"),ROWS($B$8:$B18))),\"0\"))","v":""},{"$f":"IF($B18=\"\",\"\",Removals!$F15)","v":""},{"$f":"IF($B18=\"\",\"\",Removals!$K15)","v":""},{"$f":"IF($B18=\"\",\"\",IFERROR(INDEX('quantities report'!$D$2:$D$10003,SMALL(IF('quantities report'!$A$2:$A$10003=L$6,ROW('quantities report'!$A$2:$A$10003)-1,\"\"),ROWS($B$8:$B18))),\"0\"))","v":""},{"$f":"IF(B18=\"\",\"\",LOOKUP(B18,'manual inputs'!$B$4:$B$22,'manual inputs'!$D$4:$D$22))","v":""},"",{"$f":"IF($B18=\"\",\"\",IFERROR(INDEX('quantities report'!$D$2:$D$10003,SMALL(IF('quantities report'!$A$2:$A$10003=O$6,ROW('quantities report'!$A$2:$A$10003)-1,\"\"),ROWS($B$8:$B18))),\"0\"))","v":""},"",null,"",{"$f":"IF($B18=\"\",\"\",IFERROR(INDEX('quantities report'!$D$2:$D$10003,SMALL(IF('quantities report'!$A$2:$A$10003=S$6,ROW('quantities report'!$A$2:$A$10003)-1,\"\"),ROWS($B$8:$B18))),\"0\"))","v":""},{"$f":"IF($B18=\"\",\"\",Backfill!H18)","v":""},{"$f":"IF($B18=\"\",\"\",IFERROR(INDEX('quantities report'!$D$2:$D$10003,SMALL(IF('quantities report'!$A$2:$A$10003=U$6,ROW('quantities report'!$A$2:$A$10003)-1,\"\"),ROWS($B$8:$B18))),\"0\"))","v":""},{"$f":"IF($B18=\"\",\"\",IFERROR(INDEX('quantities report'!$D$2:$D$10003,SMALL(IF('quantities report'!$A$2:$A$10003=V$6,ROW('quantities report'!$A$2:$A$10003)-1,\"\"),ROWS($B$8:$B18))),\"0\"))","v":""},{"$f":"IF($B18=\"\",\"\",IFERROR(INDEX('quantities report'!$D$2:$D$10003,SMALL(IF('quantities report'!$A$2:$A$10003=W$6,ROW('quantities report'!$A$2:$A$10003)-1,\"\"),ROWS($B$8:$B18))),\"0\"))","v":""},{"$f":"IF($B18=\"\",\"\",IFERROR(INDEX('quantities report'!$D$2:$D$10003,SMALL(IF('quantities report'!$A$2:$A$10003=X$6,ROW('quantities report'!$A$2:$A$10003)-1,\"\"),ROWS($B$8:$B18))),\"0\"))","v":""},{"$f":"IF($B18=\"\",\"\",Backfill!R18)","v":""},{"$f":"IF($B18=\"\",\"\",Backfill!U18)","v":""},{"$f":"IF($B18=\"\",\"\",Removals!$G15)","v":""},{"$f":"IF($B18=\"\",\"\",Removals!$L15)","v":""},{"$f":"IF($B18=\"\",\"\",IFERROR(INDEX('quantities report'!$D$2:$D$10003,SMALL(IF('quantities report'!$A$2:$A$10003=AC$6,ROW('quantities report'!$A$2:$A$10003)-1,\"\"),ROWS($B$8:$B18))),\"0\"))","v":""},{"$f":"IF($B18=\"\",\"\",IFERROR(INDEX('quantities report'!$D$2:$D$10003,SMALL(IF('quantities report'!$A$2:$A$10003=AD$6,ROW('quantities report'!$A$2:$A$10003)-1,\"\"),ROWS($B$8:$B18))),\"0\"))","v":""},{"$f":"IF($B18=\"\",\"\",IFERROR(INDEX('quantities report'!$D$2:$D$10003,SMALL(IF('quantities report'!$A$2:$A$10003=AE$6,ROW('quantities report'!$A$2:$A$10003)-1,\"\"),ROWS($B$8:$B18))),\"0\"))","v":""},{"$f":"IF($B18=\"\",\"\",IFERROR(INDEX('quantities report'!$D$2:$D$10003,SMALL(IF('quantities report'!$A$2:$A$10003=AF$6,ROW('quantities report'!$A$2:$A$10003)-1,\"\"),ROWS($B$8:$B18))),\"0\"))","v":""},{"$f":"IF($B18=\"\",\"\",IFERROR(INDEX('quantities report'!$D$2:$D$10003,SMALL(IF('quantities report'!$A$2:$A$10003=AG$6,ROW('quantities report'!$A$2:$A$10003)-1,\"\"),ROWS($B$8:$B18))),\"0\"))","v":""},{"$f":"IF($B18=\"\",\"\",IFERROR(INDEX('quantities report'!$D$2:$D$10003,SMALL(IF('quantities report'!$A$2:$A$10003=AH$6,ROW('quantities report'!$A$2:$A$10003)-1,\"\"),ROWS($B$8:$B18))),\"0\"))","v":""},"","","","","",0.9,""," "]
[null,{"$f":"IFERROR(INDEX('manual inputs'!M:M,SMALL(IF('manual inputs'!M:M<>\"\",ROW('manual inputs'!M:M)),ROW(14:14))),\"\")","v":""},{"$f":"IF(B19=\"\",\"\",IFERROR(INDEX('quantities report'!$D$2:$D$10003,SMALL(IF('quantities report'!$A$2:$A$10003=C$6,ROW('quantities report'!$A$2:$A$10003)-1,\"\"),ROWS($B$8:$B19))),\"0\"))","v":""},"",null,"",{"$f":"IF($B19=\"\",\"\",Structure_Ex!I19)","v":""},null,{"$f":"IF($B19=\"\",\"\",IFERROR(INDEX('quantities report'!$D$2:$D$10003,SMALL(IF('quantities report'!$A$2:$A$10003=I$6,ROW('quantities report'!$A$2:$A$10003)-1,\"\"),ROWS($B$8:$B19))),\"0\"))","v":""},{"$f":"IF($B19=\"\",\"\",Removals!$F16)","v":""},{"$f":"IF($B19=\"\",\"\",Removals!$K16)","v":""},{"$f":"IF($B19=\"\",\"\",IFERROR(INDEX('quantities report'!$D$2:$D$10003,SMALL(IF('quantities report'!$A$2:$A$10003=L$6,ROW('quantities report'!$A$2:$A$10003)-1,\"\"),ROWS($B$8:$B19))),\"0\"))","v":""},{"$f":"IF(B19=\"\",\"\",LOOKUP(B19,'manual inputs'!$B$4:$B$22,'manual inputs'!$D$4:$D$22))","v":""},"",{"$f":"IF($B19=\"\",\"\",IFERROR(INDEX('quantities report'!$D$2:$D$10003,SMALL(IF('quantities report'!$A$2:$A$10003=O$6,ROW('quantities report'!$A$2:$A$10003)-1,\"\"),ROWS($B$8:$B19))),\"0\"))","v":""},"",null,"",{"$f":"IF($B19=\"\",\"\",IFERROR(INDEX('quantities report'!$D$2:$D$10003,SMALL(IF('quantities report'!$A$2:$A$10003=S$6,ROW('quantities report'!$A$2:$A$10003)-1,\"\"),ROWS($B$8:$B19))),\"0\"))","v":""},{"$f":"IF($B19=\"\",\"\",Backfill!H19)","v":""},{"$f":"IF($B19=\"\",\"\",IFERROR(INDEX('quantities report'!$D$2:$D$10003,SMALL(IF('quantities report'!$A$2:$A$10003=U$6,ROW('quantities report'!$A$2:$A$10003)-1,\"\"),ROWS($B$8:$B19))),\"0\"))","v":""},{"$f":"IF($B19=\"\",\"\",IFERROR(INDEX('quantities report'!$D$2:$D$10003,SMALL(IF('quantities report'!$A$2:$A$10003=V$6,ROW('quantities report'!$A$2:$A$10003)-1,\"\"),ROWS($B$8:$B19))),\"0\"))","v":""},{"$f":"IF($B19=\"\",\"\",IFERROR(INDEX('quantities report'!$D$2:$D$10003,SMALL(IF('quantities report'!$A$2:$A$10003=W$6,ROW('quantities report'!$A$2:$A$10003)-1,\"\"),ROWS($B$8:$B19))),\"0\"))","v":""},{"$f":"IF($B19=\"\",\"\",IFERROR(INDEX('quantities report'!$D$2:$D$10003,SMALL(IF('quantities report'!$A$2:$A$10003=X$6,ROW('quantities report'!$A$2:$A$10003)-1,\"\"),ROWS($B$8:$B19))),\"0\"))","v":""},{"$f":"IF($B19=\"\",\"\",Backfill!R19)","v":""},{"$f":"IF($B19=\"\",\"\",Backfill!U19)","v":""},{"$f":"IF($B19=\"\",\"\",Removals!$G16)","v":""},{"$f":"IF($B19=\"\",\"\",Removals!$L16)","v":""},{"$f":"IF($B19=\"\",\"\",IFERROR(INDEX('quantities report'!$D$2:$D$10003,SMALL(IF('quantities report'!$A$2:$A$10003=AC$6,ROW('quantities report'!$A$2:$A$10003)-1,\"\"),ROWS($B$8:$B19))),\"0\"))","v":""},{"$f":"IF($B19=\"\",\"\",IFERROR(INDEX('quantities report'!$D$2:$D$10003,SMALL(IF('quantities report'!$A$2:$A$10003=AD$6,ROW('quantities report'!$A$2:$A$10003)-1,\"\"),ROWS($B$8:$B19))),\"0\"))","v":""},{"$f":"IF($B19=\"\",\"\",IFERROR(INDEX('quantities report'!$D$2:$D$10003,SMALL(IF('quantities report'!$A$2:$A$10003=AE$6,ROW('quantities report'!$A$2:$A$10003)-1,\"\"),ROWS($B$8:$B19))),\"0\"))","v":""},{"$f":"IF($B19=\"\",\"\",IFERROR(INDEX('quantities report'!$D$2:$D$10003,SMALL(IF('quantities report'!$A$2:$A$10003=AF$6,ROW('quantities report'!$A$2:$A$10003)-1,\"\"),ROWS($B$8:$B19))),\"0\"))","v":""},{"$f":"IF($B19=\"\",\"\",IFERROR(INDEX('quantities report'!$D$2:$D$10003,SMALL(IF('quantities report'!$A$2:$A$10003=AG$6,ROW('quantities report'!$A$2:$A$10003)-1,\"\"),ROWS($B$8:$B19))),\"0\"))","v":""},{"$f":"IF($B19=\"\",\"\",IFERROR(INDEX('quantities report'!$D$2:$D$10003,SMALL(IF('quantities report'!$A$2:$A$10003=AH$6,ROW('quantities report'!$A$2:$A$10003)-1,\"\"),ROWS($B$8:$B19))),\"0\"))","v":""},"","","","","",0.9,""," "]
[null,{"$f":"IFERROR(INDEX('manual inputs'!M:M,SMALL(IF('manual inputs'!M:M<>\"\",ROW('manual inputs'!M:M)),ROW(15:15))),\"\")","v":""},{"$f":"IF(B20=\"\",\"\",IFERROR(INDEX('quantities report'!$D$2:$D$10003,SMALL(IF('quantities report'!$A$2:$A$10003=C$6,ROW('quantities report'!$A$2:$A$10003)-1,\"\"),ROWS($B$8:$B20))),\"0\"))","v":""},"",null,"",{"$f":"IF($B20=\"\",\"\",Structure_Ex!I20)","v":""},null,{"$f":"IF($B20=\"\",\"\",IFERROR(INDEX('quantities report'!$D$2:$D$10003,SMALL(IF('quantities report'!$A$2:$A$10003=I$6,ROW('quantities report'!$A$2:$A$10003)-1,\"\"),ROWS($B$8:$B20))),\"0\"))","v":""},{"$f":"IF($B20=\"\",\"\",Removals!$F17)","v":""},{"$f":"IF($B20=\"\",\"\",Removals!$K17)","v":""},{"$f":"IF($B20=\"\",\"\",IFERROR(INDEX('quantities report'!$D$2:$D$10003,SMALL(IF('quantities report'!$A$2:$A$10003=L$6,ROW('quantities report'!$A$2:$A$10003)-1,\"\"),ROWS($B$8:$B20))),\"0\"))","v":""},{"$f":"IF(B20=\"\",\"\",LOOKUP(B20,'manual inputs'!$B$4:$B$22,'manual inputs'!$D$4:$D$22))","v":""},"",{"$f":"IF($B20=\"\",\"\",IFERROR(INDEX('quantities report'!$D$2:$D$10003,SMALL(IF('quantities report'!$A$2:$A$10003=O$6,ROW('quantities report'!$A$2:$A$10003)-1,\"\"),ROWS($B$8:$B20))),\"0\"))","v":""},"",null,"",{"$f":"IF($B20=\"\",\"\",IFERROR(INDEX('quantities report'!$D$2:$D$10003,SMALL(IF('quantities report'!$A$2:$A$10003=S$6,ROW('quantities report'!$A$2:$A$10003)-1,\"\"),ROWS($B$8:$B20))),\"0\"))","v":""},{"$f":"IF($B20=\"\",\"\",Backfill!H20)","v":""},{"$f":"IF($B20=\"\",\"\",IFERROR(INDEX('quantities report'!$D$2:$D$10003,SMALL(IF('quantities report'!$A$2:$A$10003=U$6,ROW('quantities report'!$A$2:$A$10003)-1,\"\"),ROWS($B$8:$B20))),\"0\"))","v":""},{"$f":"IF($B20=\"\",\"\",IFERROR(INDEX('quantities report'!$D$2:$D$10003,SMALL(IF('quantities report'!$A$2:$A$10003=V$6,ROW('quantities report'!$A$2:$A$10003)-1,\"\"),ROWS($B$8:$B20))),\"0\"))","v":""},{"$f":"IF($B20=\"\",\"\",IFERROR(INDEX('quantities report'!$D$2:$D$10003,SMALL(IF('quantities report'!$A$2:$A$10003=W$6,ROW('quantities report'!$A$2:$A$10003)-1,\"\"),ROWS($B$8:$B20))),\"0\"))","v":""},{"$f":"IF($B20=\"\",\"\",IFERROR(INDEX('quantities report'!$D$2:$D$10003,SMALL(IF('quantities report'!$A$2:$A$10003=X$6,ROW('quantities report'!$A$2:$A$10003)-1,\"\"),ROWS($B$8:$B20))),\"0\"))","v":""},{"$f":"IF($B20=\"\",\"\",Backfill!R20)","v":""},{"$f":"IF($B20=\"\",\"\",Backfill!U20)","v":""},{"$f":"IF($B20=\"\",\"\",Removals!$G17)","v":""},{"$f":"IF($B20=\"\",\"\",Removals!$L17)","v":""},{"$f":"IF($B20=\"\",\"\",IFERROR(INDEX('quantities report'!$D$2:$D$10003,SMALL(IF('quantities report'!$A$2:$A$10003=AC$6,ROW('quantities report'!$A$2:$A$10003)-1,\"\"),ROWS($B$8:$B20))),\"0\"))","v":""},{"$f":"IF($B20=\"\",\"\",IFERROR(INDEX('quantities report'!$D$2:$D$10003,SMALL(IF('quantities report'!$A$2:$A$10003=AD$6,ROW('quantities report'!$A$2:$A$10003)-1,\"\"),ROWS($B$8:$B20))),\"0\"))","v":""},{"$f":"IF($B20=\"\",\"\",IFERROR(INDEX('quantities report'!$D$2:$D$10003,SMALL(IF('quantities report'!$A$2:$A$10003=AE$6,ROW('quantities report'!$A$2:$A$10003)-1,\"\"),ROWS($B$8:$B20))),\"0\"))","v":""},{"$f":"IF($B20=\"\",\"\",IFERROR(INDEX('quantities report'!$D$2:$D$10003,SMALL(IF('quantities report'!$A$2:$A$10003=AF$6,ROW('quantities report'!$A$2:$A$10003)-1,\"\"),ROWS($B$8:$B20))),\"0\"))","v":""},{"$f":"IF($B20=\"\",\"\",IFERROR(INDEX('quantities report'!$D$2:$D$10003,SMALL(IF('quantities report'!$A$2:$A$10003=AG$6,ROW('quantities report'!$A$2:$A$10003)-1,\"\"),ROWS($B$8:$B20))),\"0\"))","v":""},{"$f":"IF($B20=\"\",\"\",IFERROR(INDEX('quantities report'!$D$2:$D$10003,SMALL(IF('quantities report'!$A$2:$A$10003=AH$6,ROW('quantities report'!$A$2:$A$10003)-1,\"\"),ROWS($B$8:$B20))),\"0\"))","v":""},"","","","","",0.9,""," "]
[null,{"$f":"IFERROR(INDEX('manual inputs'!M:M,SMALL(IF('manual inputs'!M:M<>\"\",ROW('manual inputs'!M:M)),ROW(16:16))),\"\")","v":""},{"$f":"IF(B21=\"\",\"\",IFERROR(INDEX('quantities report'!$D$2:$D$10003,SMALL(IF('quantities report'!$A$2:$A$10003=C$6,ROW('quantities report'!$A$2:$A$10003)-1,\"\"),ROWS($B$8:$B21))),\"0\"))","v":""},"",null,"",{"$f":"IF($B21=\"\",\"\",Structure_Ex!I21)","v":""},null,{"$f":"IF($B21=\"\",\"\",IFERROR(INDEX('quantities report'!$D$2:$D$10003,SMALL(IF('quantities report'!$A$2:$A$10003=I$6,ROW('quantities report'!$A$2:$A$10003)-1,\"\"),ROWS($B$8:$B21))),\"0\"))","v":""},{"$f":"IF($B21=\"\",\"\",Removals!$F18)","v":""},{"$f":"IF($B21=\"\",\"\",Removals!$K18)","v":""},{"$f":"IF($B21=\"\",\"\",IFERROR(INDEX('quantities report'!$D$2:$D$10003,SMALL(IF('quantities report'!$A$2:$A$10003=L$6,ROW('quantities report'!$A$2:$A$10003)-1,\"\"),ROWS($B$8:$B21))),\"0\"))","v":""},{"$f":"IF(B21=\"\",\"\",LOOKUP(B21,'manual inputs'!$B$4:$B$22,'manual inputs'!$D$4:$D$22))","v":""},"",{"$f":"IF($B21=\"\",\"\",IFERROR(INDEX('quantities report'!$D$2:$D$10003,SMALL(IF('quantities report'!$A$2:$A$10003=O$6,ROW('quantities report'!$A$2:$A$10003)-1,\"\"),ROWS($B$8:$B21))),\"0\"))","v":""},"",null,"",{"$f":"IF($B21=\"\",\"\",IFERROR(INDEX('quantities report'!$D$2:$D$10003,SMALL(IF('quantities report'!$A$2:$A$10003=S$6,ROW('quantities report'!$A$2:$A$10003)-1,\"\"),ROWS($B$8:$B21))),\"0\"))","v":""},{"$f":"IF($B21=\"\",\"\",Backfill!H21)","v":""},{"$f":"IF($B21=\"\",\"\",IFERROR(INDEX('quantities report'!$D$2:$D$10003,SMALL(IF('quantities report'!$A$2:$A$10003=U$6,ROW('quantities report'!$A$2:$A$10003)-1,\"\"),ROWS($B$8:$B21))),\"0\"))","v":""},{"$f":"IF($B21=\"\",\"\",IFERROR(INDEX('quantities report'!$D$2:$D$10003,SMALL(IF('quantities report'!$A$2:$A$10003=V$6,ROW('quantities report'!$A$2:$A$10003)-1,\"\"),ROWS($B$8:$B21))),\"0\"))","v":""},{"$f":"IF($B21=\"\",\"\",IFERROR(INDEX('quantities report'!$D$2:$D$10003,SMALL(IF('quantities report'!$A$2:$A$10003=W$6,ROW('quantities report'!$A$2:$A$10003)-1,\"\"),ROWS($B$8:$B21))),\"0\"))","v":""},{"$f":"IF($B21=\"\",\"\",IFERROR(INDEX('quantities report'!$D$2:$D$10003,SMALL(IF('quantities report'!$A$2:$A$10003=X$6,ROW('quantities report'!$A$2:$A$10003)-1,\"\"),ROWS($B$8:$B21))),\"0\"))","v":""},{"$f":"IF($B21=\"\",\"\",Backfill!R21)","v":""},{"$f":"IF($B21=\"\",\"\",Backfill!U21)","v":""},{"$f":"IF($B21=\"\",\"\",Removals!$G18)","v":""},{"$f":"IF($B21=\"\",\"\",Removals!$L18)","v":""},{"$f":"IF($B21=\"\",\"\",IFERROR(INDEX('quantities report'!$D$2:$D$10003,SMALL(IF('quantities report'!$A$2:$A$10003=AC$6,ROW('quantities report'!$A$2:$A$10003)-1,\"\"),ROWS($B$8:$B21))),\"0\"))","v":""},{"$f":"IF($B21=\"\",\"\",IFERROR(INDEX('quantities report'!$D$2:$D$10003,SMALL(IF('quantities report'!$A$2:$A$10003=AD$6,ROW('quantities report'!$A$2:$A$10003)-1,\"\"),ROWS($B$8:$B21))),\"0\"))","v":""},{"$f":"IF($B21=\"\",\"\",IFERROR(INDEX('quantities report'!$D$2:$D$10003,SMALL(IF('quantities report'!$A$2:$A$10003=AE$6,ROW('quantities report'!$A$2:$A$10003)-1,\"\"),ROWS($B$8:$B21))),\"0\"))","v":""},{"$f":"IF($B21=\"\",\"\",IFERROR(INDEX('quantities report'!$D$2:$D$10003,SMALL(IF('quantities report'!$A$2:$A$10003=AF$6,ROW('quantities report'!$A$2:$A$10003)-1,\"\"),ROWS($B$8:$B21))),\"0\"))","v":""},{"$f":"IF($B21=\"\",\"\",IFERROR(INDEX('quantities report'!$D$2:$D$10003,SMALL(IF('quantities report'!$A$2:$A$10003=AG$6,ROW('quantities report'!$A$2:$A$10003)-1,\"\"),ROWS($B$8:$B21))),\"0\"))","v":""},{"$f":"IF($B21=\"\",\"\",IFERROR(INDEX('quantities report'!$D$2:$D$10003,SMALL(IF('quantities report'!$A$2:$A$10003=AH$6,ROW('quantities report'!$A$2:$A$10003)-1,\"\"),ROWS($B$8:$B21))),\"0\"))","v":""},"","","","","",0.9,""," "]
[null,{"$f":"IFERROR(INDEX('manual inputs'!M:M,SMALL(IF('manual inputs'!M:M<>\"\",ROW('manual inputs'!M:M)),ROW(17:17))),\"\")","v":""},{"$f":"IF(B22=\"\",\"\",IFERROR(INDEX('quantities report'!$D$2:$D$10003,SMALL(IF('quantities report'!$A$2:$A$10003=C$6,ROW('quantities report'!$A$2:$A$10003)-1,\"\"),ROWS($B$8:$B22))),\"0\"))","v":""},"",null,"",{"$f":"IF($B22=\"\",\"\",Structure_Ex!I22)","v":""},null,{"$f":"IF($B22=\"\",\"\",IFERROR(INDEX('quantities report'!$D$2:$D$10003,SMALL(IF('quantities report'!$A$2:$A$10003=I$6,ROW('quantities report'!$A$2:$A$10003)-1,\"\"),ROWS($B$8:$B22))),\"0\"))","v":""},{"$f":"IF($B22=\"\",\"\",Removals!$F19)","v":""},{"$f":"IF($B22=\"\",\"\",Removals!$K19)","v":""},{"$f":"IF($B22=\"\",\"\",IFERROR(INDEX('quantities report'!$D$2:$D$10003,SMALL(IF('quantities report'!$A$2:$A$10003=L$6,ROW('quantities report'!$A$2:$A$10003)-1,\"\"),ROWS($B$8:$B22))),\"0\"))","v":""},{"$f":"IF(B22=\"\",\"\",LOOKUP(B22,'manual inputs'!$B$4:$B$22,'manual inputs'!$D$4:$D$22))","v":""},"",{"$f":"IF($B22=\"\",\"\",IFERROR(INDEX('quantities report'!$D$2:$D$10003,SMALL(IF('quantities report'!$A$2:$A$10003=O$6,ROW('quantities report'!$A$2:$A$10003)-1,\"\"),ROWS($B$8:$B22))),\"0\"))","v":""},"",null,"",{"$f":"IF($B22=\"\",\"\",IFERROR(INDEX('quantities report'!$D$2:$D$10003,SMALL(IF('quantities report'!$A$2:$A$10003=S$6,ROW('quantities report'!$A$2:$A$10003)-1,\"\"),ROWS($B$8:$B22))),\"0\"))","v":""},{"$f":"IF($B22=\"\",\"\",Backfill!H22)","v":""},{"$f":"IF($B22=\"\",\"\",IFERROR(INDEX('quantities report'!$D$2:$D$10003,SMALL(IF('quantities report'!$A$2:$A$10003=U$6,ROW('quantities report'!$A$2:$A$10003)-1,\"\"),ROWS($B$8:$B22))),\"0\"))","v":""},{"$f":"IF($B22=\"\",\"\",IFERROR(INDEX('quantities report'!$D$2:$D$10003,SMALL(IF('quantities report'!$A$2:$A$10003=V$6,ROW('quantities report'!$A$2:$A$10003)-1,\"\"),ROWS($B$8:$B22))),\"0\"))","v":""},{"$f":"IF($B22=\"\",\"\",IFERROR(INDEX('quantities report'!$D$2:$D$10003,SMALL(IF('quantities report'!$A$2:$A$10003=W$6,ROW('quantities report'!$A$2:$A$10003)-1,\"\"),ROWS($B$8:$B22))),\"0\"))","v":""},{"$f":"IF($B22=\"\",\"\",IFERROR(INDEX('quantities report'!$D$2:$D$10003,SMALL(IF('quantities report'!$A$2:$A$10003=X$6,ROW('quantities report'!$A$2:$A$10003)-1,\"\"),ROWS($B$8:$B22))),\"0\"))","v":""},{"$f":"IF($B22=\"\",\"\",Backfill!R22)","v":""},{"$f":"IF($B22=\"\",\"\",Backfill!U22)","v":""},{"$f":"IF($B22=\"\",\"\",Removals!$G19)","v":""},{"$f":"IF($B22=\"\",\"\",Removals!$L19)","v":""},{"$f":"IF($B22=\"\",\"\",IFERROR(INDEX('quantities report'!$D$2:$D$10003,SMALL(IF('quantities report'!$A$2:$A$10003=AC$6,ROW('quantities report'!$A$2:$A$10003)-1,\"\"),ROWS($B$8:$B22))),\"0\"))","v":""},{"$f":"IF($B22=\"\",\"\",IFERROR(INDEX('quantities report'!$D$2:$D$10003,SMALL(IF('quantities report'!$A$2:$A$10003=AD$6,ROW('quantities report'!$A$2:$A$10003)-1,\"\"),ROWS($B$8:$B22))),\"0\"))","v":""},{"$f":"IF($B22=\"\",\"\",IFERROR(INDEX('quantities report'!$D$2:$D$10003,SMALL(IF('quantities report'!$A$2:$A$10003=AE$6,ROW('quantities report'!$A$2:$A$10003)-1,\"\"),ROWS($B$8:$B22))),\"0\"))","v":""},{"$f":"IF($B22=\"\",\"\",IFERROR(INDEX('quantities report'!$D$2:$D$10003,SMALL(IF('quantities report'!$A$2:$A$10003=AF$6,ROW('quantities report'!$A$2:$A$10003)-1,\"\"),ROWS($B$8:$B22))),\"0\"))","v":""},{"$f":"IF($B22=\"\",\"\",IFERROR(INDEX('quantities report'!$D$2:$D$10003,SMALL(IF('quantities report'!$A$2:$A$10003=AG$6,ROW('quantities report'!$A$2:$A$10003)-1,\"\"),ROWS($B$8:$B22))),\"0\"))","v":""},{"$f":"IF($B22=\"\",\"\",IFERROR(INDEX('quantities report'!$D$2:$D$10003,SMALL(IF('quantities report'!$A$2:$A$10003=AH$6,ROW('quantities report'!$A$2:$A$10003)-1,\"\"),ROWS($B$8:$B22))),\"0\"))","v":""},"","","","","",0.9,""," "]
[null,{"$f":"IFERROR(INDEX('manual inputs'!M:M,SMALL(IF('manual inputs'!M:M<>\"\",ROW('manual inputs'!M:M)),ROW(18:18))),\"\")","v":""},{"$f":"IF(B23=\"\",\"\",IFERROR(INDEX('quantities report'!$D$2:$D$10003,SMALL(IF('quantities report'!$A$2:$A$10003=C$6,ROW('quantities report'!$A$2:$A$10003)-1,\"\"),ROWS($B$8:$B23))),\"0\"))","v":""},"",null,"",{"$f":"IF($B23=\"\",\"\",Structure_Ex!I23)","v":""},null,{"$f":"IF($B23=\"\",\"\",IFERROR(INDEX('quantities report'!$D$2:$D$10003,SMALL(IF('quantities report'!$A$2:$A$10003=I$6,ROW('quantities report'!$A$2:$A$10003)-1,\"\"),ROWS($B$8:$B23))),\"0\"))","v":""},{"$f":"IF($B23=\"\",\"\",Removals!$F20)","v":""},{"$f":"IF($B23=\"\",\"\",Removals!$K20)","v":""},{"$f":"IF($B23=\"\",\"\",IFERROR(INDEX('quantities report'!$D$2:$D$10003,SMALL(IF('quantities report'!$A$2:$A$10003=L$6,ROW('quantities report'!$A$2:$A$10003)-1,\"\"),ROWS($B$8:$B23))),\"0\"))","v":""},{"$f":"IF(B23=\"\",\"\",LOOKUP(B23,'manual inputs'!$B$4:$B$22,'manual inputs'!$D$4:$D$22))","v":""},"",{"$f":"IF($B23=\"\",\"\",IFERROR(INDEX('quantities report'!$D$2:$D$10003,SMALL(IF('quantities report'!$A$2:$A$10003=O$6,ROW('quantities report'!$A$2:$A$10003)-1,\"\"),ROWS($B$8:$B23))),\"0\"))","v":""},"",null,"",{"$f":"IF($B23=\"\",\"\",IFERROR(INDEX('quantities report'!$D$2:$D$10003,SMALL(IF('quantities report'!$A$2:$A$10003=S$6,ROW('quantities report'!$A$2:$A$10003)-1,\"\"),ROWS($B$8:$B23))),\"0\"))","v":""},{"$f":"IF($B23=\"\",\"\",Backfill!H23)","v":""},{"$f":"IF($B23=\"\",\"\",IFERROR(INDEX('quantities report'!$D$2:$D$10003,SMALL(IF('quantities report'!$A$2:$A$10003=U$6,ROW('quantities report'!$A$2:$A$10003)-1,\"\"),ROWS($B$8:$B23))),\"0\"))","v":""},{"$f":"IF($B23=\"\",\"\",IFERROR(INDEX('quantities report'!$D$2:$D$10003,SMALL(IF('quantities report'!$A$2:$A$10003=V$6,ROW('quantities report'!$A$2:$A$10003)-1,\"\"),ROWS($B$8:$B23))),\"0\"))","v":""},{"$f":"IF($B23=\"\",\"\",IFERROR(INDEX('quantities report'!$D$2:$D$10003,SMALL(IF('quantities report'!$A$2:$A$10003=W$6,ROW('quantities report'!$A$2:$A$10003)-1,\"\"),ROWS($B$8:$B23))),\"0\"))","v":""},{"$f":"IF($B23=\"\",\"\",IFERROR(INDEX('quantities report'!$D$2:$D$10003,SMALL(IF('quantities report'!$A$2:$A$10003=X$6,ROW('quantities report'!$A$2:$A$10003)-1,\"\"),ROWS($B$8:$B23))),\"0\"))","v":""},{"$f":"IF($B23=\"\",\"\",Backfill!R23)","v":""},{"$f":"IF($B23=\"\",\"\",Backfill!U23)","v":""},{"$f":"IF($B23=\"\",\"\",Removals!$G20)","v":""},{"$f":"IF($B23=\"\",\"\",Removals!$L20)","v":""},{"$f":"IF($B23=\"\",\"\",IFERROR(INDEX('quantities report'!$D$2:$D$10003,SMALL(IF('quantities report'!$A$2:$A$10003=AC$6,ROW('quantities report'!$A$2:$A$10003)-1,\"\"),ROWS($B$8:$B23))),\"0\"))","v":""},{"$f":"IF($B23=\"\",\"\",IFERROR(INDEX('quantities report'!$D$2:$D$10003,SMALL(IF('quantities report'!$A$2:$A$10003=AD$6,ROW('quantities report'!$A$2:$A$10003)-1,\"\"),ROWS($B$8:$B23))),\"0\"))","v":""},{"$f":"IF($B23=\"\",\"\",IFERROR(INDEX('quantities report'!$D$2:$D$10003,SMALL(IF('quantities report'!$A$2:$A$10003=AE$6,ROW('quantities report'!$A$2:$A$10003)-1,\"\"),ROWS($B$8:$B23))),\"0\"))","v":""},{"$f":"IF($B23=\"\",\"\",IFERROR(INDEX('quantities report'!$D$2:$D$10003,SMALL(IF('quantities report'!$A$2:$A$10003=AF$6,ROW('quantities report'!$A$2:$A$10003)-1,\"\"),ROWS($B$8:$B23))),\"0\"))","v":""},{"$f":"IF($B23=\"\",\"\",IFERROR(INDEX('quantities report'!$D$2:$D$10003,SMALL(IF('quantities report'!$A$2:$A$10003=AG$6,ROW('quantities report'!$A$2:$A$10003)-1,\"\"),ROWS($B$8:$B23))),\"0\"))","v":""},{"$f":"IF($B23=\"\",\"\",IFERROR(INDEX('quantities report'!$D$2:$D$10003,SMALL(IF('quantities report'!$A$2:$A$10003=AH$6,ROW('quantities report'!$A$2:$A$10003)-1,\"\"),ROWS($B$8:$B23))),\"0\"))","v":""},"","","","","",0.9,""," "]
[null,{"$f":"IFERROR(INDEX('manual inputs'!M:M,SMALL(IF('manual inputs'!M:M<>\"\",ROW('manual inputs'!M:M)),ROW(19:19))),\"\")","v":""},{"$f":"IF(B24=\"\",\"\",IFERROR(INDEX('quantities report'!$D$2:$D$10003,SMALL(IF('quantities report'!$A$2:$A$10003=C$6,ROW('quantities report'!$A$2:$A$10003)-1,\"\"),ROWS($B$8:$B24))),\"0\"))","v":""},"",null,"",{"$f":"IF($B24=\"\",\"\",Structure_Ex!I24)","v":""},null,{"$f":"IF($B24=\"\",\"\",IFERROR(INDEX('quantities report'!$D$2:$D$10003,SMALL(IF('quantities report'!$A$2:$A$10003=I$6,ROW('quantities report'!$A$2:$A$10003)-1,\"\"),ROWS($B$8:$B24))),\"0\"))","v":""},{"$f":"IF($B24=\"\",\"\",Removals!$F21)","v":""},{"$f":"IF($B24=\"\",\"\",Removals!$K21)","v":""},{"$f":"IF($B24=\"\",\"\",IFERROR(INDEX('quantities report'!$D$2:$D$10003,SMALL(IF('quantities report'!$A$2:$A$10003=L$6,ROW('quantities report'!$A$2:$A$10003)-1,\"\"),ROWS($B$8:$B24))),\"0\"))","v":""},{"$f":"IF(B24=\"\",\"\",LOOKUP(B24,'manual inputs'!$B$4:$B$22,'manual inputs'!$D$4:$D$22))","v":""},"",{"$f":"IF($B24=\"\",\"\",IFERROR(INDEX('quantities report'!$D$2:$D$10003,SMALL(IF('quantities report'!$A$2:$A$10003=O$6,ROW('quantities report'!$A$2:$A$10003)-1,\"\"),ROWS($B$8:$B24))),\"0\"))","v":""},"",null,"",{"$f":"IF($B24=\"\",\"\",IFERROR(INDEX('quantities report'!$D$2:$D$10003,SMALL(IF('quantities report'!$A$2:$A$10003=S$6,ROW('quantities report'!$A$2:$A$10003)-1,\"\"),ROWS($B$8:$B24))),\"0\"))","v":""},{"$f":"IF($B24=\"\",\"\",Backfill!H24)","v":""},{"$f":"IF($B24=\"\",\"\",IFERROR(INDEX('quantities report'!$D$2:$D$10003,SMALL(IF('quantities report'!$A$2:$A$10003=U$6,ROW('quantities report'!$A$2:$A$10003)-1,\"\"),ROWS($B$8:$B24))),\"0\"))","v":""},{"$f":"IF($B24=\"\",\"\",IFERROR(INDEX('quantities report'!$D$2:$D$10003,SMALL(IF('quantities report'!$A$2:$A$10003=V$6,ROW('quantities report'!$A$2:$A$10003)-1,\"\"),ROWS($B$8:$B24))),\"0\"))","v":""},{"$f":"IF($B24=\"\",\"\",IFERROR(INDEX('quantities report'!$D$2:$D$10003,SMALL(IF('quantities report'!$A$2:$A$10003=W$6,ROW('quantities report'!$A$2:$A$10003)-1,\"\"),ROWS($B$8:$B24))),\"0\"))","v":""},{"$f":"IF($B24=\"\",\"\",IFERROR(INDEX('quantities report'!$D$2:$D$10003,SMALL(IF('quantities report'!$A$2:$A$10003=X$6,ROW('quantities report'!$A$2:$A$10003)-1,\"\"),ROWS($B$8:$B24))),\"0\"))","v":""},{"$f":"IF($B24=\"\",\"\",Backfill!R24)","v":""},{"$f":"IF($B24=\"\",\"\",Backfill!U24)","v":""},{"$f":"IF($B24=\"\",\"\",Removals!$G21)","v":""},{"$f":"IF($B24=\"\",\"\",Removals!$L21)","v":""},{"$f":"IF($B24=\"\",\"\",IFERROR(INDEX('quantities report'!$D$2:$D$10003,SMALL(IF('quantities report'!$A$2:$A$10003=AC$6,ROW('quantities report'!$A$2:$A$10003)-1,\"\"),ROWS($B$8:$B24))),\"0\"))","v":""},{"$f":"IF($B24=\"\",\"\",IFERROR(INDEX('quantities report'!$D$2:$D$10003,SMALL(IF('quantities report'!$A$2:$A$10003=AD$6,ROW('quantities report'!$A$2:$A$10003)-1,\"\"),ROWS($B$8:$B24))),\"0\"))","v":""},{"$f":"IF($B24=\"\",\"\",IFERROR(INDEX('quantities report'!$D$2:$D$10003,SMALL(IF('quantities report'!$A$2:$A$10003=AE$6,ROW('quantities report'!$A$2:$A$10003)-1,\"\"),ROWS($B$8:$B24))),\"0\"))","v":""},{"$f":"IF($B24=\"\",\"\",IFERROR(INDEX('quantities report'!$D$2:$D$10003,SMALL(IF('quantities report'!$A$2:$A$10003=AF$6,ROW('quantities report'!$A$2:$A$10003)-1,\"\"),ROWS($B$8:$B24))),\"0\"))","v":""},{"$f":"IF($B24=\"\",\"\",IFERROR(INDEX('quantities report'!$D$2:$D$10003,SMALL(IF('quantities report'!$A$2:$A$10003=AG$6,ROW('quantities report'!$A$2:$A$10003)-1,\"\"),ROWS($B$8:$B24))),\"0\"))","v":""},{"$f":"IF($B24=\"\",\"\",IFERROR(INDEX('quantities report'!$D$2:$D$10003,SMALL(IF('quantities report'!$A$2:$A$10003=AH$6,ROW('quantities report'!$A$2:$A$10003)-1,\"\"),ROWS($B$8:$B24))),\"0\"))","v":""},"","","","","",0.9,""," "]
[null,{"$f":"IFERROR(INDEX('manual inputs'!M:M,SMALL(IF('manual inputs'!M:M<>\"\",ROW('manual inputs'!M:M)),ROW(20:20))),\"\")","v":""},{"$f":"IF(B25=\"\",\"\",IFERROR(INDEX('quantities report'!$D$2:$D$10003,SMALL(IF('quantities report'!$A$2:$A$10003=C$6,ROW('quantities report'!$A$2:$A$10003)-1,\"\"),ROWS($B$8:$B25))),\"0\"))","v":""},"",null,"",{"$f":"IF($B25=\"\",\"\",Structure_Ex!I25)","v":""},null,{"$f":"IF($B25=\"\",\"\",IFERROR(INDEX('quantities report'!$D$2:$D$10003,SMALL(IF('quantities report'!$A$2:$A$10003=I$6,ROW('quantities report'!$A$2:$A$10003)-1,\"\"),ROWS($B$8:$B25))),\"0\"))","v":""},{"$f":"IF($B25=\"\",\"\",Removals!$F22)","v":""},{"$f":"IF($B25=\"\",\"\",Removals!$K22)","v":""},{"$f":"IF($B25=\"\",\"\",IFERROR(INDEX('quantities report'!$D$2:$D$10003,SMALL(IF('quantities report'!$A$2:$A$10003=L$6,ROW('quantities report'!$A$2:$A$10003)-1,\"\"),ROWS($B$8:$B25))),\"0\"))","v":""},{"$f":"IF(B25=\"\",\"\",LOOKUP(B25,'manual inputs'!$B$4:$B$22,'manual inputs'!$D$4:$D$22))","v":""},"",{"$f":"IF($B25=\"\",\"\",IFERROR(INDEX('quantities report'!$D$2:$D$10003,SMALL(IF('quantities report'!$A$2:$A$10003=O$6,ROW('quantities report'!$A$2:$A$10003)-1,\"\"),ROWS($B$8:$B25))),\"0\"))","v":""},"",null,"",{"$f":"IF($B25=\"\",\"\",IFERROR(INDEX('quantities report'!$D$2:$D$10003,SMALL(IF('quantities report'!$A$2:$A$10003=S$6,ROW('quantities report'!$A$2:$A$10003)-1,\"\"),ROWS($B$8:$B25))),\"0\"))","v":""},{"$f":"IF($B25=\"\",\"\",Backfill!H25)","v":""},{"$f":"IF($B25=\"\",\"\",IFERROR(INDEX('quantities report'!$D$2:$D$10003,SMALL(IF('quantities report'!$A$2:$A$10003=U$6,ROW('quantities report'!$A$2:$A$10003)-1,\"\"),ROWS($B$8:$B25))),\"0\"))","v":""},{"$f":"IF($B25=\"\",\"\",IFERROR(INDEX('quantities report'!$D$2:$D$10003,SMALL(IF('quantities report'!$A$2:$A$10003=V$6,ROW('quantities report'!$A$2:$A$10003)-1,\"\"),ROWS($B$8:$B25))),\"0\"))","v":""},{"$f":"IF($B25=\"\",\"\",IFERROR(INDEX('quantities report'!$D$2:$D$10003,SMALL(IF('quantities report'!$A$2:$A$10003=W$6,ROW('quantities report'!$A$2:$A$10003)-1,\"\"),ROWS($B$8:$B25))),\"0\"))","v":""},{"$f":"IF($B25=\"\",\"\",IFERROR(INDEX('quantities report'!$D$2:$D$10003,SMALL(IF('quantities report'!$A$2:$A$10003=X$6,ROW('quantities report'!$A$2:$A$10003)-1,\"\"),ROWS($B$8:$B25))),\"0\"))","v":""},{"$f":"IF($B25=\"\",\"\",Backfill!R25)","v":""},{"$f":"IF($B25=\"\",\"\",Backfill!U25)","v":""},{"$f":"IF($B25=\"\",\"\",Removals!$G22)","v":""},{"$f":"IF($B25=\"\",\"\",Removals!$L22)","v":""},{"$f":"IF($B25=\"\",\"\",IFERROR(INDEX('quantities report'!$D$2:$D$10003,SMALL(IF('quantities report'!$A$2:$A$10003=AC$6,ROW('quantities report'!$A$2:$A$10003)-1,\"\"),ROWS($B$8:$B25))),\"0\"))","v":""},{"$f":"IF($B25=\"\",\"\",IFERROR(INDEX('quantities report'!$D$2:$D$10003,SMALL(IF('quantities report'!$A$2:$A$10003=AD$6,ROW('quantities report'!$A$2:$A$10003)-1,\"\"),ROWS($B$8:$B25))),\"0\"))","v":""},{"$f":"IF($B25=\"\",\"\",IFERROR(INDEX('quantities report'!$D$2:$D$10003,SMALL(IF('quantities report'!$A$2:$A$10003=AE$6,ROW('quantities report'!$A$2:$A$10003)-1,\"\"),ROWS($B$8:$B25))),\"0\"))","v":""},{"$f":"IF($B25=\"\",\"\",IFERROR(INDEX('quantities report'!$D$2:$D$10003,SMALL(IF('quantities report'!$A$2:$A$10003=AF$6,ROW('quantities report'!$A$2:$A$10003)-1,\"\"),ROWS($B$8:$B25))),\"0\"))","v":""},{"$f":"IF($B25=\"\",\"\",IFERROR(INDEX('quantities report'!$D$2:$D$10003,SMALL(IF('quantities report'!$A$2:$A$10003=AG$6,ROW('quantities report'!$A$2:$A$10003)-1,\"\"),ROWS($B$8:$B25))),\"0\"))","v":""},{"$f":"IF($B25=\"\",\"\",IFERROR(INDEX('quantities report'!$D$2:$D$10003,SMALL(IF('quantities report'!$A$2:$A$10003=AH$6,ROW('quantities report'!$A$2:$A$10003)-1,\"\"),ROWS($B$8:$B25))),\"0\"))","v":""},"","","","","",0.9,""," "]
[null,{"$f":"IFERROR(INDEX('manual inputs'!M:M,SMALL(IF('manual inputs'!M:M<>\"\",ROW('manual inputs'!M:M)),ROW(21:21))),\"\")","v":""},{"$f":"IF(B26=\"\",\"\",IFERROR(INDEX('quantities report'!$D$2:$D$10003,SMALL(IF('quantities report'!$A$2:$A$10003=C$6,ROW('quantities report'!$A$2:$A$10003)-1,\"\"),ROWS($B$8:$B26))),\"0\"))","v":""},"",null,"",{"$f":"IF($B26=\"\",\"\",Structure_Ex!I26)","v":""},null,{"$f":"IF($B26=\"\",\"\",IFERROR(INDEX('quantities report'!$D$2:$D$10003,SMALL(IF('quantities report'!$A$2:$A$10003=I$6,ROW('quantities report'!$A$2:$A$10003)-1,\"\"),ROWS($B$8:$B26))),\"0\"))","v":""},{"$f":"IF($B26=\"\",\"\",Removals!$F23)","v":""},{"$f":"IF($B26=\"\",\"\",Removals!$K23)","v":""},{"$f":"IF($B26=\"\",\"\",IFERROR(INDEX('quantities report'!$D$2:$D$10003,SMALL(IF('quantities report'!$A$2:$A$10003=L$6,ROW('quantities report'!$A$2:$A$10003)-1,\"\"),ROWS($B$8:$B26))),\"0\"))","v":""},{"$f":"IF(B26=\"\",\"\",LOOKUP(B26,'manual inputs'!$B$4:$B$22,'manual inputs'!$D$4:$D$22))","v":""},"",{"$f":"IF($B26=\"\",\"\",IFERROR(INDEX('quantities report'!$D$2:$D$10003,SMALL(IF('quantities report'!$A$2:$A$10003=O$6,ROW('quantities report'!$A$2:$A$10003)-1,\"\"),ROWS($B$8:$B26))),\"0\"))","v":""},"",null,"",{"$f":"IF($B26=\"\",\"\",IFERROR(INDEX('quantities report'!$D$2:$D$10003,SMALL(IF('quantities report'!$A$2:$A$10003=S$6,ROW('quantities report'!$A$2:$A$10003)-1,\"\"),ROWS($B$8:$B26))),\"0\"))","v":""},{"$f":"IF($B26=\"\",\"\",Backfill!H26)","v":""},{"$f":"IF($B26=\"\",\"\",IFERROR(INDEX('quantities report'!$D$2:$D$10003,SMALL(IF('quantities report'!$A$2:$A$10003=U$6,ROW('quantities report'!$A$2:$A$10003)-1,\"\"),ROWS($B$8:$B26))),\"0\"))","v":""},{"$f":"IF($B26=\"\",\"\",IFERROR(INDEX('quantities report'!$D$2:$D$10003,SMALL(IF('quantities report'!$A$2:$A$10003=V$6,ROW('quantities report'!$A$2:$A$10003)-1,\"\"),ROWS($B$8:$B26))),\"0\"))","v":""},{"$f":"IF($B26=\"\",\"\",IFERROR(INDEX('quantities report'!$D$2:$D$10003,SMALL(IF('quantities report'!$A$2:$A$10003=W$6,ROW('quantities report'!$A$2:$A$10003)-1,\"\"),ROWS($B$8:$B26))),\"0\"))","v":""},{"$f":"IF($B26=\"\",\"\",IFERROR(INDEX('quantities report'!$D$2:$D$10003,SMALL(IF('quantities report'!$A$2:$A$10003=X$6,ROW('quantities report'!$A$2:$A$10003)-1,\"\"),ROWS($B$8:$B26))),\"0\"))","v":""},{"$f":"IF($B26=\"\",\"\",Backfill!R26)","v":""},{"$f":"IF($B26=\"\",\"\",Backfill!U26)","v":""},{"$f":"IF($B26=\"\",\"\",Removals!$G23)","v":""},{"$f":"IF($B26=\"\",\"\",Removals!$L23)","v":""},{"$f":"IF($B26=\"\",\"\",IFERROR(INDEX('quantities report'!$D$2:$D$10003,SMALL(IF('quantities report'!$A$2:$A$10003=AC$6,ROW('quantities report'!$A$2:$A$10003)-1,\"\"),ROWS($B$8:$B26))),\"0\"))","v":""},{"$f":"IF($B26=\"\",\"\",IFERROR(INDEX('quantities report'!$D$2:$D$10003,SMALL(IF('quantities report'!$A$2:$A$10003=AD$6,ROW('quantities report'!$A$2:$A$10003)-1,\"\"),ROWS($B$8:$B26))),\"0\"))","v":""},{"$f":"IF($B26=\"\",\"\",IFERROR(INDEX('quantities report'!$D$2:$D$10003,SMALL(IF('quantities report'!$A$2:$A$10003=AE$6,ROW('quantities report'!$A$2:$A$10003)-1,\"\"),ROWS($B$8:$B26))),\"0\"))","v":""},{"$f":"IF($B26=\"\",\"\",IFERROR(INDEX('quantities report'!$D$2:$D$10003,SMALL(IF('quantities report'!$A$2:$A$10003=AF$6,ROW('quantities report'!$A$2:$A$10003)-1,\"\"),ROWS($B$8:$B26))),\"0\"))","v":""},{"$f":"IF($B26=\"\",\"\",IFERROR(INDEX('quantities report'!$D$2:$D$10003,SMALL(IF('quantities report'!$A$2:$A$10003=AG$6,ROW('quantities report'!$A$2:$A$10003)-1,\"\"),ROWS($B$8:$B26))),\"0\"))","v":""},{"$f":"IF($B26=\"\",\"\",IFERROR(INDEX('quantities report'!$D$2:$D$10003,SMALL(IF('quantities report'!$A$2:$A$10003=AH$6,ROW('quantities report'!$A$2:$A$10003)-1,\"\"),ROWS($B$8:$B26))),\"0\"))","v":""},"","","","","",0.9,""," "]
[null,{"$f":"IFERROR(INDEX('manual inputs'!M:M,SMALL(IF('manual inputs'!M:M<>\"\",ROW('manual inputs'!M:M)),ROW(22:22))),\"\")","v":""},{"$f":"IF(B27=\"\",\"\",IFERROR(INDEX('quantities report'!$D$2:$D$10003,SMALL(IF('quantities report'!$A$2:$A$10003=C$6,ROW('quantities report'!$A$2:$A$10003)-1,\"\"),ROWS($B$8:$B27))),\"0\"))","v":""},"",null,"",{"$f":"IF($B27=\"\",\"\",Structure_Ex!I27)","v":""},null,{"$f":"IF($B27=\"\",\"\",IFERROR(INDEX('quantities report'!$D$2:$D$10003,SMALL(IF('quantities report'!$A$2:$A$10003=I$6,ROW('quantities report'!$A$2:$A$10003)-1,\"\"),ROWS($B$8:$B27))),\"0\"))","v":""},{"$f":"IF($B27=\"\",\"\",Removals!$F24)","v":""},{"$f":"IF($B27=\"\",\"\",Removals!$K24)","v":""},{"$f":"IF($B27=\"\",\"\",IFERROR(INDEX('quantities report'!$D$2:$D$10003,SMALL(IF('quantities report'!$A$2:$A$10003=L$6,ROW('quantities report'!$A$2:$A$10003)-1,\"\"),ROWS($B$8:$B27))),\"0\"))","v":""},{"$f":"IF(B27=\"\",\"\",LOOKUP(B27,'manual inputs'!$B$4:$B$22,'manual inputs'!$D$4:$D$22))","v":""},"",{"$f":"IF($B27=\"\",\"\",IFERROR(INDEX('quantities report'!$D$2:$D$10003,SMALL(IF('quantities report'!$A$2:$A$10003=O$6,ROW('quantities report'!$A$2:$A$10003)-1,\"\"),ROWS($B$8:$B27))),\"0\"))","v":""},"",null,"",{"$f":"IF($B27=\"\",\"\",IFERROR(INDEX('quantities report'!$D$2:$D$10003,SMALL(IF('quantities report'!$A$2:$A$10003=S$6,ROW('quantities report'!$A$2:$A$10003)-1,\"\"),ROWS($B$8:$B27))),\"0\"))","v":""},{"$f":"IF($B27=\"\",\"\",Backfill!H27)","v":""},{"$f":"IF($B27=\"\",\"\",IFERROR(INDEX('quantities report'!$D$2:$D$10003,SMALL(IF('quantities report'!$A$2:$A$10003=U$6,ROW('quantities report'!$A$2:$A$10003)-1,\"\"),ROWS($B$8:$B27))),\"0\"))","v":""},{"$f":"IF($B27=\"\",\"\",IFERROR(INDEX('quantities report'!$D$2:$D$10003,SMALL(IF('quantities report'!$A$2:$A$10003=V$6,ROW('quantities report'!$A$2:$A$10003)-1,\"\"),ROWS($B$8:$B27))),\"0\"))","v":""},{"$f":"IF($B27=\"\",\"\",IFERROR(INDEX('quantities report'!$D$2:$D$10003,SMALL(IF('quantities report'!$A$2:$A$10003=W$6,ROW('quantities report'!$A$2:$A$10003)-1,\"\"),ROWS($B$8:$B27))),\"0\"))","v":""},{"$f":"IF($B27=\"\",\"\",IFERROR(INDEX('quantities report'!$D$2:$D$10003,SMALL(IF('quantities report'!$A$2:$A$10003=X$6,ROW('quantities report'!$A$2:$A$10003)-1,\"\"),ROWS($B$8:$B27))),\"0\"))","v":""},{"$f":"IF($B27=\"\",\"\",Backfill!R27)","v":""},{"$f":"IF($B27=\"\",\"\",Backfill!U27)","v":""},{"$f":"IF($B27=\"\",\"\",Removals!$G24)","v":""},{"$f":"IF($B27=\"\",\"\",Removals!$L24)","v":""},{"$f":"IF($B27=\"\",\"\",IFERROR(INDEX('quantities report'!$D$2:$D$10003,SMALL(IF('quantities report'!$A$2:$A$10003=AC$6,ROW('quantities report'!$A$2:$A$10003)-1,\"\"),ROWS($B$8:$B27))),\"0\"))","v":""},{"$f":"IF($B27=\"\",\"\",IFERROR(INDEX('quantities report'!$D$2:$D$10003,SMALL(IF('quantities report'!$A$2:$A$10003=AD$6,ROW('quantities report'!$A$2:$A$10003)-1,\"\"),ROWS($B$8:$B27))),\"0\"))","v":""},{"$f":"IF($B27=\"\",\"\",IFERROR(INDEX('quantities report'!$D$2:$D$10003,SMALL(IF('quantities report'!$A$2:$A$10003=AE$6,ROW('quantities report'!$A$2:$A$10003)-1,\"\"),ROWS($B$8:$B27))),\"0\"))","v":""},{"$f":"IF($B27=\"\",\"\",IFERROR(INDEX('quantities report'!$D$2:$D$10003,SMALL(IF('quantities report'!$A$2:$A$10003=AF$6,ROW('quantities report'!$A$2:$A$10003)-1,\"\"),ROWS($B$8:$B27))),\"0\"))","v":""},{"$f":"IF($B27=\"\",\"\",IFERROR(INDEX('quantities report'!$D$2:$D$10003,SMALL(IF('quantities report'!$A$2:$A$10003=AG$6,ROW('quantities report'!$A$2:$A$10003)-1,\"\"),ROWS($B$8:$B27))),\"0\"))","v":""},{"$f":"IF($B27=\"\",\"\",IFERROR(INDEX('quantities report'!$D$2:$D$10003,SMALL(IF('quantities report'!$A$2:$A$10003=AH$6,ROW('quantities report'!$A$2:$A$10003)-1,\"\"),ROWS($B$8:$B27))),\"0\"))","v":""},"","","","","",0.9,""," "]
[null,{"$f":"IFERROR(INDEX('manual inputs'!M:M,SMALL(IF('manual inputs'!M:M<>\"\",ROW('manual inputs'!M:M)),ROW(23:23))),\"\")","v":""},{"$f":"IF(B28=\"\",\"\",IFERROR(INDEX('quantities report'!$D$2:$D$10003,SMALL(IF('quantities report'!$A$2:$A$10003=C$6,ROW('quantities report'!$A$2:$A$10003)-1,\"\"),ROWS($B$8:$B28))),\"0\"))","v":""},"",null,"",{"$f":"IF($B28=\"\",\"\",Structure_Ex!I28)","v":""},null,{"$f":"IF($B28=\"\",\"\",IFERROR(INDEX('quantities report'!$D$2:$D$10003,SMALL(IF('quantities report'!$A$2:$A$10003=I$6,ROW('quantities report'!$A$2:$A$10003)-1,\"\"),ROWS($B$8:$B28))),\"0\"))","v":""},{"$f":"IF($B28=\"\",\"\",Removals!$F25)","v":""},{"$f":"IF($B28=\"\",\"\",Removals!$K25)","v":""},{"$f":"IF($B28=\"\",\"\",IFERROR(INDEX('quantities report'!$D$2:$D$10003,SMALL(IF('quantities report'!$A$2:$A$10003=L$6,ROW('quantities report'!$A$2:$A$10003)-1,\"\"),ROWS($B$8:$B28))),\"0\"))","v":""},{"$f":"IF(B28=\"\",\"\",LOOKUP(B28,'manual inputs'!$B$4:$B$22,'manual inputs'!$D$4:$D$22))","v":""},"",{"$f":"IF($B28=\"\",\"\",IFERROR(INDEX('quantities report'!$D$2:$D$10003,SMALL(IF('quantities report'!$A$2:$A$10003=O$6,ROW('quantities report'!$A$2:$A$10003)-1,\"\"),ROWS($B$8:$B28))),\"0\"))","v":""},"",null,"",{"$f":"IF($B28=\"\",\"\",IFERROR(INDEX('quantities report'!$D$2:$D$10003,SMALL(IF('quantities report'!$A$2:$A$10003=S$6,ROW('quantities report'!$A$2:$A$10003)-1,\"\"),ROWS($B$8:$B28))),\"0\"))","v":""},{"$f":"IF($B28=\"\",\"\",Backfill!H28)","v":""},{"$f":"IF($B28=\"\",\"\",IFERROR(INDEX('quantities report'!$D$2:$D$10003,SMALL(IF('quantities report'!$A$2:$A$10003=U$6,ROW('quantities report'!$A$2:$A$10003)-1,\"\"),ROWS($B$8:$B28))),\"0\"))","v":""},{"$f":"IF($B28=\"\",\"\",IFERROR(INDEX('quantities report'!$D$2:$D$10003,SMALL(IF('quantities report'!$A$2:$A$10003=V$6,ROW('quantities report'!$A$2:$A$10003)-1,\"\"),ROWS($B$8:$B28))),\"0\"))","v":""},{"$f":"IF($B28=\"\",\"\",IFERROR(INDEX('quantities report'!$D$2:$D$10003,SMALL(IF('quantities report'!$A$2:$A$10003=W$6,ROW('quantities report'!$A$2:$A$10003)-1,\"\"),ROWS($B$8:$B28))),\"0\"))","v":""},{"$f":"IF($B28=\"\",\"\",IFERROR(INDEX('quantities report'!$D$2:$D$10003,SMALL(IF('quantities report'!$A$2:$A$10003=X$6,ROW('quantities report'!$A$2:$A$10003)-1,\"\"),ROWS($B$8:$B28))),\"0\"))","v":""},{"$f":"IF($B28=\"\",\"\",Backfill!R28)","v":""},{"$f":"IF($B28=\"\",\"\",Backfill!U28)","v":""},{"$f":"IF($B28=\"\",\"\",Removals!$G25)","v":""},{"$f":"IF($B28=\"\",\"\",Removals!$L25)","v":""},{"$f":"IF($B28=\"\",\"\",IFERROR(INDEX('quantities report'!$D$2:$D$10003,SMALL(IF('quantities report'!$A$2:$A$10003=AC$6,ROW('quantities report'!$A$2:$A$10003)-1,\"\"),ROWS($B$8:$B28))),\"0\"))","v":""},{"$f":"IF($B28=\"\",\"\",IFERROR(INDEX('quantities report'!$D$2:$D$10003,SMALL(IF('quantities report'!$A$2:$A$10003=AD$6,ROW('quantities report'!$A$2:$A$10003)-1,\"\"),ROWS($B$8:$B28))),\"0\"))","v":""},{"$f":"IF($B28=\"\",\"\",IFERROR(INDEX('quantities report'!$D$2:$D$10003,SMALL(IF('quantities report'!$A$2:$A$10003=AE$6,ROW('quantities report'!$A$2:$A$10003)-1,\"\"),ROWS($B$8:$B28))),\"0\"))","v":""},{"$f":"IF($B28=\"\",\"\",IFERROR(INDEX('quantities report'!$D$2:$D$10003,SMALL(IF('quantities report'!$A$2:$A$10003=AF$6,ROW('quantities report'!$A$2:$A$10003)-1,\"\"),ROWS($B$8:$B28))),\"0\"))","v":""},{"$f":"IF($B28=\"\",\"\",IFERROR(INDEX('quantities report'!$D$2:$D$10003,SMALL(IF('quantities report'!$A$2:$A$10003=AG$6,ROW('quantities report'!$A$2:$A$10003)-1,\"\"),ROWS($B$8:$B28))),\"0\"))","v":""},{"$f":"IF($B28=\"\",\"\",IFERROR(INDEX('quantities report'!$D$2:$D$10003,SMALL(IF('quantities report'!$A$2:$A$10003=AH$6,ROW('quantities report'!$A$2:$A$10003)-1,\"\"),ROWS($B$8:$B28))),\"0\"))","v":""},"","","","","",0.9,""," "]
[null,{"$f":"IFERROR(INDEX('manual inputs'!M:M,SMALL(IF('manual inputs'!M:M<>\"\",ROW('manual inputs'!M:M)),ROW(24:24))),\"\")","v":""},{"$f":"IF(B29=\"\",\"\",IFERROR(INDEX('quantities report'!$D$2:$D$10003,SMALL(IF('quantities report'!$A$2:$A$10003=C$6,ROW('quantities report'!$A$2:$A$10003)-1,\"\"),ROWS($B$8:$B29))),\"0\"))","v":""},"",null,"",{"$f":"IF($B29=\"\",\"\",Structure_Ex!I29)","v":""},null,{"$f":"IF($B29=\"\",\"\",IFERROR(INDEX('quantities report'!$D$2:$D$10003,SMALL(IF('quantities report'!$A$2:$A$10003=I$6,ROW('quantities report'!$A$2:$A$10003)-1,\"\"),ROWS($B$8:$B29))),\"0\"))","v":""},{"$f":"IF($B29=\"\",\"\",Removals!$F26)","v":""},{"$f":"IF($B29=\"\",\"\",Removals!$K26)","v":""},{"$f":"IF($B29=\"\",\"\",IFERROR(INDEX('quantities report'!$D$2:$D$10003,SMALL(IF('quantities report'!$A$2:$A$10003=L$6,ROW('quantities report'!$A$2:$A$10003)-1,\"\"),ROWS($B$8:$B29))),\"0\"))","v":""},{"$f":"IF(B29=\"\",\"\",LOOKUP(B29,'manual inputs'!$B$4:$B$22,'manual inputs'!$D$4:$D$22))","v":""},"",{"$f":"IF($B29=\"\",\"\",IFERROR(INDEX('quantities report'!$D$2:$D$10003,SMALL(IF('quantities report'!$A$2:$A$10003=O$6,ROW('quantities report'!$A$2:$A$10003)-1,\"\"),ROWS($B$8:$B29))),\"0\"))","v":""},"",null,"",{"$f":"IF($B29=\"\",\"\",IFERROR(INDEX('quantities report'!$D$2:$D$10003,SMALL(IF('quantities report'!$A$2:$A$10003=S$6,ROW('quantities report'!$A$2:$A$10003)-1,\"\"),ROWS($B$8:$B29))),\"0\"))","v":""},{"$f":"IF($B29=\"\",\"\",Backfill!H29)","v":""},{"$f":"IF($B29=\"\",\"\",IFERROR(INDEX('quantities report'!$D$2:$D$10003,SMALL(IF('quantities report'!$A$2:$A$10003=U$6,ROW('quantities report'!$A$2:$A$10003)-1,\"\"),ROWS($B$8:$B29))),\"0\"))","v":""},{"$f":"IF($B29=\"\",\"\",IFERROR(INDEX('quantities report'!$D$2:$D$10003,SMALL(IF('quantities report'!$A$2:$A$10003=V$6,ROW('quantities report'!$A$2:$A$10003)-1,\"\"),ROWS($B$8:$B29))),\"0\"))","v":""},{"$f":"IF($B29=\"\",\"\",IFERROR(INDEX('quantities report'!$D$2:$D$10003,SMALL(IF('quantities report'!$A$2:$A$10003=W$6,ROW('quantities report'!$A$2:$A$10003)-1,\"\"),ROWS($B$8:$B29))),\"0\"))","v":""},{"$f":"IF($B29=\"\",\"\",IFERROR(INDEX('quantities report'!$D$2:$D$10003,SMALL(IF('quantities report'!$A$2:$A$10003=X$6,ROW('quantities report'!$A$2:$A$10003)-1,\"\"),ROWS($B$8:$B29))),\"0\"))","v":""},{"$f":"IF($B29=\"\",\"\",Backfill!R29)","v":""},{"$f":"IF($B29=\"\",\"\",Backfill!U29)","v":""},{"$f":"IF($B29=\"\",\"\",Removals!$G26)","v":""},{"$f":"IF($B29=\"\",\"\",Removals!$L26)","v":""},{"$f":"IF($B29=\"\",\"\",IFERROR(INDEX('quantities report'!$D$2:$D$10003,SMALL(IF('quantities report'!$A$2:$A$10003=AC$6,ROW('quantities report'!$A$2:$A$10003)-1,\"\"),ROWS($B$8:$B29))),\"0\"))","v":""},{"$f":"IF($B29=\"\",\"\",IFERROR(INDEX('quantities report'!$D$2:$D$10003,SMALL(IF('quantities report'!$A$2:$A$10003=AD$6,ROW('quantities report'!$A$2:$A$10003)-1,\"\"),ROWS($B$8:$B29))),\"0\"))","v":""},{"$f":"IF($B29=\"\",\"\",IFERROR(INDEX('quantities report'!$D$2:$D$10003,SMALL(IF('quantities report'!$A$2:$A$10003=AE$6,ROW('quantities report'!$A$2:$A$10003)-1,\"\"),ROWS($B$8:$B29))),\"0\"))","v":""},{"$f":"IF($B29=\"\",\"\",IFERROR(INDEX('quantities report'!$D$2:$D$10003,SMALL(IF('quantities report'!$A$2:$A$10003=AF$6,ROW('quantities report'!$A$2:$A$10003)-1,\"\"),ROWS($B$8:$B29))),\"0\"))","v":""},{"$f":"IF($B29=\"\",\"\",IFERROR(INDEX('quantities report'!$D$2:$D$10003,SMALL(IF('quantities report'!$A$2:$A$10003=AG$6,ROW('quantities report'!$A$2:$A$10003)-1,\"\"),ROWS($B$8:$B29))),\"0\"))","v":""},{"$f":"IF($B29=\"\",\"\",IFERROR(INDEX('quantities report'!$D$2:$D$10003,SMALL(IF('quantities report'!$A$2:$A$10003=AH$6,ROW('quantities report'!$A$2:$A$10003)-1,\"\"),ROWS($B$8:$B29))),\"0\"))","v":""},"","","","","",0.9,""," "]
[null,{"$f":"IFERROR(INDEX('manual inputs'!M:M,SMALL(IF('manual inputs'!M:M<>\"\",ROW('manual inputs'!M:M)),ROW(25:25))),\"\")","v":""},{"$f":"IF(B30=\"\",\"\",IFERROR(INDEX('quantities report'!$D$2:$D$10003,SMALL(IF('quantities report'!$A$2:$A$10003=C$6,ROW('quantities report'!$A$2:$A$10003)-1,\"\"),ROWS($B$8:$B30))),\"0\"))","v":""},"",null,"",{"$f":"IF($B30=\"\",\"\",Structure_Ex!I30)","v":""},null,{"$f":"IF($B30=\"\",\"\",IFERROR(INDEX('quantities report'!$D$2:$D$10003,SMALL(IF('quantities report'!$A$2:$A$10003=I$6,ROW('quantities report'!$A$2:$A$10003)-1,\"\"),ROWS($B$8:$B30))),\"0\"))","v":""},{"$f":"IF($B30=\"\",\"\",Removals!$F27)","v":""},{"$f":"IF($B30=\"\",\"\",Removals!$K27)","v":""},{"$f":"IF($B30=\"\",\"\",IFERROR(INDEX('quantities report'!$D$2:$D$10003,SMALL(IF('quantities report'!$A$2:$A$10003=L$6,ROW('quantities report'!$A$2:$A$10003)-1,\"\"),ROWS($B$8:$B30))),\"0\"))","v":""},{"$f":"IF(B30=\"\",\"\",LOOKUP(B30,'manual inputs'!$B$4:$B$22,'manual inputs'!$D$4:$D$22))","v":""},"",{"$f":"IF($B30=\"\",\"\",IFERROR(INDEX('quantities report'!$D$2:$D$10003,SMALL(IF('quantities report'!$A$2:$A$10003=O$6,ROW('quantities report'!$A$2:$A$10003)-1,\"\"),ROWS($B$8:$B30))),\"0\"))","v":""},"",null,"",{"$f":"IF($B30=\"\",\"\",IFERROR(INDEX('quantities report'!$D$2:$D$10003,SMALL(IF('quantities report'!$A$2:$A$10003=S$6,ROW('quantities report'!$A$2:$A$10003)-1,\"\"),ROWS($B$8:$B30))),\"0\"))","v":""},{"$f":"IF($B30=\"\",\"\",Backfill!H30)","v":""},{"$f":"IF($B30=\"\",\"\",IFERROR(INDEX('quantities report'!$D$2:$D$10003,SMALL(IF('quantities report'!$A$2:$A$10003=U$6,ROW('quantities report'!$A$2:$A$10003)-1,\"\"),ROWS($B$8:$B30))),\"0\"))","v":""},{"$f":"IF($B30=\"\",\"\",IFERROR(INDEX('quantities report'!$D$2:$D$10003,SMALL(IF('quantities report'!$A$2:$A$10003=V$6,ROW('quantities report'!$A$2:$A$10003)-1,\"\"),ROWS($B$8:$B30))),\"0\"))","v":""},{"$f":"IF($B30=\"\",\"\",IFERROR(INDEX('quantities report'!$D$2:$D$10003,SMALL(IF('quantities report'!$A$2:$A$10003=W$6,ROW('quantities report'!$A$2:$A$10003)-1,\"\"),ROWS($B$8:$B30))),\"0\"))","v":""},{"$f":"IF($B30=\"\",\"\",IFERROR(INDEX('quantities report'!$D$2:$D$10003,SMALL(IF('quantities report'!$A$2:$A$10003=X$6,ROW('quantities report'!$A$2:$A$10003)-1,\"\"),ROWS($B$8:$B30))),\"0\"))","v":""},{"$f":"IF($B30=\"\",\"\",Backfill!R30)","v":""},{"$f":"IF($B30=\"\",\"\",Backfill!U30)","v":""},{"$f":"IF($B30=\"\",\"\",Removals!$G27)","v":""},{"$f":"IF($B30=\"\",\"\",Removals!$L27)","v":""},{"$f":"IF($B30=\"\",\"\",IFERROR(INDEX('quantities report'!$D$2:$D$10003,SMALL(IF('quantities report'!$A$2:$A$10003=AC$6,ROW('quantities report'!$A$2:$A$10003)-1,\"\"),ROWS($B$8:$B30))),\"0\"))","v":""},{"$f":"IF($B30=\"\",\"\",IFERROR(INDEX('quantities report'!$D$2:$D$10003,SMALL(IF('quantities report'!$A$2:$A$10003=AD$6,ROW('quantities report'!$A$2:$A$10003)-1,\"\"),ROWS($B$8:$B30))),\"0\"))","v":""},{"$f":"IF($B30=\"\",\"\",IFERROR(INDEX('quantities report'!$D$2:$D$10003,SMALL(IF('quantities report'!$A$2:$A$10003=AE$6,ROW('quantities report'!$A$2:$A$10003)-1,\"\"),ROWS($B$8:$B30))),\"0\"))","v":""},{"$f":"IF($B30=\"\",\"\",IFERROR(INDEX('quantities report'!$D$2:$D$10003,SMALL(IF('quantities report'!$A$2:$A$10003=AF$6,ROW('quantities report'!$A$2:$A$10003)-1,\"\"),ROWS($B$8:$B30))),\"0\"))","v":""},{"$f":"IF($B30=\"\",\"\",IFERROR(INDEX('quantities report'!$D$2:$D$10003,SMALL(IF('quantities report'!$A$2:$A$10003=AG$6,ROW('quantities report'!$A$2:$A$10003)-1,\"\"),ROWS($B$8:$B30))),\"0\"))","v":""},{"$f":"IF($B30=\"\",\"\",IFERROR(INDEX('quantities report'!$D$2:$D$10003,SMALL(IF('quantities report'!$A$2:$A$10003=AH$6,ROW('quantities report'!$A$2:$A$10003)-1,\"\"),ROWS($B$8:$B30))),\"0\"))","v":""},"","","","","",0.9,""," "]
[null,{"$f":"IFERROR(INDEX('manual inputs'!M:M,SMALL(IF('manual inputs'!M:M<>\"\",ROW('manual inputs'!M:M)),ROW(27:27))),\"\")","v":""},{"$f":"IF(B31=\"\",\"\",IFERROR(INDEX('quantities report'!$D$2:$D$10003,SMALL(IF('quantities report'!$A$2:$A$10003=C$6,ROW('quantities report'!$A$2:$A$10003)-1,\"\"),ROWS($B$8:$B31))),\"0\"))","v":""},"",null,"",{"$f":"IF($B31=\"\",\"\",Structure_Ex!I31)","v":""},null,{"$f":"IF($B31=\"\",\"\",IFERROR(INDEX('quantities report'!$D$2:$D$10003,SMALL(IF('quantities report'!$A$2:$A$10003=I$6,ROW('quantities report'!$A$2:$A$10003)-1,\"\"),ROWS($B$8:$B31))),\"0\"))","v":""},{"$f":"IF($B31=\"\",\"\",Removals!$F28)","v":""},{"$f":"IF($B31=\"\",\"\",Removals!$K28)","v":""},{"$f":"IF($B31=\"\",\"\",IFERROR(INDEX('quantities report'!$D$2:$D$10003,SMALL(IF('quantities report'!$A$2:$A$10003=L$6,ROW('quantities report'!$A$2:$A$10003)-1,\"\"),ROWS($B$8:$B31))),\"0\"))","v":""},{"$f":"IF(B31=\"\",\"\",LOOKUP(B31,'manual inputs'!$B$4:$B$22,'manual inputs'!$D$4:$D$22))","v":""},"",{"$f":"IF($B31=\"\",\"\",IFERROR(INDEX('quantities report'!$D$2:$D$10003,SMALL(IF('quantities report'!$A$2:$A$10003=O$6,ROW('quantities report'!$A$2:$A$10003)-1,\"\"),ROWS($B$8:$B31))),\"0\"))","v":""},"",null,"",{"$f":"IF($B31=\"\",\"\",IFERROR(INDEX('quantities report'!$D$2:$D$10003,SMALL(IF('quantities report'!$A$2:$A$10003=S$6,ROW('quantities report'!$A$2:$A$10003)-1,\"\"),ROWS($B$8:$B31))),\"0\"))","v":""},{"$f":"IF($B31=\"\",\"\",Backfill!H31)","v":""},{"$f":"IF($B31=\"\",\"\",IFERROR(INDEX('quantities report'!$D$2:$D$10003,SMALL(IF('quantities report'!$A$2:$A$10003=U$6,ROW('quantities report'!$A$2:$A$10003)-1,\"\"),ROWS($B$8:$B31))),\"0\"))","v":""},{"$f":"IF($B31=\"\",\"\",IFERROR(INDEX('quantities report'!$D$2:$D$10003,SMALL(IF('quantities report'!$A$2:$A$10003=V$6,ROW('quantities report'!$A$2:$A$10003)-1,\"\"),ROWS($B$8:$B31))),\"0\"))","v":""},{"$f":"IF($B31=\"\",\"\",IFERROR(INDEX('quantities report'!$D$2:$D$10003,SMALL(IF('quantities report'!$A$2:$A$10003=W$6,ROW('quantities report'!$A$2:$A$10003)-1,\"\"),ROWS($B$8:$B31))),\"0\"))","v":""},{"$f":"IF($B31=\"\",\"\",IFERROR(INDEX('quantities report'!$D$2:$D$10003,SMALL(IF('quantities report'!$A$2:$A$10003=X$6,ROW('quantities report'!$A$2:$A$10003)-1,\"\"),ROWS($B$8:$B31))),\"0\"))","v":""},{"$f":"IF($B31=\"\",\"\",Backfill!R31)","v":""},{"$f":"IF($B31=\"\",\"\",Backfill!U31)","v":""},{"$f":"IF($B31=\"\",\"\",Removals!$G28)","v":""},{"$f":"IF($B31=\"\",\"\",Removals!$L28)","v":""},{"$f":"IF($B31=\"\",\"\",IFERROR(INDEX('quantities report'!$D$2:$D$10003,SMALL(IF('quantities report'!$A$2:$A$10003=AC$6,ROW('quantities report'!$A$2:$A$10003)-1,\"\"),ROWS($B$8:$B31))),\"0\"))","v":""},{"$f":"IF($B31=\"\",\"\",IFERROR(INDEX('quantities report'!$D$2:$D$10003,SMALL(IF('quantities report'!$A$2:$A$10003=AD$6,ROW('quantities report'!$A$2:$A$10003)-1,\"\"),ROWS($B$8:$B31))),\"0\"))","v":""},{"$f":"IF($B31=\"\",\"\",IFERROR(INDEX('quantities report'!$D$2:$D$10003,SMALL(IF('quantities report'!$A$2:$A$10003=AE$6,ROW('quantities report'!$A$2:$A$10003)-1,\"\"),ROWS($B$8:$B31))),\"0\"))","v":""},{"$f":"IF($B31=\"\",\"\",IFERROR(INDEX('quantities report'!$D$2:$D$10003,SMALL(IF('quantities report'!$A$2:$A$10003=AF$6,ROW('quantities report'!$A$2:$A$10003)-1,\"\"),ROWS($B$8:$B31))),\"0\"))","v":""},{"$f":"IF($B31=\"\",\"\",IFERROR(INDEX('quantities report'!$D$2:$D$10003,SMALL(IF('quantities report'!$A$2:$A$10003=AG$6,ROW('quantities report'!$A$2:$A$10003)-1,\"\"),ROWS($B$8:$B31))),\"0\"))","v":""},{"$f":"IF($B31=\"\",\"\",IFERROR(INDEX('quantities report'!$D$2:$D$10003,SMALL(IF('quantities report'!$A$2:$A$10003=AH$6,ROW('quantities report'!$A$2:$A$10003)-1,\"\"),ROWS($B$8:$B31))),\"0\"))","v":""},"","","","","",0.9,""," "]
[null,{"$f":"IFERROR(INDEX(#REF!,SMALL(IF(#REF!<>\"\",ROW(#REF!)),ROW(27:27))),\"\")","v":""}]

{"sheet":"Removals","index":5,"n_rows":28,"n_cols":12,"rows_kept":28,"cut":false,"hidden":false,"merged":[]}
[]
[null,"TOTALS",{"$f":"SUM(C5:C28)","v":0},0,0,0,0,{"$f":"SUM(H5:H28)","v":0},{"$f":"SUM(I5:I28)","v":0},0,{"$f":"SUM(K5:K28)","v":0},0]
[null,"Station","Pavement Removed","Pavement Removed/Replaced","Total",null,null,"Topsoil Removed","Topsoil Removed/Replaced","Total"]
[null,null,"Exist Pvmt Layer 1 (removed): ","Exist Pvmt Layer 1 (removed and replaced): ","Total Exist Pvmt Layer 1: ","Pavement Removed","Pavement Removed/Replaced","Exist Topsoil (removed): ","Exist Topsoil (removed and replaced):","Total Exist Topsoil: ","Topsoil Removed","Topsoil Removed/Replaced"]
[null,{"$f":"IFERROR(INDEX('manual inputs'!M:M,SMALL(IF('manual inputs'!M:M<>\"\",ROW('manual inputs'!M:M)),ROW(3:3))),\"\")","v":""},{"$f":"IF($B5=\"\",\"\",VALUE(IFERROR(INDEX('quantities report'!$D$2:$D$10003,SMALL(IF('quantities report'!$A$2:$A$10003=C$4,ROW('quantities report'!$A$2:$A$10003)-1,\"\"),ROWS($B$5:$B5))),\"0\")))","v":""},{"$f":"IF($B5=\"\",\"\",VALUE(IFERROR(INDEX('quantities report'!$D$2:$D$10003,SMALL(IF('quantities report'!$A$2:$A$10003=D$4,ROW('quantities report'!$A$2:$A$10003)-1,\"\"),ROWS($B$5:$B5))),\"0\")))","v":""},{"$f":"IF($B5=\"\",\"\",VALUE(IFERROR(INDEX('quantities report'!$D$2:$D$10003,SMALL(IF('quantities report'!$A$2:$A$10003=E$4,ROW('quantities report'!$A$2:$A$10003)-1,\"\"),ROWS($B$5:$B5))),\"0\")))","v":""},{"$f":"IF(C5=0,(E5-D5),C5)","v":""},{"$f":"IF(D5=0,(E5-C5),D5)","v":""},{"$f":"IF($B5=\"\",\"\",IFERROR(INDEX('quantities report'!$D$2:$D$10003,SMALL(IF('quantities report'!$A$2:$A$10003=H$4,ROW('quantities report'!$A$2:$A$10003)-1,\"\"),ROWS($B$5:$B5))),\"0\"))","v":""},{"$f":"IF($B5=\"\",\"\",VALUE(IFERROR(INDEX('quantities report'!$D$2:$D$10003,SMALL(IF('quantities report'!$A$2:$A$10003=I$4,ROW('quantities report'!$A$2:$A$10003)-1,\"\"),ROWS($B$5:$B5))),\"0\")))","v":""},{"$f":"IF($B5=\"\",\"\",VALUE(IFERROR(INDEX('quantities report'!$D$2:$D$10003,SMALL(IF('quantities report'!$A$2:$A$10003=J$4,ROW('quantities report'!$A$2:$A$10003)-1,\"\"),ROWS($B$5:$B5))),\"0\")))","v":""},{"$f":"IF(H5=0,(J5-I5),H5)","v":""},{"$f":"IF(I5=0,(J5-H5),I5)","v":""}]
[null,{"$f":"IFERROR(INDEX('manual inputs'!M:M,SMALL(IF('manual inputs'!M:M<>\"\",ROW('manual inputs'!M:M)),ROW(4:4))),\"\")","v":""},{"$f":"IF($B6=\"\",\"\",VALUE(IFERROR(INDEX('quantities report'!$D$2:$D$10003,SMALL(IF('quantities report'!$A$2:$A$10003=C$4,ROW('quantities report'!$A$2:$A$10003)-1,\"\"),ROWS($B$5:$B6))),\"0\")))","v":""},{"$f":"IF($B6=\"\",\"\",VALUE(IFERROR(INDEX('quantities report'!$D$2:$D$10003,SMALL(IF('quantities report'!$A$2:$A$10003=D$4,ROW('quantities report'!$A$2:$A$10003)-1,\"\"),ROWS($B$5:$B6))),\"0\")))","v":""},{"$f":"IF($B6=\"\",\"\",VALUE(IFERROR(INDEX('quantities report'!$D$2:$D$10003,SMALL(IF('quantities report'!$A$2:$A$10003=E$4,ROW('quantities report'!$A$2:$A$10003)-1,\"\"),ROWS($B$5:$B6))),\"0\")))","v":""},{"$f":"IF(C6=0,(E6-D6),C6)","v":""},{"$f":"IF(D6=0,(E6-C6),D6)","v":""},{"$f":"IF($B6=\"\",\"\",IFERROR(INDEX('quantities report'!$D$2:$D$10003,SMALL(IF('quantities report'!$A$2:$A$10003=H$4,ROW('quantities report'!$A$2:$A$10003)-1,\"\"),ROWS($B$5:$B6))),\"0\"))","v":""},{"$f":"IF($B6=\"\",\"\",VALUE(IFERROR(INDEX('quantities report'!$D$2:$D$10003,SMALL(IF('quantities report'!$A$2:$A$10003=I$4,ROW('quantities report'!$A$2:$A$10003)-1,\"\"),ROWS($B$5:$B10))),\"0\")))","v":""},{"$f":"IF($B6=\"\",\"\",VALUE(IFERROR(INDEX('quantities report'!$D$2:$D$10003,SMALL(IF('quantities report'!$A$2:$A$10003=J$4,ROW('quantities report'!$A$2:$A$10003)-1,\"\"),ROWS($B$5:$B6))),\"0\")))","v":""},{"$f":"IF(H6=0,(J6-I6),H6)","v":""},{"$f":"IF(I6=0,(J6-H6),I6)","v":""}]
[null,{"$f":"IFERROR(INDEX('manual inputs'!M:M,SMALL(IF('manual inputs'!M:M<>\"\",ROW('manual inputs'!M:M)),ROW(5:5))),\"\")","v":""},{"$f":"IF($B7=\"\",\"\",VALUE(IFERROR(INDEX('quantities report'!$D$2:$D$10003,SMALL(IF('quantities report'!$A$2:$A$10003=C$4,ROW('quantities report'!$A$2:$A$10003)-1,\"\"),ROWS($B$6:$B8))),\"0\")))","v":""},{"$f":"IF($B7=\"\",\"\",VALUE(IFERROR(INDEX('quantities report'!$D$2:$D$10003,SMALL(IF('quantities report'!$A$2:$A$10003=D$4,ROW('quantities report'!$A$2:$A$10003)-1,\"\"),ROWS($B$5:$B6))),\"0\")))","v":""},{"$f":"IF($B7=\"\",\"\",VALUE(IFERROR(INDEX('quantities report'!$D$2:$D$10003,SMALL(IF('quantities report'!$A$2:$A$10003=E$4,ROW('quantities report'!$A$2:$A$10003)-1,\"\"),ROWS($B$9:$B11))),\"0\")))","v":""},"","",{"$f":"IF($B7=\"\",\"\",IFERROR(INDEX('quantities report'!$D$2:$D$10003,SMALL(IF('quantities report'!$A$2:$A$10003=H$4,ROW('quantities report'!$A$2:$A$10003)-1,\"\"),ROWS($B$9:$B11))),\"0\"))","v":""},{"$f":"IF($B7=\"\",\"\",VALUE(IFERROR(INDEX('quantities report'!$D$2:$D$10003,SMALL(IF('quantities report'!$A$2:$A$10003=I$4,ROW('quantities report'!$A$2:$A$10003)-1,\"\"),ROWS($B$9:$B11))),\"0\")))","v":""},{"$f":"IF($B7=\"\",\"\",VALUE(IFERROR(INDEX('quantities report'!$D$2:$D$10003,SMALL(IF('quantities report'!$A$2:$A$10003=J$4,ROW('quantities report'!$A$2:$A$10003)-1,\"\"),ROWS($B$9:$B11))),\"0\")))","v":""},"",""]
[null,{"$f":"IFERROR(INDEX('manual inputs'!M:M,SMALL(IF('manual inputs'!M:M<>\"\",ROW('manual inputs'!M:M)),ROW(6:6))),\"\")","v":""},{"$f":"IF($B8=\"\",\"\",VALUE(IFERROR(INDEX('quantities report'!$D$2:$D$10003,SMALL(IF('quantities report'!$A$2:$A$10003=C$4,ROW('quantities report'!$A$2:$A$10003)-1,\"\"),ROWS($B$6:$B9))),\"0\")))","v":""},{"$f":"IF($B8=\"\",\"\",VALUE(IFERROR(INDEX('quantities report'!$D$2:$D$10003,SMALL(IF('quantities report'!$A$2:$A$10003=D$4,ROW('quantities report'!$A$2:$A$10003)-1,\"\"),ROWS($B$5:$B7))),\"0\")))","v":""},{"$f":"IF($B8=\"\",\"\",VALUE(IFERROR(INDEX('quantities report'!$D$2:$D$10003,SMALL(IF('quantities report'!$A$2:$A$10003=E$4,ROW('quantities report'!$A$2:$A$10003)-1,\"\"),ROWS($B$9:$B12))),\"0\")))","v":""},"","",{"$f":"IF($B8=\"\",\"\",IFERROR(INDEX('quantities report'!$D$2:$D$10003,SMALL(IF('quantities report'!$A$2:$A$10003=H$4,ROW('quantities report'!$A$2:$A$10003)-1,\"\"),ROWS($B$9:$B12))),\"0\"))","v":""},{"$f":"IF($B8=\"\",\"\",VALUE(IFERROR(INDEX('quantities report'!$D$2:$D$10003,SMALL(IF('quantities report'!$A$2:$A$10003=I$4,ROW('quantities report'!$A$2:$A$10003)-1,\"\"),ROWS($B$9:$B12))),\"0\")))","v":""},{"$f":"IF($B8=\"\",\"\",VALUE(IFERROR(INDEX('quantities report'!$D$2:$D$10003,SMALL(IF('quantities report'!$A$2:$A$10003=J$4,ROW('quantities report'!$A$2:$A$10003)-1,\"\"),ROWS($B$9:$B12))),\"0\")))","v":""},"",""]
[null,{"$f":"IFERROR(INDEX('manual inputs'!M:M,SMALL(IF('manual inputs'!M:M<>\"\",ROW('manual inputs'!M:M)),ROW(7:7))),\"\")","v":""},{"$f":"IF($B9=\"\",\"\",VALUE(IFERROR(INDEX('quantities report'!$D$2:$D$10003,SMALL(IF('quantities report'!$A$2:$A$10003=C$4,ROW('quantities report'!$A$2:$A$10003)-1,\"\"),ROWS($B$6:$B10))),\"0\")))","v":""},{"$f":"IF($B9=\"\",\"\",VALUE(IFERROR(INDEX('quantities report'!$D$2:$D$10003,SMALL(IF('quantities report'!$A$2:$A$10003=D$4,ROW('quantities report'!$A$2:$A$10003)-1,\"\"),ROWS($B$5:$B8))),\"0\")))","v":""},{"$f":"IF($B9=\"\",\"\",VALUE(IFERROR(INDEX('quantities report'!$D$2:$D$10003,SMALL(IF('quantities report'!$A$2:$A$10003=E$4,ROW('quantities report'!$A$2:$A$10003)-1,\"\"),ROWS($B$9:$B13))),\"0\")))","v":""},"","",{"$f":"IF($B9=\"\",\"\",IFERROR(INDEX('quantities report'!$D$2:$D$10003,SMALL(IF('quantities report'!$A$2:$A$10003=H$4,ROW('quantities report'!$A$2:$A$10003)-1,\"\"),ROWS($B$9:$B13))),\"0\"))","v":""},{"$f":"IF($B9=\"\",\"\",VALUE(IFERROR(INDEX('quantities report'!$D$2:$D$10003,SMALL(IF('quantities report'!$A$2:$A$10003=I$4,ROW('quantities report'!$A$2:$A$10003)-1,\"\"),ROWS($B$9:$B13))),\"0\")))","v":""},{"$f":"IF($B9=\"\",\"\",VALUE(IFERROR(INDEX('quantities report'!$D$2:$D$10003,SMALL(IF('quantities report'!$A$2:$A$10003=J$4,ROW('quantities report'!$A$2:$A$10003)-1,\"\"),ROWS($B$9:$B13))),\"0\")))","v":""},"",""]
[null,{"$f":"IFERROR(INDEX('manual inputs'!M:M,SMALL(IF('manual inputs'!M:M<>\"\",ROW('manual inputs'!M:M)),ROW(8:8))),\"\")","v":""},{"$f":"IF($B10=\"\",\"\",VALUE(IFERROR(INDEX('quantities report'!$D$2:$D$10003,SMALL(IF('quantities report'!$A$2:$A$10003=C$4,ROW('quantities report'!$A$2:$A$10003)-1,\"\"),ROWS($B$6:$B11))),\"0\")))","v":""},{"$f":"IF($B10=\"\",\"\",VALUE(IFERROR(INDEX('quantities report'!$D$2:$D$10003,SMALL(IF('quantities report'!$A$2:$A$10003=D$4,ROW('quantities report'!$A$2:$A$10003)-1,\"\"),ROWS($B$5:$B9))),\"0\")))","v":""},{"$f":"IF($B10=\"\",\"\",VALUE(IFERROR(INDEX('quantities report'!$D$2:$D$10003,SMALL(IF('quantities report'!$A$2:$A$10003=E$4,ROW('quantities report'!$A$2:$A$10003)-1,\"\"),ROWS($B$9:$B14))),\"0\")))","v":""},"","",{"$f":"IF($B10=\"\",\"\",IFERROR(INDEX('quantities report'!$D$2:$D$10003,SMALL(IF('quantities report'!$A$2:$A$10003=H$4,ROW('quantities report'!$A$2:$A$10003)-1,\"\"),ROWS($B$9:$B14))),\"0\"))","v":""},{"$f":"IF($B10=\"\",\"\",VALUE(IFERROR(INDEX('quantities report'!$D$2:$D$10003,SMALL(IF('quantities report'!$A$2:$A$10003=I$4,ROW('quantities report'!$A$2:$A$10003)-1,\"\"),ROWS($B$9:$B14))),\"0\")))","v":""},{"$f":"IF($B10=\"\",\"\",VALUE(IFERROR(INDEX('quantities report'!$D$2:$D$10003,SMALL(IF('quantities report'!$A$2:$A$10003=J$4,ROW('quantities report'!$A$2:$A$10003)-1,\"\"),ROWS($B$9:$B14))),\"0\")))","v":""},"",""]
[null,{"$f":"IFERROR(INDEX('manual inputs'!M:M,SMALL(IF('manual inputs'!M:M<>\"\",ROW('manual inputs'!M:M)),ROW(9:9))),\"\")","v":""},{"$f":"IF($B11=\"\",\"\",VALUE(IFERROR(INDEX('quantities report'!$D$2:$D$10003,SMALL(IF('quantities report'!$A$2:$A$10003=C$4,ROW('quantities report'!$A$2:$A$10003)-1,\"\"),ROWS($B$6:$B12))),\"0\")))","v":""},{"$f":"IF($B11=\"\",\"\",VALUE(IFERROR(INDEX('quantities report'!$D$2:$D$10003,SMALL(IF('quantities report'!$A$2:$A$10003=D$4,ROW('quantities report'!$A$2:$A$10003)-1,\"\"),ROWS($B$5:$B10))),\"0\")))","v":""},{"$f":"IF($B11=\"\",\"\",VALUE(IFERROR(INDEX('quantities report'!$D$2:$D$10003,SMALL(IF('quantities report'!$A$2:$A$10003=E$4,ROW('quantities report'!$A$2:$A$10003)-1,\"\"),ROWS($B$9:$B15))),\"0\")))","v":""},"","",{"$f":"IF($B11=\"\",\"\",IFERROR(INDEX('quantities report'!$D$2:$D$10003,SMALL(IF('quantities report'!$A$2:$A$10003=H$4,ROW('quantities report'!$A$2:$A$10003)-1,\"\"),ROWS($B$9:$B15))),\"0\"))","v":""},{"$f":"IF($B11=\"\",\"\",VALUE(IFERROR(INDEX('quantities report'!$D$2:$D$10003,SMALL(IF('quantities report'!$A$2:$A$10003=I$4,ROW('quantities report'!$A$2:$A$10003)-1,\"\"),ROWS($B$9:$B15))),\"0\")))","v":""},{"$f":"IF($B11=\"\",\"\",VALUE(IFERROR(INDEX('quantities report'!$D$2:$D$10003,SMALL(IF('quantities report'!$A$2:$A$10003=J$4,ROW('quantities report'!$A$2:$A$10003)-1,\"\"),ROWS($B$9:$B15))),\"0\")))","v":""},"",""]
[null,{"$f":"IFERROR(INDEX('manual inputs'!M:M,SMALL(IF('manual inputs'!M:M<>\"\",ROW('manual inputs'!M:M)),ROW(10:10))),\"\")","v":""},{"$f":"IF($B12=\"\",\"\",VALUE(IFERROR(INDEX('quantities report'!$D$2:$D$10003,SMALL(IF('quantities report'!$A$2:$A$10003=C$4,ROW('quantities report'!$A$2:$A$10003)-1,\"\"),ROWS($B$6:$B13))),\"0\")))","v":""},{"$f":"IF($B12=\"\",\"\",VALUE(IFERROR(INDEX('quantities report'!$D$2:$D$10003,SMALL(IF('quantities report'!$A$2:$A$10003=D$4,ROW('quantities report'!$A$2:$A$10003)-1,\"\"),ROWS($B$5:$B11))),\"0\")))","v":""},{"$f":"IF($B12=\"\",\"\",VALUE(IFERROR(INDEX('quantities report'!$D$2:$D$10003,SMALL(IF('quantities report'!$A$2:$A$10003=E$4,ROW('quantities report'!$A$2:$A$10003)-1,\"\"),ROWS($B$9:$B16))),\"0\")))","v":""},"","",{"$f":"IF($B12=\"\",\"\",IFERROR(INDEX('quantities report'!$D$2:$D$10003,SMALL(IF('quantities report'!$A$2:$A$10003=H$4,ROW('quantities report'!$A$2:$A$10003)-1,\"\"),ROWS($B$9:$B16))),\"0\"))","v":""},{"$f":"IF($B12=\"\",\"\",VALUE(IFERROR(INDEX('quantities report'!$D$2:$D$10003,SMALL(IF('quantities report'!$A$2:$A$10003=I$4,ROW('quantities report'!$A$2:$A$10003)-1,\"\"),ROWS($B$9:$B16))),\"0\")))","v":""},{"$f":"IF($B12=\"\",\"\",VALUE(IFERROR(INDEX('quantities report'!$D$2:$D$10003,SMALL(IF('quantities report'!$A$2:$A$10003=J$4,ROW('quantities report'!$A$2:$A$10003)-1,\"\"),ROWS($B$9:$B16))),\"0\")))","v":""},"",""]
[null,{"$f":"IFERROR(INDEX('manual inputs'!M:M,SMALL(IF('manual inputs'!M:M<>\"\",ROW('manual inputs'!M:M)),ROW(11:11))),\"\")","v":""},{"$f":"IF($B13=\"\",\"\",VALUE(IFERROR(INDEX('quantities report'!$D$2:$D$10003,SMALL(IF('quantities report'!$A$2:$A$10003=C$4,ROW('quantities report'!$A$2:$A$10003)-1,\"\"),ROWS($B$6:$B14))),\"0\")))","v":""},{"$f":"IF($B13=\"\",\"\",VALUE(IFERROR(INDEX('quantities report'!$D$2:$D$10003,SMALL(IF('quantities report'!$A$2:$A$10003=D$4,ROW('quantities report'!$A$2:$A$10003)-1,\"\"),ROWS($B$5:$B12))),\"0\")))","v":""},{"$f":"IF($B13=\"\",\"\",VALUE(IFERROR(INDEX('quantities report'!$D$2:$D$10003,SMALL(IF('quantities report'!$A$2:$A$10003=E$4,ROW('quantities report'!$A$2:$A$10003)-1,\"\"),ROWS($B$9:$B17))),\"0\")))","v":""},"","",{"$f":"IF($B13=\"\",\"\",IFERROR(INDEX('quantities report'!$D$2:$D$10003,SMALL(IF('quantities report'!$A$2:$A$10003=H$4,ROW('quantities report'!$A$2:$A$10003)-1,\"\"),ROWS($B$9:$B17))),\"0\"))","v":""},{"$f":"IF($B13=\"\",\"\",VALUE(IFERROR(INDEX('quantities report'!$D$2:$D$10003,SMALL(IF('quantities report'!$A$2:$A$10003=I$4,ROW('quantities report'!$A$2:$A$10003)-1,\"\"),ROWS($B$9:$B17))),\"0\")))","v":""},{"$f":"IF($B13=\"\",\"\",VALUE(IFERROR(INDEX('quantities report'!$D$2:$D$10003,SMALL(IF('quantities report'!$A$2:$A$10003=J$4,ROW('quantities report'!$A$2:$A$10003)-1,\"\"),ROWS($B$9:$B17))),\"0\")))","v":""},"",""]
[null,{"$f":"IFERROR(INDEX('manual inputs'!M:M,SMALL(IF('manual inputs'!M:M<>\"\",ROW('manual inputs'!M:M)),ROW(12:12))),\"\")","v":""},{"$f":"IF($B14=\"\",\"\",VALUE(IFERROR(INDEX('quantities report'!$D$2:$D$10003,SMALL(IF('quantities report'!$A$2:$A$10003=C$4,ROW('quantities report'!$A$2:$A$10003)-1,\"\"),ROWS($B$6:$B15))),\"0\")))","v":""},{"$f":"IF($B14=\"\",\"\",VALUE(IFERROR(INDEX('quantities report'!$D$2:$D$10003,SMALL(IF('quantities report'!$A$2:$A$10003=D$4,ROW('quantities report'!$A$2:$A$10003)-1,\"\"),ROWS($B$5:$B13))),\"0\")))","v":""},{"$f":"IF($B14=\"\",\"\",VALUE(IFERROR(INDEX('quantities report'!$D$2:$D$10003,SMALL(IF('quantities report'!$A$2:$A$10003=E$4,ROW('quantities report'!$A$2:$A$10003)-1,\"\"),ROWS($B$9:$B18))),\"0\")))","v":""},"","",{"$f":"IF($B14=\"\",\"\",IFERROR(INDEX('quantities report'!$D$2:$D$10003,SMALL(IF('quantities report'!$A$2:$A$10003=H$4,ROW('quantities report'!$A$2:$A$10003)-1,\"\"),ROWS($B$9:$B18))),\"0\"))","v":""},{"$f":"IF($B14=\"\",\"\",VALUE(IFERROR(INDEX('quantities report'!$D$2:$D$10003,SMALL(IF('quantities report'!$A$2:$A$10003=I$4,ROW('quantities report'!$A$2:$A$10003)-1,\"\"),ROWS($B$9:$B18))),\"0\")))","v":""},{"$f":"IF($B14=\"\",\"\",VALUE(IFERROR(INDEX('quantities report'!$D$2:$D$10003,SMALL(IF('quantities report'!$A$2:$A$10003=J$4,ROW('quantities report'!$A$2:$A$10003)-1,\"\"),ROWS($B$9:$B18))),\"0\")))","v":""},"",""]
[null,{"$f":"IFERROR(INDEX('manual inputs'!M:M,SMALL(IF('manual inputs'!M:M<>\"\",ROW('manual inputs'!M:M)),ROW(13:13))),\"\")","v":""},{"$f":"IF($B15=\"\",\"\",VALUE(IFERROR(INDEX('quantities report'!$D$2:$D$10003,SMALL(IF('quantities report'!$A$2:$A$10003=C$4,ROW('quantities report'!$A$2:$A$10003)-1,\"\"),ROWS($B$6:$B16))),\"0\")))","v":""},{"$f":"IF($B15=\"\",\"\",VALUE(IFERROR(INDEX('quantities report'!$D$2:$D$10003,SMALL(IF('quantities report'!$A$2:$A$10003=D$4,ROW('quantities report'!$A$2:$A$10003)-1,\"\"),ROWS($B$5:$B14))),\"0\")))","v":""},{"$f":"IF($B15=\"\",\"\",VALUE(IFERROR(INDEX('quantities report'!$D$2:$D$10003,SMALL(IF('quantities report'!$A$2:$A$10003=E$4,ROW('quantities report'!$A$2:$A$10003)-1,\"\"),ROWS($B$9:$B19))),\"0\")))","v":""},"","",{"$f":"IF($B15=\"\",\"\",IFERROR(INDEX('quantities report'!$D$2:$D$10003,SMALL(IF('quantities report'!$A$2:$A$10003=H$4,ROW('quantities report'!$A$2:$A$10003)-1,\"\"),ROWS($B$9:$B19))),\"0\"))","v":""},{"$f":"IF($B15=\"\",\"\",VALUE(IFERROR(INDEX('quantities report'!$D$2:$D$10003,SMALL(IF('quantities report'!$A$2:$A$10003=I$4,ROW('quantities report'!$A$2:$A$10003)-1,\"\"),ROWS($B$9:$B19))),\"0\")))","v":""},{"$f":"IF($B15=\"\",\"\",VALUE(IFERROR(INDEX('quantities report'!$D$2:$D$10003,SMALL(IF('quantities report'!$A$2:$A$10003=J$4,ROW('quantities report'!$A$2:$A$10003)-1,\"\"),ROWS($B$9:$B19))),\"0\")))","v":""},"",""]
[null,{"$f":"IFERROR(INDEX('manual inputs'!M:M,SMALL(IF('manual inputs'!M:M<>\"\",ROW('manual inputs'!M:M)),ROW(14:14))),\"\")","v":""},{"$f":"IF($B16=\"\",\"\",VALUE(IFERROR(INDEX('quantities report'!$D$2:$D$10003,SMALL(IF('quantities report'!$A$2:$A$10003=C$4,ROW('quantities report'!$A$2:$A$10003)-1,\"\"),ROWS($B$6:$B17))),\"0\")))","v":""},{"$f":"IF($B16=\"\",\"\",VALUE(IFERROR(INDEX('quantities report'!$D$2:$D$10003,SMALL(IF('quantities report'!$A$2:$A$10003=D$4,ROW('quantities report'!$A$2:$A$10003)-1,\"\"),ROWS($B$5:$B15))),\"0\")))","v":""},{"$f":"IF($B16=\"\",\"\",VALUE(IFERROR(INDEX('quantities report'!$D$2:$D$10003,SMALL(IF('quantities report'!$A$2:$A$10003=E$4,ROW('quantities report'!$A$2:$A$10003)-1,\"\"),ROWS($B$9:$B20))),\"0\")))","v":""},"","",{"$f":"IF($B16=\"\",\"\",IFERROR(INDEX('quantities report'!$D$2:$D$10003,SMALL(IF('quantities report'!$A$2:$A$10003=H$4,ROW('quantities report'!$A$2:$A$10003)-1,\"\"),ROWS($B$9:$B20))),\"0\"))","v":""},{"$f":"IF($B16=\"\",\"\",VALUE(IFERROR(INDEX('quantities report'!$D$2:$D$10003,SMALL(IF('quantities report'!$A$2:$A$10003=I$4,ROW('quantities report'!$A$2:$A$10003)-1,\"\"),ROWS($B$9:$B20))),\"0\")))","v":""},{"$f":"IF($B16=\"\",\"\",VALUE(IFERROR(INDEX('quantities report'!$D$2:$D$10003,SMALL(IF('quantities report'!$A$2:$A$10003=J$4,ROW('quantities report'!$A$2:$A$10003)-1,\"\"),ROWS($B$9:$B20))),\"0\")))","v":""},"",""]
[null,{"$f":"IFERROR(INDEX('manual inputs'!M:M,SMALL(IF('manual inputs'!M:M<>\"\",ROW('manual inputs'!M:M)),ROW(15:15))),\"\")","v":""},{"$f":"IF($B17=\"\",\"\",VALUE(IFERROR(INDEX('quantities report'!$D$2:$D$10003,SMALL(IF('quantities report'!$A$2:$A$10003=C$4,ROW('quantities report'!$A$2:$A$10003)-1,\"\"),ROWS($B$6:$B18))),\"0\")))","v":""},{"$f":"IF($B17=\"\",\"\",VALUE(IFERROR(INDEX('quantities report'!$D$2:$D$10003,SMALL(IF('quantities report'!$A$2:$A$10003=D$4,ROW('quantities report'!$A$2:$A$10003)-1,\"\"),ROWS($B$5:$B16))),\"0\")))","v":""},{"$f":"IF($B17=\"\",\"\",VALUE(IFERROR(INDEX('quantities report'!$D$2:$D$10003,SMALL(IF('quantities report'!$A$2:$A$10003=E$4,ROW('quantities report'!$A$2:$A$10003)-1,\"\"),ROWS($B$9:$B21))),\"0\")))","v":""},"","",{"$f":"IF($B17=\"\",\"\",IFERROR(INDEX('quantities report'!$D$2:$D$10003,SMALL(IF('quantities report'!$A$2:$A$10003=H$4,ROW('quantities report'!$A$2:$A$10003)-1,\"\"),ROWS($B$9:$B21))),\"0\"))","v":""},{"$f":"IF($B17=\"\",\"\",VALUE(IFERROR(INDEX('quantities report'!$D$2:$D$10003,SMALL(IF('quantities report'!$A$2:$A$10003=I$4,ROW('quantities report'!$A$2:$A$10003)-1,\"\"),ROWS($B$9:$B21))),\"0\")))","v":""},{"$f":"IF($B17=\"\",\"\",VALUE(IFERROR(INDEX('quantities report'!$D$2:$D$10003,SMALL(IF('quantities report'!$A$2:$A$10003=J$4,ROW('quantities report'!$A$2:$A$10003)-1,\"\"),ROWS($B$9:$B21))),\"0\")))","v":""},"",""]
[null,{"$f":"IFERROR(INDEX('manual inputs'!M:M,SMALL(IF('manual inputs'!M:M<>\"\",ROW('manual inputs'!M:M)),ROW(16:16))),\"\")","v":""},{"$f":"IF($B18=\"\",\"\",VALUE(IFERROR(INDEX('quantities report'!$D$2:$D$10003,SMALL(IF('quantities report'!$A$2:$A$10003=C$4,ROW('quantities report'!$A$2:$A$10003)-1,\"\"),ROWS($B$6:$B19))),\"0\")))","v":""},{"$f":"IF($B18=\"\",\"\",VALUE(IFERROR(INDEX('quantities report'!$D$2:$D$10003,SMALL(IF('quantities report'!$A$2:$A$10003=D$4,ROW('quantities report'!$A$2:$A$10003)-1,\"\"),ROWS($B$5:$B17))),\"0\")))","v":""},{"$f":"IF($B18=\"\",\"\",VALUE(IFERROR(INDEX('quantities report'!$D$2:$D$10003,SMALL(IF('quantities report'!$A$2:$A$10003=E$4,ROW('quantities report'!$A$2:$A$10003)-1,\"\"),ROWS($B$9:$B22))),\"0\")))","v":""},"","",{"$f":"IF($B18=\"\",\"\",IFERROR(INDEX('quantities report'!$D$2:$D$10003,SMALL(IF('quantities report'!$A$2:$A$10003=H$4,ROW('quantities report'!$A$2:$A$10003)-1,\"\"),ROWS($B$9:$B22))),\"0\"))","v":""},{"$f":"IF($B18=\"\",\"\",VALUE(IFERROR(INDEX('quantities report'!$D$2:$D$10003,SMALL(IF('quantities report'!$A$2:$A$10003=I$4,ROW('quantities report'!$A$2:$A$10003)-1,\"\"),ROWS($B$9:$B22))),\"0\")))","v":""},{"$f":"IF($B18=\"\",\"\",VALUE(IFERROR(INDEX('quantities report'!$D$2:$D$10003,SMALL(IF('quantities report'!$A$2:$A$10003=J$4,ROW('quantities report'!$A$2:$A$10003)-1,\"\"),ROWS($B$9:$B22))),\"0\")))","v":""},"",""]
[null,{"$f":"IFERROR(INDEX('manual inputs'!M:M,SMALL(IF('manual inputs'!M:M<>\"\",ROW('manual inputs'!M:M)),ROW(17:17))),\"\")","v":""},{"$f":"IF($B19=\"\",\"\",VALUE(IFERROR(INDEX('quantities report'!$D$2:$D$10003,SMALL(IF('quantities report'!$A$2:$A$10003=C$4,ROW('quantities report'!$A$2:$A$10003)-1,\"\"),ROWS($B$6:$B20))),\"0\")))","v":""},{"$f":"IF($B19=\"\",\"\",VALUE(IFERROR(INDEX('quantities report'!$D$2:$D$10003,SMALL(IF('quantities report'!$A$2:$A$10003=D$4,ROW('quantities report'!$A$2:$A$10003)-1,\"\"),ROWS($B$5:$B18))),\"0\")))","v":""},{"$f":"IF($B19=\"\",\"\",VALUE(IFERROR(INDEX('quantities report'!$D$2:$D$10003,SMALL(IF('quantities report'!$A$2:$A$10003=E$4,ROW('quantities report'!$A$2:$A$10003)-1,\"\"),ROWS($B$9:$B23))),\"0\")))","v":""},"","",{"$f":"IF($B19=\"\",\"\",IFERROR(INDEX('quantities report'!$D$2:$D$10003,SMALL(IF('quantities report'!$A$2:$A$10003=H$4,ROW('quantities report'!$A$2:$A$10003)-1,\"\"),ROWS($B$9:$B23))),\"0\"))","v":""},{"$f":"IF($B19=\"\",\"\",VALUE(IFERROR(INDEX('quantities report'!$D$2:$D$10003,SMALL(IF('quantities report'!$A$2:$A$10003=I$4,ROW('quantities report'!$A$2:$A$10003)-1,\"\"),ROWS($B$9:$B23))),\"0\")))","v":""},{"$f":"IF($B19=\"\",\"\",VALUE(IFERROR(INDEX('quantities report'!$D$2:$D$10003,SMALL(IF('quantities report'!$A$2:$A$10003=J$4,ROW('quantities report'!$A$2:$A$10003)-1,\"\"),ROWS($B$9:$B23))),\"0\")))","v":""},"",""]
[null,{"$f":"IFERROR(INDEX('manual inputs'!M:M,SMALL(IF('manual inputs'!M:M<>\"\",ROW('manual inputs'!M:M)),ROW(18:18))),\"\")","v":""},{"$f":"IF($B20=\"\",\"\",VALUE(IFERROR(INDEX('quantities report'!$D$2:$D$10003,SMALL(IF('quantities report'!$A$2:$A$10003=C$4,ROW('quantities report'!$A$2:$A$10003)-1,\"\"),ROWS($B$6:$B21))),\"0\")))","v":""},{"$f":"IF($B20=\"\",\"\",VALUE(IFERROR(INDEX('quantities report'!$D$2:$D$10003,SMALL(IF('quantities report'!$A$2:$A$10003=D$4,ROW('quantities report'!$A$2:$A$10003)-1,\"\"),ROWS($B$5:$B19))),\"0\")))","v":""},{"$f":"IF($B20=\"\",\"\",VALUE(IFERROR(INDEX('quantities report'!$D$2:$D$10003,SMALL(IF('quantities report'!$A$2:$A$10003=E$4,ROW('quantities report'!$A$2:$A$10003)-1,\"\"),ROWS($B$9:$B24))),\"0\")))","v":""},"","",{"$f":"IF($B20=\"\",\"\",IFERROR(INDEX('quantities report'!$D$2:$D$10003,SMALL(IF('quantities report'!$A$2:$A$10003=H$4,ROW('quantities report'!$A$2:$A$10003)-1,\"\"),ROWS($B$9:$B24))),\"0\"))","v":""},{"$f":"IF($B20=\"\",\"\",VALUE(IFERROR(INDEX('quantities report'!$D$2:$D$10003,SMALL(IF('quantities report'!$A$2:$A$10003=I$4,ROW('quantities report'!$A$2:$A$10003)-1,\"\"),ROWS($B$9:$B24))),\"0\")))","v":""},{"$f":"IF($B20=\"\",\"\",VALUE(IFERROR(INDEX('quantities report'!$D$2:$D$10003,SMALL(IF('quantities report'!$A$2:$A$10003=J$4,ROW('quantities report'!$A$2:$A$10003)-1,\"\"),ROWS($B$9:$B24))),\"0\")))","v":""},"",""]
[null,{"$f":"IFERROR(INDEX('manual inputs'!M:M,SMALL(IF('manual inputs'!M:M<>\"\",ROW('manual inputs'!M:M)),ROW(19:19))),\"\")","v":""},{"$f":"IF($B21=\"\",\"\",VALUE(IFERROR(INDEX('quantities report'!$D$2:$D$10003,SMALL(IF('quantities report'!$A$2:$A$10003=C$4,ROW('quantities report'!$A$2:$A$10003)-1,\"\"),ROWS($B$6:$B22))),\"0\")))","v":""},{"$f":"IF($B21=\"\",\"\",VALUE(IFERROR(INDEX('quantities report'!$D$2:$D$10003,SMALL(IF('quantities report'!$A$2:$A$10003=D$4,ROW('quantities report'!$A$2:$A$10003)-1,\"\"),ROWS($B$5:$B20))),\"0\")))","v":""},{"$f":"IF($B21=\"\",\"\",VALUE(IFERROR(INDEX('quantities report'!$D$2:$D$10003,SMALL(IF('quantities report'!$A$2:$A$10003=E$4,ROW('quantities report'!$A$2:$A$10003)-1,\"\"),ROWS($B$9:$B25))),\"0\")))","v":""},"","",{"$f":"IF($B21=\"\",\"\",IFERROR(INDEX('quantities report'!$D$2:$D$10003,SMALL(IF('quantities report'!$A$2:$A$10003=H$4,ROW('quantities report'!$A$2:$A$10003)-1,\"\"),ROWS($B$9:$B25))),\"0\"))","v":""},{"$f":"IF($B21=\"\",\"\",VALUE(IFERROR(INDEX('quantities report'!$D$2:$D$10003,SMALL(IF('quantities report'!$A$2:$A$10003=I$4,ROW('quantities report'!$A$2:$A$10003)-1,\"\"),ROWS($B$9:$B25))),\"0\")))","v":""},{"$f":"IF($B21=\"\",\"\",VALUE(IFERROR(INDEX('quantities report'!$D$2:$D$10003,SMALL(IF('quantities report'!$A$2:$A$10003=J$4,ROW('quantities report'!$A$2:$A$10003)-1,\"\"),ROWS($B$9:$B25))),\"0\")))","v":""},"",""]
[null,{"$f":"IFERROR(INDEX('manual inputs'!M:M,SMALL(IF('manual inputs'!M:M<>\"\",ROW('manual inputs'!M:M)),ROW(20:20))),\"\")","v":""},{"$f":"IF($B22=\"\",\"\",VALUE(IFERROR(INDEX('quantities report'!$D$2:$D$10003,SMALL(IF('quantities report'!$A$2:$A$10003=C$4,ROW('quantities report'!$A$2:$A$10003)-1,\"\"),ROWS($B$6:$B23))),\"0\")))","v":""},{"$f":"IF($B22=\"\",\"\",VALUE(IFERROR(INDEX('quantities report'!$D$2:$D$10003,SMALL(IF('quantities report'!$A$2:$A$10003=D$4,ROW('quantities report'!$A$2:$A$10003)-1,\"\"),ROWS($B$5:$B21))),\"0\")))","v":""},{"$f":"IF($B22=\"\",\"\",VALUE(IFERROR(INDEX('quantities report'!$D$2:$D$10003,SMALL(IF('quantities report'!$A$2:$A$10003=E$4,ROW('quantities report'!$A$2:$A$10003)-1,\"\"),ROWS($B$9:$B26))),\"0\")))","v":""},"","",{"$f":"IF($B22=\"\",\"\",IFERROR(INDEX('quantities report'!$D$2:$D$10003,SMALL(IF('quantities report'!$A$2:$A$10003=H$4,ROW('quantities report'!$A$2:$A$10003)-1,\"\"),ROWS($B$9:$B26))),\"0\"))","v":""},{"$f":"IF($B22=\"\",\"\",VALUE(IFERROR(INDEX('quantities report'!$D$2:$D$10003,SMALL(IF('quantities report'!$A$2:$A$10003=I$4,ROW('quantities report'!$A$2:$A$10003)-1,\"\"),ROWS($B$9:$B26))),\"0\")))","v":""},{"$f":"IF($B22=\"\",\"\",VALUE(IFERROR(INDEX('quantities report'!$D$2:$D$10003,SMALL(IF('quantities report'!$A$2:$A$10003=J$4,ROW('quantities report'!$A$2:$A$10003)-1,\"\"),ROWS($B$9:$B26))),\"0\")))","v":""},"",""]
[null,{"$f":"IFERROR(INDEX('manual inputs'!M:M,SMALL(IF('manual inputs'!M:M<>\"\",ROW('manual inputs'!M:M)),ROW(21:21))),\"\")","v":""},{"$f":"IF($B23=\"\",\"\",VALUE(IFERROR(INDEX('quantities report'!$D$2:$D$10003,SMALL(IF('quantities report'!$A$2:$A$10003=C$4,ROW('quantities report'!$A$2:$A$10003)-1,\"\"),ROWS($B$6:$B24))),\"0\")))","v":""},{"$f":"IF($B23=\"\",\"\",VALUE(IFERROR(INDEX('quantities report'!$D$2:$D$10003,SMALL(IF('quantities report'!$A$2:$A$10003=D$4,ROW('quantities report'!$A$2:$A$10003)-1,\"\"),ROWS($B$5:$B22))),\"0\")))","v":""},{"$f":"IF($B23=\"\",\"\",VALUE(IFERROR(INDEX('quantities report'!$D$2:$D$10003,SMALL(IF('quantities report'!$A$2:$A$10003=E$4,ROW('quantities report'!$A$2:$A$10003)-1,\"\"),ROWS($B$9:$B27))),\"0\")))","v":""},"","",{"$f":"IF($B23=\"\",\"\",IFERROR(INDEX('quantities report'!$D$2:$D$10003,SMALL(IF('quantities report'!$A$2:$A$10003=H$4,ROW('quantities report'!$A$2:$A$10003)-1,\"\"),ROWS($B$9:$B27))),\"0\"))","v":""},{"$f":"IF($B23=\"\",\"\",VALUE(IFERROR(INDEX('quantities report'!$D$2:$D$10003,SMALL(IF('quantities report'!$A$2:$A$10003=I$4,ROW('quantities report'!$A$2:$A$10003)-1,\"\"),ROWS($B$9:$B27))),\"0\")))","v":""},{"$f":"IF($B23=\"\",\"\",VALUE(IFERROR(INDEX('quantities report'!$D$2:$D$10003,SMALL(IF('quantities report'!$A$2:$A$10003=J$4,ROW('quantities report'!$A$2:$A$10003)-1,\"\"),ROWS($B$9:$B27))),\"0\")))","v":""},"",""]
[null,{"$f":"IFERROR(INDEX('manual inputs'!M:M,SMALL(IF('manual inputs'!M:M<>\"\",ROW('manual inputs'!M:M)),ROW(22:22))),\"\")","v":""},{"$f":"IF($B24=\"\",\"\",VALUE(IFERROR(INDEX('quantities report'!$D$2:$D$10003,SMALL(IF('quantities report'!$A$2:$A$10003=C$4,ROW('quantities report'!$A$2:$A$10003)-1,\"\"),ROWS($B$6:$B25))),\"0\")))","v":""},{"$f":"IF($B24=\"\",\"\",VALUE(IFERROR(INDEX('quantities report'!$D$2:$D$10003,SMALL(IF('quantities report'!$A$2:$A$10003=D$4,ROW('quantities report'!$A$2:$A$10003)-1,\"\"),ROWS($B$5:$B23))),\"0\")))","v":""},{"$f":"IF($B24=\"\",\"\",VALUE(IFERROR(INDEX('quantities report'!$D$2:$D$10003,SMALL(IF('quantities report'!$A$2:$A$10003=E$4,ROW('quantities report'!$A$2:$A$10003)-1,\"\"),ROWS($B$9:$B28))),\"0\")))","v":""},"","",{"$f":"IF($B24=\"\",\"\",IFERROR(INDEX('quantities report'!$D$2:$D$10003,SMALL(IF('quantities report'!$A$2:$A$10003=H$4,ROW('quantities report'!$A$2:$A$10003)-1,\"\"),ROWS($B$9:$B28))),\"0\"))","v":""},{"$f":"IF($B24=\"\",\"\",VALUE(IFERROR(INDEX('quantities report'!$D$2:$D$10003,SMALL(IF('quantities report'!$A$2:$A$10003=I$4,ROW('quantities report'!$A$2:$A$10003)-1,\"\"),ROWS($B$9:$B28))),\"0\")))","v":""},{"$f":"IF($B24=\"\",\"\",VALUE(IFERROR(INDEX('quantities report'!$D$2:$D$10003,SMALL(IF('quantities report'!$A$2:$A$10003=J$4,ROW('quantities report'!$A$2:$A$10003)-1,\"\"),ROWS($B$9:$B28))),\"0\")))","v":""},"",""]
[null,{"$f":"IFERROR(INDEX('manual inputs'!M:M,SMALL(IF('manual inputs'!M:M<>\"\",ROW('manual inputs'!M:M)),ROW(23:23))),\"\")","v":""},{"$f":"IF($B25=\"\",\"\",VALUE(IFERROR(INDEX('quantities report'!$D$2:$D$10003,SMALL(IF('quantities report'!$A$2:$A$10003=C$4,ROW('quantities report'!$A$2:$A$10003)-1,\"\"),ROWS($B$6:$B26))),\"0\")))","v":""},{"$f":"IF($B25=\"\",\"\",VALUE(IFERROR(INDEX('quantities report'!$D$2:$D$10003,SMALL(IF('quantities report'!$A$2:$A$10003=D$4,ROW('quantities report'!$A$2:$A$10003)-1,\"\"),ROWS($B$5:$B24))),\"0\")))","v":""},{"$f":"IF($B25=\"\",\"\",VALUE(IFERROR(INDEX('quantities report'!$D$2:$D$10003,SMALL(IF('quantities report'!$A$2:$A$10003=E$4,ROW('quantities report'!$A$2:$A$10003)-1,\"\"),ROWS($B$9:$B29))),\"0\")))","v":""},"","",{"$f":"IF($B25=\"\",\"\",IFERROR(INDEX('quantities report'!$D$2:$D$10003,SMALL(IF('quantities report'!$A$2:$A$10003=H$4,ROW('quantities report'!$A$2:$A$10003)-1,\"\"),ROWS($B$9:$B29))),\"0\"))","v":""},{"$f":"IF($B25=\"\",\"\",VALUE(IFERROR(INDEX('quantities report'!$D$2:$D$10003,SMALL(IF('quantities report'!$A$2:$A$10003=I$4,ROW('quantities report'!$A$2:$A$10003)-1,\"\"),ROWS($B$9:$B29))),\"0\")))","v":""},{"$f":"IF($B25=\"\",\"\",VALUE(IFERROR(INDEX('quantities report'!$D$2:$D$10003,SMALL(IF('quantities report'!$A$2:$A$10003=J$4,ROW('quantities report'!$A$2:$A$10003)-1,\"\"),ROWS($B$9:$B29))),\"0\")))","v":""},"",""]
[null,{"$f":"IFERROR(INDEX('manual inputs'!M:M,SMALL(IF('manual inputs'!M:M<>\"\",ROW('manual inputs'!M:M)),ROW(24:24))),\"\")","v":""},{"$f":"IF($B26=\"\",\"\",VALUE(IFERROR(INDEX('quantities report'!$D$2:$D$10003,SMALL(IF('quantities report'!$A$2:$A$10003=C$4,ROW('quantities report'!$A$2:$A$10003)-1,\"\"),ROWS($B$6:$B27))),\"0\")))","v":""},{"$f":"IF($B26=\"\",\"\",VALUE(IFERROR(INDEX('quantities report'!$D$2:$D$10003,SMALL(IF('quantities report'!$A$2:$A$10003=D$4,ROW('quantities report'!$A$2:$A$10003)-1,\"\"),ROWS($B$5:$B25))),\"0\")))","v":""},{"$f":"IF($B26=\"\",\"\",VALUE(IFERROR(INDEX('quantities report'!$D$2:$D$10003,SMALL(IF('quantities report'!$A$2:$A$10003=E$4,ROW('quantities report'!$A$2:$A$10003)-1,\"\"),ROWS($B$9:$B30))),\"0\")))","v":""},"","",{"$f":"IF($B26=\"\",\"\",IFERROR(INDEX('quantities report'!$D$2:$D$10003,SMALL(IF('quantities report'!$A$2:$A$10003=H$4,ROW('quantities report'!$A$2:$A$10003)-1,\"\"),ROWS($B$9:$B30))),\"0\"))","v":""},{"$f":"IF($B26=\"\",\"\",VALUE(IFERROR(INDEX('quantities report'!$D$2:$D$10003,SMALL(IF('quantities report'!$A$2:$A$10003=I$4,ROW('quantities report'!$A$2:$A$10003)-1,\"\"),ROWS($B$9:$B30))),\"0\")))","v":""},{"$f":"IF($B26=\"\",\"\",VALUE(IFERROR(INDEX('quantities report'!$D$2:$D$10003,SMALL(IF('quantities report'!$A$2:$A$10003=J$4,ROW('quantities report'!$A$2:$A$10003)-1,\"\"),ROWS($B$9:$B30))),\"0\")))","v":""},"",""]
[null,{"$f":"IFERROR(INDEX('manual inputs'!M:M,SMALL(IF('manual inputs'!M:M<>\"\",ROW('manual inputs'!M:M)),ROW(25:25))),\"\")","v":""},{"$f":"IF($B27=\"\",\"\",VALUE(IFERROR(INDEX('quantities report'!$D$2:$D$10003,SMALL(IF('quantities report'!$A$2:$A$10003=C$4,ROW('quantities report'!$A$2:$A$10003)-1,\"\"),ROWS($B$6:$B28))),\"0\")))","v":""},{"$f":"IF($B27=\"\",\"\",VALUE(IFERROR(INDEX('quantities report'!$D$2:$D$10003,SMALL(IF('quantities report'!$A$2:$A$10003=D$4,ROW('quantities report'!$A$2:$A$10003)-1,\"\"),ROWS($B$5:$B26))),\"0\")))","v":""},{"$f":"IF($B27=\"\",\"\",VALUE(IFERROR(INDEX('quantities report'!$D$2:$D$10003,SMALL(IF('quantities report'!$A$2:$A$10003=E$4,ROW('quantities report'!$A$2:$A$10003)-1,\"\"),ROWS($B$9:$B31))),\"0\")))","v":""},"","",{"$f":"IF($B27=\"\",\"\",IFERROR(INDEX('quantities report'!$D$2:$D$10003,SMALL(IF('quantities report'!$A$2:$A$10003=H$4,ROW('quantities report'!$A$2:$A$10003)-1,\"\"),ROWS($B$9:$B31))),\"0\"))","v":""},{"$f":"IF($B27=\"\",\"\",VALUE(IFERROR(INDEX('quantities report'!$D$2:$D$10003,SMALL(IF('quantities report'!$A$2:$A$10003=I$4,ROW('quantities report'!$A$2:$A$10003)-1,\"\"),ROWS($B$9:$B31))),\"0\")))","v":""},{"$f":"IF($B27=\"\",\"\",VALUE(IFERROR(INDEX('quantities report'!$D$2:$D$10003,SMALL(IF('quantities report'!$A$2:$A$10003=J$4,ROW('quantities report'!$A$2:$A$10003)-1,\"\"),ROWS($B$9:$B31))),\"0\")))","v":""},"",""]
[null,{"$f":"IFERROR(INDEX('manual inputs'!M:M,SMALL(IF('manual inputs'!M:M<>\"\",ROW('manual inputs'!M:M)),ROW(26:26))),\"\")","v":""},{"$f":"IF($B28=\"\",\"\",VALUE(IFERROR(INDEX('quantities report'!$D$2:$D$10003,SMALL(IF('quantities report'!$A$2:$A$10003=C$4,ROW('quantities report'!$A$2:$A$10003)-1,\"\"),ROWS($B$6:$B29))),\"0\")))","v":""},{"$f":"IF($B28=\"\",\"\",VALUE(IFERROR(INDEX('quantities report'!$D$2:$D$10003,SMALL(IF('quantities report'!$A$2:$A$10003=D$4,ROW('quantities report'!$A$2:$A$10003)-1,\"\"),ROWS($B$5:$B27))),\"0\")))","v":""},{"$f":"IF($B28=\"\",\"\",VALUE(IFERROR(INDEX('quantities report'!$D$2:$D$10003,SMALL(IF('quantities report'!$A$2:$A$10003=E$4,ROW('quantities report'!$A$2:$A$10003)-1,\"\"),ROWS($B$9:$B32))),\"0\")))","v":""},"","",{"$f":"IF($B28=\"\",\"\",IFERROR(INDEX('quantities report'!$D$2:$D$10003,SMALL(IF('quantities report'!$A$2:$A$10003=H$4,ROW('quantities report'!$A$2:$A$10003)-1,\"\"),ROWS($B$9:$B32))),\"0\"))","v":""},{"$f":"IF($B28=\"\",\"\",VALUE(IFERROR(INDEX('quantities report'!$D$2:$D$10003,SMALL(IF('quantities report'!$A$2:$A$10003=I$4,ROW('quantities report'!$A$2:$A$10003)-1,\"\"),ROWS($B$9:$B32))),\"0\")))","v":""},{"$f":"IF($B28=\"\",\"\",VALUE(IFERROR(INDEX('quantities report'!$D$2:$D$10003,SMALL(IF('quantities report'!$A$2:$A$10003=J$4,ROW('quantities report'!$A$2:$A$10003)-1,\"\"),ROWS($B$9:$B32))),\"0\")))","v":""},"",""]

{"sheet":"Structure_Ex","index":6,"n_rows":32,"n_cols":9,"rows_kept":32,"cut":false,"hidden":false,"merged":[[3,2,3,7],[3,8,5,8]]}
[]
[]
["TOTALS",null,{"$f":"SUM(C8:C32)","v":0},0,0,0,0,0,0]
[null,null,"Structure Excavation",null,null,null,null,null,"Total"]
[null,null,"Soil Nail","MSE Wall","GFMSE Wall","Rockery Wall","Concrete Walls","Guardwall"]
["ORD Component Name",null,"Soil Nail Wall Excavation: ","MSE Wall Excavation: ","GFMSE Wall Excavation: ","Rockery Wall Excavation: ","Wall Excavation: ","Guard Wall Excavation:"]
["Enter Start of Project",{"$f":"IFERROR(INDEX('manual inputs'!M:M,SMALL(IF('manual inputs'!M:M<>\"\",ROW('manual inputs'!M:M)),ROW(2:2))),\"\")","v":""}]
[null,{"$f":"IFERROR(INDEX('manual inputs'!M:M,SMALL(IF('manual inputs'!M:M<>\"\",ROW('manual inputs'!M:M)),ROW(3:3))),\"\")","v":""},{"$f":"IF($B8=\"\",\"\",IFERROR(INDEX('quantities report'!$D$2:$D$10003,SMALL(IF('quantities report'!$A$2:$A$10003=C$6,ROW('quantities report'!$A$2:$A$10003)-1,\"\"),ROWS($B$8:$B8))),\"0\"))","v":""},{"$f":"IF($B8=\"\",\"\",IFERROR(INDEX('quantities report'!$D$2:$D$10003,SMALL(IF('quantities report'!$A$2:$A$10003=D$6,ROW('quantities report'!$A$2:$A$10003)-1,\"\"),ROWS($B$8:$B8))),\"0\"))","v":""},{"$f":"IF($B8=\"\",\"\",IFERROR(INDEX('quantities report'!$D$2:$D$10003,SMALL(IF('quantities report'!$A$2:$A$10003=E$6,ROW('quantities report'!$A$2:$A$10003)-1,\"\"),ROWS($B$8:$B8))),\"0\"))","v":""},{"$f":"IF($B8=\"\",\"\",IFERROR(INDEX('quantities report'!$D$2:$D$10003,SMALL(IF('quantities report'!$A$2:$A$10003=F$6,ROW('quantities report'!$A$2:$A$10003)-1,\"\"),ROWS($B$8:$B8))),\"0\"))","v":""},{"$f":"IF($B8=\"\",\"\",IFERROR(INDEX('quantities report'!$D$2:$D$10003,SMALL(IF('quantities report'!$A$2:$A$10003=G$6,ROW('quantities report'!$A$2:$A$10003)-1,\"\"),ROWS($B$8:$B8))),\"0\"))","v":""},{"$f":"IF($B8=\"\",\"\",IFERROR(INDEX('quantities report'!$D$2:$D$10003,SMALL(IF('quantities report'!$A$2:$A$10003=H$6,ROW('quantities report'!$A$2:$A$10003)-1,\"\"),ROWS($B$8:$B8))),\"0\"))","v":""},{"$f":"IF(B8=\"\",\"\",SUM(C8:H8))","v":""}]
[null,{"$f":"IFERROR(INDEX('manual inputs'!M:M,SMALL(IF('manual inputs'!M:M<>\"\",ROW('manual inputs'!M:M)),ROW(4:4))),\"\")","v":""},{"$f":"IF($B9=\"\",\"\",IFERROR(INDEX('quantities report'!$D$2:$D$10003,SMALL(IF('quantities report'!$A$2:$A$10003=C$6,ROW('quantities report'!$A$2:$A$10003)-1,\"\"),ROWS($B$8:$B9))),\"0\"))","v":""},{"$f":"IF($B9=\"\",\"\",IFERROR(INDEX('quantities report'!$D$2:$D$10003,SMALL(IF('quantities report'!$A$2:$A$10003=D$6,ROW('quantities report'!$A$2:$A$10003)-1,\"\"),ROWS($B$8:$B9))),\"0\"))","v":""},{"$f":"IF($B9=\"\",\"\",IFERROR(INDEX('quantities report'!$D$2:$D$10003,SMALL(IF('quantities report'!$A$2:$A$10003=E$6,ROW('quantities report'!$A$2:$A$10003)-1,\"\"),ROWS($B$8:$B9))),\"0\"))","v":""},{"$f":"IF($B9=\"\",\"\",IFERROR(INDEX('quantities report'!$D$2:$D$10003,SMALL(IF('quantities report'!$A$2:$A$10003=F$6,ROW('quantities report'!$A$2:$A$10003)-1,\"\"),ROWS($B$8:$B9))),\"0\"))","v":""},{"$f":"IF($B9=\"\",\"\",IFERROR(INDEX('quantities report'!$D$2:$D$10003,SMALL(IF('quantities report'!$A$2:$A$10003=G$6,ROW('quantities report'!$A$2:$A$10003)-1,\"\"),ROWS($B$8:$B9))),\"0\"))","v":""},{"$f":"IF($B9=\"\",\"\",IFERROR(INDEX('quantities report'!$D$2:$D$10003,SMALL(IF('quantities report'!$A$2:$A$10003=H$6,ROW('quantities report'!$A$2:$A$10003)-1,\"\"),ROWS($B$8:$B9))),\"0\"))","v":""},{"$f":"IF(B9=\"\",\"\",SUM(C9:H9))","v":""}]
[null,{"$f":"IFERROR(INDEX('manual inputs'!M:M,SMALL(IF('manual inputs'!M:M<>\"\",ROW('manual inputs'!M:M)),ROW(5:5))),\"\")","v":""},{"$f":"IF($B10=\"\",\"\",IFERROR(INDEX('quantities report'!$D$2:$D$10003,SMALL(IF('quantities report'!$A$2:$A$10003=C$6,ROW('quantities report'!$A$2:$A$10003)-1,\"\"),ROWS($B$8:$B10))),\"0\"))","v":""},{"$f":"IF($B10=\"\",\"\",IFERROR(INDEX('quantities report'!$D$2:$D$10003,SMALL(IF('quantities report'!$A$2:$A$10003=D$6,ROW('quantities report'!$A$2:$A$10003)-1,\"\"),ROWS($B$8:$B10))),\"0\"))","v":""},{"$f":"IF($B10=\"\",\"\",IFERROR(INDEX('quantities report'!$D$2:$D$10003,SMALL(IF('quantities report'!$A$2:$A$10003=E$6,ROW('quantities report'!$A$2:$A$10003)-1,\"\"),ROWS($B$8:$B10))),\"0\"))","v":""},{"$f":"IF($B10=\"\",\"\",IFERROR(INDEX('quantities report'!$D$2:$D$10003,SMALL(IF('quantities report'!$A$2:$A$10003=F$6,ROW('quantities report'!$A$2:$A$10003)-1,\"\"),ROWS($B$8:$B10))),\"0\"))","v":""},{"$f":"IF($B10=\"\",\"\",IFERROR(INDEX('quantities report'!$D$2:$D$10003,SMALL(IF('quantities report'!$A$2:$A$10003=G$6,ROW('quantities report'!$A$2:$A$10003)-1,\"\"),ROWS($B$8:$B10))),\"0\"))","v":""},{"$f":"IF($B10=\"\",\"\",IFERROR(INDEX('quantities report'!$D$2:$D$10003,SMALL(IF('quantities report'!$A$2:$A$10003=H$6,ROW('quantities report'!$A$2:$A$10003)-1,\"\"),ROWS($B$8:$B10))),\"0\"))","v":""},{"$f":"IF(B10=\"\",\"\",SUM(C10:H10))","v":""}]
[null,{"$f":"IFERROR(INDEX('manual inputs'!M:M,SMALL(IF('manual inputs'!M:M<>\"\",ROW('manual inputs'!M:M)),ROW(6:6))),\"\")","v":""},{"$f":"IF($B11=\"\",\"\",IFERROR(INDEX('quantities report'!$D$2:$D$10003,SMALL(IF('quantities report'!$A$2:$A$10003=C$6,ROW('quantities report'!$A$2:$A$10003)-1,\"\"),ROWS($B$8:$B11))),\"0\"))","v":""},{"$f":"IF($B11=\"\",\"\",IFERROR(INDEX('quantities report'!$D$2:$D$10003,SMALL(IF('quantities report'!$A$2:$A$10003=D$6,ROW('quantities report'!$A$2:$A$10003)-1,\"\"),ROWS($B$8:$B11))),\"0\"))","v":""},{"$f":"IF($B11=\"\",\"\",IFERROR(INDEX('quantities report'!$D$2:$D$10003,SMALL(IF('quantities report'!$A$2:$A$10003=E$6,ROW('quantities report'!$A$2:$A$10003)-1,\"\"),ROWS($B$8:$B11))),\"0\"))","v":""},{"$f":"IF($B11=\"\",\"\",IFERROR(INDEX('quantities report'!$D$2:$D$10003,SMALL(IF('quantities report'!$A$2:$A$10003=F$6,ROW('quantities report'!$A$2:$A$10003)-1,\"\"),ROWS($B$8:$B11))),\"0\"))","v":""},{"$f":"IF($B11=\"\",\"\",IFERROR(INDEX('quantities report'!$D$2:$D$10003,SMALL(IF('quantities report'!$A$2:$A$10003=G$6,ROW('quantities report'!$A$2:$A$10003)-1,\"\"),ROWS($B$8:$B11))),\"0\"))","v":""},{"$f":"IF($B11=\"\",\"\",IFERROR(INDEX('quantities report'!$D$2:$D$10003,SMALL(IF('quantities report'!$A$2:$A$10003=H$6,ROW('quantities report'!$A$2:$A$10003)-1,\"\"),ROWS($B$8:$B11))),\"0\"))","v":""},{"$f":"IF(B11=\"\",\"\",SUM(C11:H11))","v":""}]
[null,{"$f":"IFERROR(INDEX('manual inputs'!M:M,SMALL(IF('manual inputs'!M:M<>\"\",ROW('manual inputs'!M:M)),ROW(7:7))),\"\")","v":""},{"$f":"IF($B12=\"\",\"\",IFERROR(INDEX('quantities report'!$D$2:$D$10003,SMALL(IF('quantities report'!$A$2:$A$10003=C$6,ROW('quantities report'!$A$2:$A$10003)-1,\"\"),ROWS($B$8:$B12))),\"0\"))","v":""},{"$f":"IF($B12=\"\",\"\",IFERROR(INDEX('quantities report'!$D$2:$D$10003,SMALL(IF('quantities report'!$A$2:$A$10003=D$6,ROW('quantities report'!$A$2:$A$10003)-1,\"\"),ROWS($B$8:$B12))),\"0\"))","v":""},{"$f":"IF($B12=\"\",\"\",IFERROR(INDEX('quantities report'!$D$2:$D$10003,SMALL(IF('quantities report'!$A$2:$A$10003=E$6,ROW('quantities report'!$A$2:$A$10003)-1,\"\"),ROWS($B$8:$B12))),\"0\"))","v":""},{"$f":"IF($B12=\"\",\"\",IFERROR(INDEX('quantities report'!$D$2:$D$10003,SMALL(IF('quantities report'!$A$2:$A$10003=F$6,ROW('quantities report'!$A$2:$A$10003)-1,\"\"),ROWS($B$8:$B12))),\"0\"))","v":""},{"$f":"IF($B12=\"\",\"\",IFERROR(INDEX('quantities report'!$D$2:$D$10003,SMALL(IF('quantities report'!$A$2:$A$10003=G$6,ROW('quantities report'!$A$2:$A$10003)-1,\"\"),ROWS($B$8:$B12))),\"0\"))","v":""},{"$f":"IF($B12=\"\",\"\",IFERROR(INDEX('quantities report'!$D$2:$D$10003,SMALL(IF('quantities report'!$A$2:$A$10003=H$6,ROW('quantities report'!$A$2:$A$10003)-1,\"\"),ROWS($B$8:$B12))),\"0\"))","v":""},{"$f":"IF(B12=\"\",\"\",SUM(C12:H12))","v":""}]
[null,{"$f":"IFERROR(INDEX('manual inputs'!M:M,SMALL(IF('manual inputs'!M:M<>\"\",ROW('manual inputs'!M:M)),ROW(8:8))),\"\")","v":""},{"$f":"IF($B13=\"\",\"\",IFERROR(INDEX('quantities report'!$D$2:$D$10003,SMALL(IF('quantities report'!$A$2:$A$10003=C$6,ROW('quantities report'!$A$2:$A$10003)-1,\"\"),ROWS($B$8:$B13))),\"0\"))","v":""},{"$f":"IF($B13=\"\",\"\",IFERROR(INDEX('quantities report'!$D$2:$D$10003,SMALL(IF('quantities report'!$A$2:$A$10003=D$6,ROW('quantities report'!$A$2:$A$10003)-1,\"\"),ROWS($B$8:$B13))),\"0\"))","v":""},{"$f":"IF($B13=\"\",\"\",IFERROR(INDEX('quantities report'!$D$2:$D$10003,SMALL(IF('quantities report'!$A$2:$A$10003=E$6,ROW('quantities report'!$A$2:$A$10003)-1,\"\"),ROWS($B$8:$B13))),\"0\"))","v":""},{"$f":"IF($B13=\"\",\"\",IFERROR(INDEX('quantities report'!$D$2:$D$10003,SMALL(IF('quantities report'!$A$2:$A$10003=F$6,ROW('quantities report'!$A$2:$A$10003)-1,\"\"),ROWS($B$8:$B13))),\"0\"))","v":""},{"$f":"IF($B13=\"\",\"\",IFERROR(INDEX('quantities report'!$D$2:$D$10003,SMALL(IF('quantities report'!$A$2:$A$10003=G$6,ROW('quantities report'!$A$2:$A$10003)-1,\"\"),ROWS($B$8:$B13))),\"0\"))","v":""},{"$f":"IF($B13=\"\",\"\",IFERROR(INDEX('quantities report'!$D$2:$D$10003,SMALL(IF('quantities report'!$A$2:$A$10003=H$6,ROW('quantities report'!$A$2:$A$10003)-1,\"\"),ROWS($B$8:$B13))),\"0\"))","v":""},{"$f":"IF(B13=\"\",\"\",SUM(C13:H13))","v":""}]
[null,{"$f":"IFERROR(INDEX('manual inputs'!M:M,SMALL(IF('manual inputs'!M:M<>\"\",ROW('manual inputs'!M:M)),ROW(9:9))),\"\")","v":""},{"$f":"IF($B14=\"\",\"\",IFERROR(INDEX('quantities report'!$D$2:$D$10003,SMALL(IF('quantities report'!$A$2:$A$10003=C$6,ROW('quantities report'!$A$2:$A$10003)-1,\"\"),ROWS($B$8:$B14))),\"0\"))","v":""},{"$f":"IF($B14=\"\",\"\",IFERROR(INDEX('quantities report'!$D$2:$D$10003,SMALL(IF('quantities report'!$A$2:$A$10003=D$6,ROW('quantities report'!$A$2:$A$10003)-1,\"\"),ROWS($B$8:$B14))),\"0\"))","v":""},{"$f":"IF($B14=\"\",\"\",IFERROR(INDEX('quantities report'!$D$2:$D$10003,SMALL(IF('quantities report'!$A$2:$A$10003=E$6,ROW('quantities report'!$A$2:$A$10003)-1,\"\"),ROWS($B$8:$B14))),\"0\"))","v":""},{"$f":"IF($B14=\"\",\"\",IFERROR(INDEX('quantities report'!$D$2:$D$10003,SMALL(IF('quantities report'!$A$2:$A$10003=F$6,ROW('quantities report'!$A$2:$A$10003)-1,\"\"),ROWS($B$8:$B14))),\"0\"))","v":""},{"$f":"IF($B14=\"\",\"\",IFERROR(INDEX('quantities report'!$D$2:$D$10003,SMALL(IF('quantities report'!$A$2:$A$10003=G$6,ROW('quantities report'!$A$2:$A$10003)-1,\"\"),ROWS($B$8:$B14))),\"0\"))","v":""},{"$f":"IF($B14=\"\",\"\",IFERROR(INDEX('quantities report'!$D$2:$D$10003,SMALL(IF('quantities report'!$A$2:$A$10003=H$6,ROW('quantities report'!$A$2:$A$10003)-1,\"\"),ROWS($B$8:$B14))),\"0\"))","v":""},{"$f":"IF(B14=\"\",\"\",SUM(C14:H14))","v":""}]
[null,{"$f":"IFERROR(INDEX('manual inputs'!M:M,SMALL(IF('manual inputs'!M:M<>\"\",ROW('manual inputs'!M:M)),ROW(10:10))),\"\")","v":""},{"$f":"IF($B15=\"\",\"\",IFERROR(INDEX('quantities report'!$D$2:$D$10003,SMALL(IF('quantities report'!$A$2:$A$10003=C$6,ROW('quantities report'!$A$2:$A$10003)-1,\"\"),ROWS($B$8:$B15))),\"0\"))","v":""},{"$f":"IF($B15=\"\",\"\",IFERROR(INDEX('quantities report'!$D$2:$D$10003,SMALL(IF('quantities report'!$A$2:$A$10003=D$6,ROW('quantities report'!$A$2:$A$10003)-1,\"\"),ROWS($B$8:$B15))),\"0\"))","v":""},{"$f":"IF($B15=\"\",\"\",IFERROR(INDEX('quantities report'!$D$2:$D$10003,SMALL(IF('quantities report'!$A$2:$A$10003=E$6,ROW('quantities report'!$A$2:$A$10003)-1,\"\"),ROWS($B$8:$B15))),\"0\"))","v":""},{"$f":"IF($B15=\"\",\"\",IFERROR(INDEX('quantities report'!$D$2:$D$10003,SMALL(IF('quantities report'!$A$2:$A$10003=F$6,ROW('quantities report'!$A$2:$A$10003)-1,\"\"),ROWS($B$8:$B15))),\"0\"))","v":""},{"$f":"IF($B15=\"\",\"\",IFERROR(INDEX('quantities report'!$D$2:$D$10003,SMALL(IF('quantities report'!$A$2:$A$10003=G$6,ROW('quantities report'!$A$2:$A$10003)-1,\"\"),ROWS($B$8:$B15))),\"0\"))","v":""},{"$f":"IF($B15=\"\",\"\",IFERROR(INDEX('quantities report'!$D$2:$D$10003,SMALL(IF('quantities report'!$A$2:$A$10003=H$6,ROW('quantities report'!$A$2:$A$10003)-1,\"\"),ROWS($B$8:$B15))),\"0\"))","v":""},{"$f":"IF(B15=\"\",\"\",SUM(C15:H15))","v":""}]
[null,{"$f":"IFERROR(INDEX('manual inputs'!M:M,SMALL(IF('manual inputs'!M:M<>\"\",ROW('manual inputs'!M:M)),ROW(11:11))),\"\")","v":""},{"$f":"IF($B16=\"\",\"\",IFERROR(INDEX('quantities report'!$D$2:$D$10003,SMALL(IF('quantities report'!$A$2:$A$10003=C$6,ROW('quantities report'!$A$2:$A$10003)-1,\"\"),ROWS($B$8:$B16))),\"0\"))","v":""},{"$f":"IF($B16=\"\",\"\",IFERROR(INDEX('quantities report'!$D$2:$D$10003,SMALL(IF('quantities report'!$A$2:$A$10003=D$6,ROW('quantities report'!$A$2:$A$10003)-1,\"\"),ROWS($B$8:$B16))),\"0\"))","v":""},{"$f":"IF($B16=\"\",\"\",IFERROR(INDEX('quantities report'!$D$2:$D$10003,SMALL(IF('quantities report'!$A$2:$A$10003=E$6,ROW('quantities report'!$A$2:$A$10003)-1,\"\"),ROWS($B$8:$B16))),\"0\"))","v":""},{"$f":"IF($B16=\"\",\"\",IFERROR(INDEX('quantities report'!$D$2:$D$10003,SMALL(IF('quantities report'!$A$2:$A$10003=F$6,ROW('quantities report'!$A$2:$A$10003)-1,\"\"),ROWS($B$8:$B16))),\"0\"))","v":""},{"$f":"IF($B16=\"\",\"\",IFERROR(INDEX('quantities report'!$D$2:$D$10003,SMALL(IF('quantities report'!$A$2:$A$10003=G$6,ROW('quantities report'!$A$2:$A$10003)-1,\"\"),ROWS($B$8:$B16))),\"0\"))","v":""},{"$f":"IF($B16=\"\",\"\",IFERROR(INDEX('quantities report'!$D$2:$D$10003,SMALL(IF('quantities report'!$A$2:$A$10003=H$6,ROW('quantities report'!$A$2:$A$10003)-1,\"\"),ROWS($B$8:$B16))),\"0\"))","v":""},{"$f":"IF(B16=\"\",\"\",SUM(C16:H16))","v":""}]
[null,{"$f":"IFERROR(INDEX('manual inputs'!M:M,SMALL(IF('manual inputs'!M:M<>\"\",ROW('manual inputs'!M:M)),ROW(12:12))),\"\")","v":""},{"$f":"IF($B17=\"\",\"\",IFERROR(INDEX('quantities report'!$D$2:$D$10003,SMALL(IF('quantities report'!$A$2:$A$10003=C$6,ROW('quantities report'!$A$2:$A$10003)-1,\"\"),ROWS($B$8:$B17))),\"0\"))","v":""},{"$f":"IF($B17=\"\",\"\",IFERROR(INDEX('quantities report'!$D$2:$D$10003,SMALL(IF('quantities report'!$A$2:$A$10003=D$6,ROW('quantities report'!$A$2:$A$10003)-1,\"\"),ROWS($B$8:$B17))),\"0\"))","v":""},{"$f":"IF($B17=\"\",\"\",IFERROR(INDEX('quantities report'!$D$2:$D$10003,SMALL(IF('quantities report'!$A$2:$A$10003=E$6,ROW('quantities report'!$A$2:$A$10003)-1,\"\"),ROWS($B$8:$B17))),\"0\"))","v":""},{"$f":"IF($B17=\"\",\"\",IFERROR(INDEX('quantities report'!$D$2:$D$10003,SMALL(IF('quantities report'!$A$2:$A$10003=F$6,ROW('quantities report'!$A$2:$A$10003)-1,\"\"),ROWS($B$8:$B17))),\"0\"))","v":""},{"$f":"IF($B17=\"\",\"\",IFERROR(INDEX('quantities report'!$D$2:$D$10003,SMALL(IF('quantities report'!$A$2:$A$10003=G$6,ROW('quantities report'!$A$2:$A$10003)-1,\"\"),ROWS($B$8:$B17))),\"0\"))","v":""},{"$f":"IF($B17=\"\",\"\",IFERROR(INDEX('quantities report'!$D$2:$D$10003,SMALL(IF('quantities report'!$A$2:$A$10003=H$6,ROW('quantities report'!$A$2:$A$10003)-1,\"\"),ROWS($B$8:$B17))),\"0\"))","v":""},{"$f":"IF(B17=\"\",\"\",SUM(C17:H17))","v":""}]
[null,{"$f":"IFERROR(INDEX('manual inputs'!M:M,SMALL(IF('manual inputs'!M:M<>\"\",ROW('manual inputs'!M:M)),ROW(13:13))),\"\")","v":""},{"$f":"IF($B18=\"\",\"\",IFERROR(INDEX('quantities report'!$D$2:$D$10003,SMALL(IF('quantities report'!$A$2:$A$10003=C$6,ROW('quantities report'!$A$2:$A$10003)-1,\"\"),ROWS($B$8:$B18))),\"0\"))","v":""},{"$f":"IF($B18=\"\",\"\",IFERROR(INDEX('quantities report'!$D$2:$D$10003,SMALL(IF('quantities report'!$A$2:$A$10003=D$6,ROW('quantities report'!$A$2:$A$10003)-1,\"\"),ROWS($B$8:$B18))),\"0\"))","v":""},{"$f":"IF($B18=\"\",\"\",IFERROR(INDEX('quantities report'!$D$2:$D$10003,SMALL(IF('quantities report'!$A$2:$A$10003=E$6,ROW('quantities report'!$A$2:$A$10003)-1,\"\"),ROWS($B$8:$B18))),\"0\"))","v":""},{"$f":"IF($B18=\"\",\"\",IFERROR(INDEX('quantities report'!$D$2:$D$10003,SMALL(IF('quantities report'!$A$2:$A$10003=F$6,ROW('quantities report'!$A$2:$A$10003)-1,\"\"),ROWS($B$8:$B18))),\"0\"))","v":""},{"$f":"IF($B18=\"\",\"\",IFERROR(INDEX('quantities report'!$D$2:$D$10003,SMALL(IF('quantities report'!$A$2:$A$10003=G$6,ROW('quantities report'!$A$2:$A$10003)-1,\"\"),ROWS($B$8:$B18))),\"0\"))","v":""},{"$f":"IF($B18=\"\",\"\",IFERROR(INDEX('quantities report'!$D$2:$D$10003,SMALL(IF('quantities report'!$A$2:$A$10003=H$6,ROW('quantities report'!$A$2:$A$10003)-1,\"\"),ROWS($B$8:$B18))),\"0\"))","v":""},{"$f":"IF(B18=\"\",\"\",SUM(C18:H18))","v":""}]
[null,{"$f":"IFERROR(INDEX('manual inputs'!M:M,SMALL(IF('manual inputs'!M:M<>\"\",ROW('manual inputs'!M:M)),ROW(14:14))),\"\")","v":""},{"$f":"IF($B19=\"\",\"\",IFERROR(INDEX('quantities report'!$D$2:$D$10003,SMALL(IF('quantities report'!$A$2:$A$10003=C$6,ROW('quantities report'!$A$2:$A$10003)-1,\"\"),ROWS($B$8:$B19))),\"0\"))","v":""},{"$f":"IF($B19=\"\",\"\",IFERROR(INDEX('quantities report'!$D$2:$D$10003,SMALL(IF('quantities report'!$A$2:$A$10003=D$6,ROW('quantities report'!$A$2:$A$10003)-1,\"\"),ROWS($B$8:$B19))),\"0\"))","v":""},{"$f":"IF($B19=\"\",\"\",IFERROR(INDEX('quantities report'!$D$2:$D$10003,SMALL(IF('quantities report'!$A$2:$A$10003=E$6,ROW('quantities report'!$A$2:$A$10003)-1,\"\"),ROWS($B$8:$B19))),\"0\"))","v":""},{"$f":"IF($B19=\"\",\"\",IFERROR(INDEX('quantities report'!$D$2:$D$10003,SMALL(IF('quantities report'!$A$2:$A$10003=F$6,ROW('quantities report'!$A$2:$A$10003)-1,\"\"),ROWS($B$8:$B19))),\"0\"))","v":""},{"$f":"IF($B19=\"\",\"\",IFERROR(INDEX('quantities report'!$D$2:$D$10003,SMALL(IF('quantities report'!$A$2:$A$10003=G$6,ROW('quantities report'!$A$2:$A$10003)-1,\"\"),ROWS($B$8:$B19))),\"0\"))","v":""},{"$f":"IF($B19=\"\",\"\",IFERROR(INDEX('quantities report'!$D$2:$D$10003,SMALL(IF('quantities report'!$A$2:$A$10003=H$6,ROW('quantities report'!$A$2:$A$10003)-1,\"\"),ROWS($B$8:$B19))),\"0\"))","v":""},{"$f":"IF(B19=\"\",\"\",SUM(C19:H19))","v":""}]
[null,{"$f":"IFERROR(INDEX('manual inputs'!M:M,SMALL(IF('manual inputs'!M:M<>\"\",ROW('manual inputs'!M:M)),ROW(15:15))),\"\")","v":""},{"$f":"IF($B20=\"\",\"\",IFERROR(INDEX('quantities report'!$D$2:$D$10003,SMALL(IF('quantities report'!$A$2:$A$10003=C$6,ROW('quantities report'!$A$2:$A$10003)-1,\"\"),ROWS($B$8:$B20))),\"0\"))","v":""},{"$f":"IF($B20=\"\",\"\",IFERROR(INDEX('quantities report'!$D$2:$D$10003,SMALL(IF('quantities report'!$A$2:$A$10003=D$6,ROW('quantities report'!$A$2:$A$10003)-1,\"\"),ROWS($B$8:$B20))),\"0\"))","v":""},{"$f":"IF($B20=\"\",\"\",IFERROR(INDEX('quantities report'!$D$2:$D$10003,SMALL(IF('quantities report'!$A$2:$A$10003=E$6,ROW('quantities report'!$A$2:$A$10003)-1,\"\"),ROWS($B$8:$B20))),\"0\"))","v":""},{"$f":"IF($B20=\"\",\"\",IFERROR(INDEX('quantities report'!$D$2:$D$10003,SMALL(IF('quantities report'!$A$2:$A$10003=F$6,ROW('quantities report'!$A$2:$A$10003)-1,\"\"),ROWS($B$8:$B20))),\"0\"))","v":""},{"$f":"IF($B20=\"\",\"\",IFERROR(INDEX('quantities report'!$D$2:$D$10003,SMALL(IF('quantities report'!$A$2:$A$10003=G$6,ROW('quantities report'!$A$2:$A$10003)-1,\"\"),ROWS($B$8:$B20))),\"0\"))","v":""},{"$f":"IF($B20=\"\",\"\",IFERROR(INDEX('quantities report'!$D$2:$D$10003,SMALL(IF('quantities report'!$A$2:$A$10003=H$6,ROW('quantities report'!$A$2:$A$10003)-1,\"\"),ROWS($B$8:$B20))),\"0\"))","v":""},{"$f":"IF(B20=\"\",\"\",SUM(C20:H20))","v":""}]
[null,{"$f":"IFERROR(INDEX('manual inputs'!M:M,SMALL(IF('manual inputs'!M:M<>\"\",ROW('manual inputs'!M:M)),ROW(16:16))),\"\")","v":""},{"$f":"IF($B21=\"\",\"\",IFERROR(INDEX('quantities report'!$D$2:$D$10003,SMALL(IF('quantities report'!$A$2:$A$10003=C$6,ROW('quantities report'!$A$2:$A$10003)-1,\"\"),ROWS($B$8:$B21))),\"0\"))","v":""},{"$f":"IF($B21=\"\",\"\",IFERROR(INDEX('quantities report'!$D$2:$D$10003,SMALL(IF('quantities report'!$A$2:$A$10003=D$6,ROW('quantities report'!$A$2:$A$10003)-1,\"\"),ROWS($B$8:$B21))),\"0\"))","v":""},{"$f":"IF($B21=\"\",\"\",IFERROR(INDEX('quantities report'!$D$2:$D$10003,SMALL(IF('quantities report'!$A$2:$A$10003=E$6,ROW('quantities report'!$A$2:$A$10003)-1,\"\"),ROWS($B$8:$B21))),\"0\"))","v":""},{"$f":"IF($B21=\"\",\"\",IFERROR(INDEX('quantities report'!$D$2:$D$10003,SMALL(IF('quantities report'!$A$2:$A$10003=F$6,ROW('quantities report'!$A$2:$A$10003)-1,\"\"),ROWS($B$8:$B21))),\"0\"))","v":""},{"$f":"IF($B21=\"\",\"\",IFERROR(INDEX('quantities report'!$D$2:$D$10003,SMALL(IF('quantities report'!$A$2:$A$10003=G$6,ROW('quantities report'!$A$2:$A$10003)-1,\"\"),ROWS($B$8:$B21))),\"0\"))","v":""},{"$f":"IF($B21=\"\",\"\",IFERROR(INDEX('quantities report'!$D$2:$D$10003,SMALL(IF('quantities report'!$A$2:$A$10003=H$6,ROW('quantities report'!$A$2:$A$10003)-1,\"\"),ROWS($B$8:$B21))),\"0\"))","v":""},{"$f":"IF(B21=\"\",\"\",SUM(C21:H21))","v":""}]
[null,{"$f":"IFERROR(INDEX('manual inputs'!M:M,SMALL(IF('manual inputs'!M:M<>\"\",ROW('manual inputs'!M:M)),ROW(17:17))),\"\")","v":""},{"$f":"IF($B22=\"\",\"\",IFERROR(INDEX('quantities report'!$D$2:$D$10003,SMALL(IF('quantities report'!$A$2:$A$10003=C$6,ROW('quantities report'!$A$2:$A$10003)-1,\"\"),ROWS($B$8:$B22))),\"0\"))","v":""},{"$f":"IF($B22=\"\",\"\",IFERROR(INDEX('quantities report'!$D$2:$D$10003,SMALL(IF('quantities report'!$A$2:$A$10003=D$6,ROW('quantities report'!$A$2:$A$10003)-1,\"\"),ROWS($B$8:$B22))),\"0\"))","v":""},{"$f":"IF($B22=\"\",\"\",IFERROR(INDEX('quantities report'!$D$2:$D$10003,SMALL(IF('quantities report'!$A$2:$A$10003=E$6,ROW('quantities report'!$A$2:$A$10003)-1,\"\"),ROWS($B$8:$B22))),\"0\"))","v":""},{"$f":"IF($B22=\"\",\"\",IFERROR(INDEX('quantities report'!$D$2:$D$10003,SMALL(IF('quantities report'!$A$2:$A$10003=F$6,ROW('quantities report'!$A$2:$A$10003)-1,\"\"),ROWS($B$8:$B22))),\"0\"))","v":""},{"$f":"IF($B22=\"\",\"\",IFERROR(INDEX('quantities report'!$D$2:$D$10003,SMALL(IF('quantities report'!$A$2:$A$10003=G$6,ROW('quantities report'!$A$2:$A$10003)-1,\"\"),ROWS($B$8:$B22))),\"0\"))","v":""},{"$f":"IF($B22=\"\",\"\",IFERROR(INDEX('quantities report'!$D$2:$D$10003,SMALL(IF('quantities report'!$A$2:$A$10003=H$6,ROW('quantities report'!$A$2:$A$10003)-1,\"\"),ROWS($B$8:$B22))),\"0\"))","v":""},{"$f":"IF(B22=\"\",\"\",SUM(C22:H22))","v":""}]
[null,{"$f":"IFERROR(INDEX('manual inputs'!M:M,SMALL(IF('manual inputs'!M:M<>\"\",ROW('manual inputs'!M:M)),ROW(18:18))),\"\")","v":""},{"$f":"IF($B23=\"\",\"\",IFERROR(INDEX('quantities report'!$D$2:$D$10003,SMALL(IF('quantities report'!$A$2:$A$10003=C$6,ROW('quantities report'!$A$2:$A$10003)-1,\"\"),ROWS($B$8:$B23))),\"0\"))","v":""},{"$f":"IF($B23=\"\",\"\",IFERROR(INDEX('quantities report'!$D$2:$D$10003,SMALL(IF('quantities report'!$A$2:$A$10003=D$6,ROW('quantities report'!$A$2:$A$10003)-1,\"\"),ROWS($B$8:$B23))),\"0\"))","v":""},{"$f":"IF($B23=\"\",\"\",IFERROR(INDEX('quantities report'!$D$2:$D$10003,SMALL(IF('quantities report'!$A$2:$A$10003=E$6,ROW('quantities report'!$A$2:$A$10003)-1,\"\"),ROWS($B$8:$B23))),\"0\"))","v":""},{"$f":"IF($B23=\"\",\"\",IFERROR(INDEX('quantities report'!$D$2:$D$10003,SMALL(IF('quantities report'!$A$2:$A$10003=F$6,ROW('quantities report'!$A$2:$A$10003)-1,\"\"),ROWS($B$8:$B23))),\"0\"))","v":""},{"$f":"IF($B23=\"\",\"\",IFERROR(INDEX('quantities report'!$D$2:$D$10003,SMALL(IF('quantities report'!$A$2:$A$10003=G$6,ROW('quantities report'!$A$2:$A$10003)-1,\"\"),ROWS($B$8:$B23))),\"0\"))","v":""},{"$f":"IF($B23=\"\",\"\",IFERROR(INDEX('quantities report'!$D$2:$D$10003,SMALL(IF('quantities report'!$A$2:$A$10003=H$6,ROW('quantities report'!$A$2:$A$10003)-1,\"\"),ROWS($B$8:$B23))),\"0\"))","v":""},{"$f":"IF(B23=\"\",\"\",SUM(C23:H23))","v":""}]
[null,{"$f":"IFERROR(INDEX('manual inputs'!M:M,SMALL(IF('manual inputs'!M:M<>\"\",ROW('manual inputs'!M:M)),ROW(19:19))),\"\")","v":""},{"$f":"IF($B24=\"\",\"\",IFERROR(INDEX('quantities report'!$D$2:$D$10003,SMALL(IF('quantities report'!$A$2:$A$10003=C$6,ROW('quantities report'!$A$2:$A$10003)-1,\"\"),ROWS($B$8:$B24))),\"0\"))","v":""},{"$f":"IF($B24=\"\",\"\",IFERROR(INDEX('quantities report'!$D$2:$D$10003,SMALL(IF('quantities report'!$A$2:$A$10003=D$6,ROW('quantities report'!$A$2:$A$10003)-1,\"\"),ROWS($B$8:$B24))),\"0\"))","v":""},{"$f":"IF($B24=\"\",\"\",IFERROR(INDEX('quantities report'!$D$2:$D$10003,SMALL(IF('quantities report'!$A$2:$A$10003=E$6,ROW('quantities report'!$A$2:$A$10003)-1,\"\"),ROWS($B$8:$B24))),\"0\"))","v":""},{"$f":"IF($B24=\"\",\"\",IFERROR(INDEX('quantities report'!$D$2:$D$10003,SMALL(IF('quantities report'!$A$2:$A$10003=F$6,ROW('quantities report'!$A$2:$A$10003)-1,\"\"),ROWS($B$8:$B24))),\"0\"))","v":""},{"$f":"IF($B24=\"\",\"\",IFERROR(INDEX('quantities report'!$D$2:$D$10003,SMALL(IF('quantities report'!$A$2:$A$10003=G$6,ROW('quantities report'!$A$2:$A$10003)-1,\"\"),ROWS($B$8:$B24))),\"0\"))","v":""},{"$f":"IF($B24=\"\",\"\",IFERROR(INDEX('quantities report'!$D$2:$D$10003,SMALL(IF('quantities report'!$A$2:$A$10003=H$6,ROW('quantities report'!$A$2:$A$10003)-1,\"\"),ROWS($B$8:$B24))),\"0\"))","v":""},{"$f":"IF(B24=\"\",\"\",SUM(C24:H24))","v":""}]
[null,{"$f":"IFERROR(INDEX('manual inputs'!M:M,SMALL(IF('manual inputs'!M:M<>\"\",ROW('manual inputs'!M:M)),ROW(20:20))),\"\")","v":""},{"$f":"IF($B25=\"\",\"\",IFERROR(INDEX('quantities report'!$D$2:$D$10003,SMALL(IF('quantities report'!$A$2:$A$10003=C$6,ROW('quantities report'!$A$2:$A$10003)-1,\"\"),ROWS($B$8:$B25))),\"0\"))","v":""},{"$f":"IF($B25=\"\",\"\",IFERROR(INDEX('quantities report'!$D$2:$D$10003,SMALL(IF('quantities report'!$A$2:$A$10003=D$6,ROW('quantities report'!$A$2:$A$10003)-1,\"\"),ROWS($B$8:$B25))),\"0\"))","v":""},{"$f":"IF($B25=\"\",\"\",IFERROR(INDEX('quantities report'!$D$2:$D$10003,SMALL(IF('quantities report'!$A$2:$A$10003=E$6,ROW('quantities report'!$A$2:$A$10003)-1,\"\"),ROWS($B$8:$B25))),\"0\"))","v":""},{"$f":"IF($B25=\"\",\"\",IFERROR(INDEX('quantities report'!$D$2:$D$10003,SMALL(IF('quantities report'!$A$2:$A$10003=F$6,ROW('quantities report'!$A$2:$A$10003)-1,\"\"),ROWS($B$8:$B25))),\"0\"))","v":""},{"$f":"IF($B25=\"\",\"\",IFERROR(INDEX('quantities report'!$D$2:$D$10003,SMALL(IF('quantities report'!$A$2:$A$10003=G$6,ROW('quantities report'!$A$2:$A$10003)-1,\"\"),ROWS($B$8:$B25))),\"0\"))","v":""},{"$f":"IF($B25=\"\",\"\",IFERROR(INDEX('quantities report'!$D$2:$D$10003,SMALL(IF('quantities report'!$A$2:$A$10003=H$6,ROW('quantities report'!$A$2:$A$10003)-1,\"\"),ROWS($B$8:$B25))),\"0\"))","v":""},{"$f":"IF(B25=\"\",\"\",SUM(C25:H25))","v":""}]
[null,{"$f":"IFERROR(INDEX('manual inputs'!M:M,SMALL(IF('manual inputs'!M:M<>\"\",ROW('manual inputs'!M:M)),ROW(21:21))),\"\")","v":""},{"$f":"IF($B26=\"\",\"\",IFERROR(INDEX('quantities report'!$D$2:$D$10003,SMALL(IF('quantities report'!$A$2:$A$10003=C$6,ROW('quantities report'!$A$2:$A$10003)-1,\"\"),ROWS($B$8:$B26))),\"0\"))","v":""},{"$f":"IF($B26=\"\",\"\",IFERROR(INDEX('quantities report'!$D$2:$D$10003,SMALL(IF('quantities report'!$A$2:$A$10003=D$6,ROW('quantities report'!$A$2:$A$10003)-1,\"\"),ROWS($B$8:$B26))),\"0\"))","v":""},{"$f":"IF($B26=\"\",\"\",IFERROR(INDEX('quantities report'!$D$2:$D$10003,SMALL(IF('quantities report'!$A$2:$A$10003=E$6,ROW('quantities report'!$A$2:$A$10003)-1,\"\"),ROWS($B$8:$B26))),\"0\"))","v":""},{"$f":"IF($B26=\"\",\"\",IFERROR(INDEX('quantities report'!$D$2:$D$10003,SMALL(IF('quantities report'!$A$2:$A$10003=F$6,ROW('quantities report'!$A$2:$A$10003)-1,\"\"),ROWS($B$8:$B26))),\"0\"))","v":""},{"$f":"IF($B26=\"\",\"\",IFERROR(INDEX('quantities report'!$D$2:$D$10003,SMALL(IF('quantities report'!$A$2:$A$10003=G$6,ROW('quantities report'!$A$2:$A$10003)-1,\"\"),ROWS($B$8:$B26))),\"0\"))","v":""},{"$f":"IF($B26=\"\",\"\",IFERROR(INDEX('quantities report'!$D$2:$D$10003,SMALL(IF('quantities report'!$A$2:$A$10003=H$6,ROW('quantities report'!$A$2:$A$10003)-1,\"\"),ROWS($B$8:$B26))),\"0\"))","v":""},{"$f":"IF(B26=\"\",\"\",SUM(C26:H26))","v":""}]
[null,{"$f":"IFERROR(INDEX('manual inputs'!M:M,SMALL(IF('manual inputs'!M:M<>\"\",ROW('manual inputs'!M:M)),ROW(22:22))),\"\")","v":""},{"$f":"IF($B27=\"\",\"\",IFERROR(INDEX('quantities report'!$D$2:$D$10003,SMALL(IF('quantities report'!$A$2:$A$10003=C$6,ROW('quantities report'!$A$2:$A$10003)-1,\"\"),ROWS($B$8:$B27))),\"0\"))","v":""},{"$f":"IF($B27=\"\",\"\",IFERROR(INDEX('quantities report'!$D$2:$D$10003,SMALL(IF('quantities report'!$A$2:$A$10003=D$6,ROW('quantities report'!$A$2:$A$10003)-1,\"\"),ROWS($B$8:$B27))),\"0\"))","v":""},{"$f":"IF($B27=\"\",\"\",IFERROR(INDEX('quantities report'!$D$2:$D$10003,SMALL(IF('quantities report'!$A$2:$A$10003=E$6,ROW('quantities report'!$A$2:$A$10003)-1,\"\"),ROWS($B$8:$B27))),\"0\"))","v":""},{"$f":"IF($B27=\"\",\"\",IFERROR(INDEX('quantities report'!$D$2:$D$10003,SMALL(IF('quantities report'!$A$2:$A$10003=F$6,ROW('quantities report'!$A$2:$A$10003)-1,\"\"),ROWS($B$8:$B27))),\"0\"))","v":""},{"$f":"IF($B27=\"\",\"\",IFERROR(INDEX('quantities report'!$D$2:$D$10003,SMALL(IF('quantities report'!$A$2:$A$10003=G$6,ROW('quantities report'!$A$2:$A$10003)-1,\"\"),ROWS($B$8:$B27))),\"0\"))","v":""},{"$f":"IF($B27=\"\",\"\",IFERROR(INDEX('quantities report'!$D$2:$D$10003,SMALL(IF('quantities report'!$A$2:$A$10003=H$6,ROW('quantities report'!$A$2:$A$10003)-1,\"\"),ROWS($B$8:$B27))),\"0\"))","v":""},{"$f":"IF(B27=\"\",\"\",SUM(C27:H27))","v":""}]
[null,{"$f":"IFERROR(INDEX('manual inputs'!M:M,SMALL(IF('manual inputs'!M:M<>\"\",ROW('manual inputs'!M:M)),ROW(23:23))),\"\")","v":""},{"$f":"IF($B28=\"\",\"\",IFERROR(INDEX('quantities report'!$D$2:$D$10003,SMALL(IF('quantities report'!$A$2:$A$10003=C$6,ROW('quantities report'!$A$2:$A$10003)-1,\"\"),ROWS($B$8:$B28))),\"0\"))","v":""},{"$f":"IF($B28=\"\",\"\",IFERROR(INDEX('quantities report'!$D$2:$D$10003,SMALL(IF('quantities report'!$A$2:$A$10003=D$6,ROW('quantities report'!$A$2:$A$10003)-1,\"\"),ROWS($B$8:$B28))),\"0\"))","v":""},{"$f":"IF($B28=\"\",\"\",IFERROR(INDEX('quantities report'!$D$2:$D$10003,SMALL(IF('quantities report'!$A$2:$A$10003=E$6,ROW('quantities report'!$A$2:$A$10003)-1,\"\"),ROWS($B$8:$B28))),\"0\"))","v":""},{"$f":"IF($B28=\"\",\"\",IFERROR(INDEX('quantities report'!$D$2:$D$10003,SMALL(IF('quantities report'!$A$2:$A$10003=F$6,ROW('quantities report'!$A$2:$A$10003)-1,\"\"),ROWS($B$8:$B28))),\"0\"))","v":""},{"$f":"IF($B28=\"\",\"\",IFERROR(INDEX('quantities report'!$D$2:$D$10003,SMALL(IF('quantities report'!$A$2:$A$10003=G$6,ROW('quantities report'!$A$2:$A$10003)-1,\"\"),ROWS($B$8:$B28))),\"0\"))","v":""},{"$f":"IF($B28=\"\",\"\",IFERROR(INDEX('quantities report'!$D$2:$D$10003,SMALL(IF('quantities report'!$A$2:$A$10003=H$6,ROW('quantities report'!$A$2:$A$10003)-1,\"\"),ROWS($B$8:$B28))),\"0\"))","v":""},{"$f":"IF(B28=\"\",\"\",SUM(C28:H28))","v":""}]
[null,{"$f":"IFERROR(INDEX('manual inputs'!M:M,SMALL(IF('manual inputs'!M:M<>\"\",ROW('manual inputs'!M:M)),ROW(24:24))),\"\")","v":""},{"$f":"IF($B29=\"\",\"\",IFERROR(INDEX('quantities report'!$D$2:$D$10003,SMALL(IF('quantities report'!$A$2:$A$10003=C$6,ROW('quantities report'!$A$2:$A$10003)-1,\"\"),ROWS($B$8:$B29))),\"0\"))","v":""},{"$f":"IF($B29=\"\",\"\",IFERROR(INDEX('quantities report'!$D$2:$D$10003,SMALL(IF('quantities report'!$A$2:$A$10003=D$6,ROW('quantities report'!$A$2:$A$10003)-1,\"\"),ROWS($B$8:$B29))),\"0\"))","v":""},{"$f":"IF($B29=\"\",\"\",IFERROR(INDEX('quantities report'!$D$2:$D$10003,SMALL(IF('quantities report'!$A$2:$A$10003=E$6,ROW('quantities report'!$A$2:$A$10003)-1,\"\"),ROWS($B$8:$B29))),\"0\"))","v":""},{"$f":"IF($B29=\"\",\"\",IFERROR(INDEX('quantities report'!$D$2:$D$10003,SMALL(IF('quantities report'!$A$2:$A$10003=F$6,ROW('quantities report'!$A$2:$A$10003)-1,\"\"),ROWS($B$8:$B29))),\"0\"))","v":""},{"$f":"IF($B29=\"\",\"\",IFERROR(INDEX('quantities report'!$D$2:$D$10003,SMALL(IF('quantities report'!$A$2:$A$10003=G$6,ROW('quantities report'!$A$2:$A$10003)-1,\"\"),ROWS($B$8:$B29))),\"0\"))","v":""},{"$f":"IF($B29=\"\",\"\",IFERROR(INDEX('quantities report'!$D$2:$D$10003,SMALL(IF('quantities report'!$A$2:$A$10003=H$6,ROW('quantities report'!$A$2:$A$10003)-1,\"\"),ROWS($B$8:$B29))),\"0\"))","v":""},{"$f":"IF(B29=\"\",\"\",SUM(C29:H29))","v":""}]
[null,{"$f":"IFERROR(INDEX('manual inputs'!M:M,SMALL(IF('manual inputs'!M:M<>\"\",ROW('manual inputs'!M:M)),ROW(25:25))),\"\")","v":""},{"$f":"IF($B30=\"\",\"\",IFERROR(INDEX('quantities report'!$D$2:$D$10003,SMALL(IF('quantities report'!$A$2:$A$10003=C$6,ROW('quantities report'!$A$2:$A$10003)-1,\"\"),ROWS($B$8:$B30))),\"0\"))","v":""},{"$f":"IF($B30=\"\",\"\",IFERROR(INDEX('quantities report'!$D$2:$D$10003,SMALL(IF('quantities report'!$A$2:$A$10003=D$6,ROW('quantities report'!$A$2:$A$10003)-1,\"\"),ROWS($B$8:$B30))),\"0\"))","v":""},{"$f":"IF($B30=\"\",\"\",IFERROR(INDEX('quantities report'!$D$2:$D$10003,SMALL(IF('quantities report'!$A$2:$A$10003=E$6,ROW('quantities report'!$A$2:$A$10003)-1,\"\"),ROWS($B$8:$B30))),\"0\"))","v":""},{"$f":"IF($B30=\"\",\"\",IFERROR(INDEX('quantities report'!$D$2:$D$10003,SMALL(IF('quantities report'!$A$2:$A$10003=F$6,ROW('quantities report'!$A$2:$A$10003)-1,\"\"),ROWS($B$8:$B30))),\"0\"))","v":""},{"$f":"IF($B30=\"\",\"\",IFERROR(INDEX('quantities report'!$D$2:$D$10003,SMALL(IF('quantities report'!$A$2:$A$10003=G$6,ROW('quantities report'!$A$2:$A$10003)-1,\"\"),ROWS($B$8:$B30))),\"0\"))","v":""},{"$f":"IF($B30=\"\",\"\",IFERROR(INDEX('quantities report'!$D$2:$D$10003,SMALL(IF('quantities report'!$A$2:$A$10003=H$6,ROW('quantities report'!$A$2:$A$10003)-1,\"\"),ROWS($B$8:$B30))),\"0\"))","v":""},{"$f":"IF(B30=\"\",\"\",SUM(C30:H30))","v":""}]
[null,{"$f":"IFERROR(INDEX('manual inputs'!M:M,SMALL(IF('manual inputs'!M:M<>\"\",ROW('manual inputs'!M:M)),ROW(27:27))),\"\")","v":""},{"$f":"IF($B31=\"\",\"\",IFERROR(INDEX('quantities report'!$D$2:$D$10003,SMALL(IF('quantities report'!$A$2:$A$10003=C$6,ROW('quantities report'!$A$2:$A$10003)-1,\"\"),ROWS($B$8:$B31))),\"0\"))","v":""},{"$f":"IF($B31=\"\",\"\",IFERROR(INDEX('quantities report'!$D$2:$D$10003,SMALL(IF('quantities report'!$A$2:$A$10003=D$6,ROW('quantities report'!$A$2:$A$10003)-1,\"\"),ROWS($B$8:$B31))),\"0\"))","v":""},{"$f":"IF($B31=\"\",\"\",IFERROR(INDEX('quantities report'!$D$2:$D$10003,SMALL(IF('quantities report'!$A$2:$A$10003=E$6,ROW('quantities report'!$A$2:$A$10003)-1,\"\"),ROWS($B$8:$B31))),\"0\"))","v":""},{"$f":"IF($B31=\"\",\"\",IFERROR(INDEX('quantities report'!$D$2:$D$10003,SMALL(IF('quantities report'!$A$2:$A$10003=F$6,ROW('quantities report'!$A$2:$A$10003)-1,\"\"),ROWS($B$8:$B31))),\"0\"))","v":""},{"$f":"IF($B31=\"\",\"\",IFERROR(INDEX('quantities report'!$D$2:$D$10003,SMALL(IF('quantities report'!$A$2:$A$10003=G$6,ROW('quantities report'!$A$2:$A$10003)-1,\"\"),ROWS($B$8:$B31))),\"0\"))","v":""},{"$f":"IF($B31=\"\",\"\",IFERROR(INDEX('quantities report'!$D$2:$D$10003,SMALL(IF('quantities report'!$A$2:$A$10003=H$6,ROW('quantities report'!$A$2:$A$10003)-1,\"\"),ROWS($B$8:$B31))),\"0\"))","v":""},{"$f":"IF(B31=\"\",\"\",SUM(C31:H31))","v":""}]
[null,{"$f":"IFERROR(INDEX(#REF!,SMALL(IF(#REF!<>\"\",ROW(#REF!)),ROW(27:27))),\"\")","v":""}]

{"sheet":"Backfill","index":7,"n_rows":32,"n_cols":21,"rows_kept":32,"cut":false,"hidden":false,"merged":[[3,2,3,18],[4,3,5,3],[4,7,5,7],[4,17,5,17],[4,20,5,20]]}
[]
[]
["TOTALS",null,{"$f":"SUM(C8:C32)","v":0},null,{"$f":"SUM(E8:E32)","v":0},{"$f":"SUM(F8:F32)","v":0},null,null,0,0,0,0,0,{"$f":"SUM(N8:N32)","v":0},{"$f":"SUM(O8:O32)","v":0},0,0,null,0,0]
[]
[null,null,"Parapet\n(+)\nCommon Backfill ","Total Common Backfill (+)","Parapet\n(+)\nFoundation\nFill","Rockery\n(+)\nFoundation\nFill","MSE\n(+)\nFoundation\nFill","Total Foundation Fill (+)","(+)\nSelect Granular\nBackfill","(+)\nRock","(+)\nGranular\nRock Backdrain","Parapet\n(+)\nStructural Backfill","MSE\n(+)\nCommon Backfill","MSE\n(+)\nCommon Backfill","(+)\nCommon Backfill","Parapet\n(+)\nCommon Backfill","(+)\nCommon Backfill","Total Common Backfill (+)","(+)\nSelect Granular\nBackfill","(+)\nGranular\nRock Backdrain","Total Granular Backfill (+)"]
["ORD Component Name",null,"Wall backfill: ",null,"Wall Foundation: ","Rockery Wall Foundation Backfill: ","MSE Wall Foundation: ",null,"MSE Wall Backfill 2: ","Rockery Wall Backfill: ","Rockery Wall Backfill 2: ","Wall Backfill 2: ","MSE Wall Backfill 3:","MSE Wall Front:","Soil Nail Wall Backfill: ","Wall Backfill Top: ","Guard Wall Backfill 1: ",null,"MSE Wall Backfill 1: ","Rockery Wall Backfill 2: "]
["Enter Start of Project",{"$f":"IFERROR(INDEX('manual inputs'!M:M,SMALL(IF('manual inputs'!M:M<>\"\",ROW('manual inputs'!M:M)),ROW(2:2))),\"\")","v":""}]
[null,{"$f":"IFERROR(INDEX('manual inputs'!M:M,SMALL(IF('manual inputs'!M:M<>\"\",ROW('manual inputs'!M:M)),ROW(3:3))),\"\")","v":""},{"$f":"IF($B8=\"\",\"\",IFERROR(INDEX('quantities report'!$D$2:$D$10003,SMALL(IF('quantities report'!$A$2:$A$10003=C$6,ROW('quantities report'!$A$2:$A$10003)-1,\"\"),ROWS($B$8:$B8))),\"0\"))","v":""},{"$f":"IF($B8=\"\",\"\",SUM(C8:C8))","v":""},{"$f":"IF($B8=\"\",\"\",IFERROR(INDEX('quantities report'!$D$2:$D$10003,SMALL(IF('quantities report'!$A$2:$A$10003=E$6,ROW('quantities report'!$A$2:$A$10003)-1,\"\"),ROWS($B$8:$B8))),\"0\"))","v":""},{"$f":"IF($B8=\"\",\"\",IFERROR(INDEX('quantities report'!$D$2:$D$10003,SMALL(IF('quantities report'!$A$2:$A$10003=F$6,ROW('quantities report'!$A$2:$A$10003)-1,\"\"),ROWS($B$8:$B8))),\"0\"))","v":""},{"$f":"IF($B8=\"\",\"\",IFERROR(INDEX('quantities report'!$D$2:$D$10003,SMALL(IF('quantities report'!$A$2:$A$10003=G$6,ROW('quantities report'!$A$2:$A$10003)-1,\"\"),ROWS($B$8:$B8))),\"0\"))","v":""},{"$f":"IF($B8=\"\",\"\",SUM(E8:G8))","v":""},{"$f":"IF($B8=\"\",\"\",IFERROR(INDEX('quantities report'!$D$2:$D$10003,SMALL(IF('quantities report'!$A$2:$A$10003=I$6,ROW('quantities report'!$A$2:$A$10003)-1,\"\"),ROWS($B$8:$B8))),\"0\"))","v":""},{"$f":"IF($B8=\"\",\"\",IFERROR(INDEX('quantities report'!$D$2:$D$10003,SMALL(IF('quantities report'!$A$2:$A$10003=J$6,ROW('quantities report'!$A$2:$A$10003)-1,\"\"),ROWS($B$8:$B8))),\"0\"))","v":""},{"$f":"IF($B8=\"\",\"\",IFERROR(INDEX('quantities report'!$D$2:$D$10003,SMALL(IF('quantities report'!$A$2:$A$10003=K$6,ROW('quantities report'!$A$2:$A$10003)-1,\"\"),ROWS($B$8:$B8))),\"0\"))","v":""},{"$f":"IF($B8=\"\",\"\",IFERROR(INDEX('quantities report'!$D$2:$D$10003,SMALL(IF('quantities report'!$A$2:$A$10003=L$6,ROW('quantities report'!$A$2:$A$10003)-1,\"\"),ROWS($B$8:$B8))),\"0\"))","v":""},null,null,{"$f":"IF($B8=\"\",\"\",IFERROR(INDEX('quantities report'!$D$2:$D$10003,SMALL(IF('quantities report'!$A$2:$A$10003=O$6,ROW('quantities report'!$A$2:$A$10003)-1,\"\"),ROWS($B$8:$B8))),\"0\"))","v":""},{"$f":"IF($B8=\"\",\"\",IFERROR(INDEX('quantities report'!$D$2:$D$10003,SMALL(IF('quantities report'!$A$2:$A$10003=P$6,ROW('quantities report'!$A$2:$A$10003)-1,\"\"),ROWS($B$8:$B8))),\"0\"))","v":""},{"$f":"IF($B8=\"\",\"\",IFERROR(INDEX('quantities report'!$D$2:$D$10003,SMALL(IF('quantities report'!$A$2:$A$10003=Q$6,ROW('quantities report'!$A$2:$A$10003)-1,\"\"),ROWS($B$8:$B8))),\"0\"))","v":""},{"$f":"IF($B8=\"\",\"\",SUM(M8:Q8))","v":""},{"$f":"IF($B8=\"\",\"\",IFERROR(INDEX('quantities report'!$D$2:$D$10003,SMALL(IF('quantities report'!$A$2:$A$10003=S$6,ROW('quantities report'!$A$2:$A$10003)-1,\"\"),ROWS($B$8:$B8))),\"0\"))","v":""},null,{"$f":"IF($B8=\"\",\"\",SUM(S8:T8))","v":""}]
[null,{"$f":"IFERROR(INDEX('manual inputs'!M:M,SMALL(IF('manual inputs'!M:M<>\"\",ROW('manual inputs'!M:M)),ROW(4:4))),\"\")","v":""},{"$f":"IF($B9=\"\",\"\",IFERROR(INDEX('quantities report'!$D$2:$D$10003,SMALL(IF('quantities report'!$A$2:$A$10003=C$6,ROW('quantities report'!$A$2:$A$10003)-1,\"\"),ROWS($B$8:$B9))),\"0\"))","v":""},"",{"$f":"IF($B9=\"\",\"\",IFERROR(INDEX('quantities report'!$D$2:$D$10003,SMALL(IF('quantities report'!$A$2:$A$10003=E$6,ROW('quantities report'!$A$2:$A$10003)-1,\"\"),ROWS($B$8:$B9))),\"0\"))","v":""},{"$f":"IF($B9=\"\",\"\",IFERROR(INDEX('quantities report'!$D$2:$D$10003,SMALL(IF('quantities report'!$A$2:$A$10003=F$6,ROW('quantities report'!$A$2:$A$10003)-1,\"\"),ROWS($B$8:$B9))),\"0\"))","v":""},null,{"$f":"IF($B9=\"\",\"\",SUM(E9:G9))","v":""},{"$f":"IF($B9=\"\",\"\",IFERROR(INDEX('quantities report'!$D$2:$D$10003,SMALL(IF('quantities report'!$A$2:$A$10003=I$6,ROW('quantities report'!$A$2:$A$10003)-1,\"\"),ROWS($B$8:$B9))),\"0\"))","v":""},{"$f":"IF($B9=\"\",\"\",IFERROR(INDEX('quantities report'!$D$2:$D$10003,SMALL(IF('quantities report'!$A$2:$A$10003=J$6,ROW('quantities report'!$A$2:$A$10003)-1,\"\"),ROWS($B$8:$B9))),\"0\"))","v":""},{"$f":"IF($B9=\"\",\"\",IFERROR(INDEX('quantities report'!$D$2:$D$10003,SMALL(IF('quantities report'!$A$2:$A$10003=K$6,ROW('quantities report'!$A$2:$A$10003)-1,\"\"),ROWS($B$8:$B9))),\"0\"))","v":""},{"$f":"IF($B9=\"\",\"\",IFERROR(INDEX('quantities report'!$D$2:$D$10003,SMALL(IF('quantities report'!$A$2:$A$10003=L$6,ROW('quantities report'!$A$2:$A$10003)-1,\"\"),ROWS($B$8:$B9))),\"0\"))","v":""},null,null,{"$f":"IF($B9=\"\",\"\",IFERROR(INDEX('quantities report'!$D$2:$D$10003,SMALL(IF('quantities report'!$A$2:$A$10003=O$6,ROW('quantities report'!$A$2:$A$10003)-1,\"\"),ROWS($B$8:$B9))),\"0\"))","v":""},{"$f":"IF($B9=\"\",\"\",IFERROR(INDEX('quantities report'!$D$2:$D$10003,SMALL(IF('quantities report'!$A$2:$A$10003=P$6,ROW('quantities report'!$A$2:$A$10003)-1,\"\"),ROWS($B$8:$B9))),\"0\"))","v":""},{"$f":"IF($B9=\"\",\"\",IFERROR(INDEX('quantities report'!$D$2:$D$10003,SMALL(IF('quantities report'!$A$2:$A$10003=Q$6,ROW('quantities report'!$A$2:$A$10003)-1,\"\"),ROWS($B$8:$B9))),\"0\"))","v":""},{"$f":"IF($B9=\"\",\"\",SUM(M9:Q9))","v":""},{"$f":"IF($B9=\"\",\"\",IFERROR(INDEX('quantities report'!$D$2:$D$10003,SMALL(IF('quantities report'!$A$2:$A$10003=S$6,ROW('quantities report'!$A$2:$A$10003)-1,\"\"),ROWS($B$8:$B9))),\"0\"))","v":""},null,{"$f":"IF($B9=\"\",\"\",SUM(R9:T9))","v":""}]
[null,{"$f":"IFERROR(INDEX('manual inputs'!M:M,SMALL(IF('manual inputs'!M:M<>\"\",ROW('manual inputs'!M:M)),ROW(5:5))),\"\")","v":""},{"$f":"IF($B10=\"\",\"\",IFERROR(INDEX('quantities report'!$D$2:$D$10003,SMALL(IF('quantities report'!$A$2:$A$10003=C$6,ROW('quantities report'!$A$2:$A$10003)-1,\"\"),ROWS($B$8:$B10))),\"0\"))","v":""},"",{"$f":"IF($B10=\"\",\"\",IFERROR(INDEX('quantities report'!$D$2:$D$10003,SMALL(IF('quantities report'!$A$2:$A$10003=E$6,ROW('quantities report'!$A$2:$A$10003)-1,\"\"),ROWS($B$8:$B10))),\"0\"))","v":""},{"$f":"IF($B10=\"\",\"\",IFERROR(INDEX('quantities report'!$D$2:$D$10003,SMALL(IF('quantities report'!$A$2:$A$10003=F$6,ROW('quantities report'!$A$2:$A$10003)-1,\"\"),ROWS($B$8:$B10))),\"0\"))","v":""},null,"",{"$f":"IF($B10=\"\",\"\",IFERROR(INDEX('quantities report'!$D$2:$D$10003,SMALL(IF('quantities report'!$A$2:$A$10003=I$6,ROW('quantities report'!$A$2:$A$10003)-1,\"\"),ROWS($B$8:$B10))),\"0\"))","v":""},{"$f":"IF($B10=\"\",\"\",IFERROR(INDEX('quantities report'!$D$2:$D$10003,SMALL(IF('quantities report'!$A$2:$A$10003=J$6,ROW('quantities report'!$A$2:$A$10003)-1,\"\"),ROWS($B$8:$B10))),\"0\"))","v":""},{"$f":"IF($B10=\"\",\"\",IFERROR(INDEX('quantities report'!$D$2:$D$10003,SMALL(IF('quantities report'!$A$2:$A$10003=K$6,ROW('quantities report'!$A$2:$A$10003)-1,\"\"),ROWS($B$8:$B10))),\"0\"))","v":""},{"$f":"IF($B10=\"\",\"\",IFERROR(INDEX('quantities report'!$D$2:$D$10003,SMALL(IF('quantities report'!$A$2:$A$10003=L$6,ROW('quantities report'!$A$2:$A$10003)-1,\"\"),ROWS($B$8:$B10))),\"0\"))","v":""},null,null,{"$f":"IF($B10=\"\",\"\",IFERROR(INDEX('quantities report'!$D$2:$D$10003,SMALL(IF('quantities report'!$A$2:$A$10003=O$6,ROW('quantities report'!$A$2:$A$10003)-1,\"\"),ROWS($B$8:$B10))),\"0\"))","v":""},{"$f":"IF($B10=\"\",\"\",IFERROR(INDEX('quantities report'!$D$2:$D$10003,SMALL(IF('quantities report'!$A$2:$A$10003=P$6,ROW('quantities report'!$A$2:$A$10003)-1,\"\"),ROWS($B$8:$B10))),\"0\"))","v":""},{"$f":"IF($B10=\"\",\"\",IFERROR(INDEX('quantities report'!$D$2:$D$10003,SMALL(IF('quantities report'!$A$2:$A$10003=Q$6,ROW('quantities report'!$A$2:$A$10003)-1,\"\"),ROWS($B$8:$B10))),\"0\"))","v":""},"",{"$f":"IF($B10=\"\",\"\",IFERROR(INDEX('quantities report'!$D$2:$D$10003,SMALL(IF('quantities report'!$A$2:$A$10003=S$6,ROW('quantities report'!$A$2:$A$10003)-1,\"\"),ROWS($B$8:$B10))),\"0\"))","v":""},null,""]
[null,{"$f":"IFERROR(INDEX('manual inputs'!M:M,SMALL(IF('manual inputs'!M:M<>\"\",ROW('manual inputs'!M:M)),ROW(6:6))),\"\")","v":""},{"$f":"IF($B11=\"\",\"\",IFERROR(INDEX('quantities report'!$D$2:$D$10003,SMALL(IF('quantities report'!$A$2:$A$10003=C$6,ROW('quantities report'!$A$2:$A$10003)-1,\"\"),ROWS($B$8:$B11))),\"0\"))","v":""},"",{"$f":"IF($B11=\"\",\"\",IFERROR(INDEX('quantities report'!$D$2:$D$10003,SMALL(IF('quantities report'!$A$2:$A$10003=E$6,ROW('quantities report'!$A$2:$A$10003)-1,\"\"),ROWS($B$8:$B11))),\"0\"))","v":""},{"$f":"IF($B11=\"\",\"\",IFERROR(INDEX('quantities report'!$D$2:$D$10003,SMALL(IF('quantities report'!$A$2:$A$10003=F$6,ROW('quantities report'!$A$2:$A$10003)-1,\"\"),ROWS($B$8:$B11))),\"0\"))","v":""},null,"",{"$f":"IF($B11=\"\",\"\",IFERROR(INDEX('quantities report'!$D$2:$D$10003,SMALL(IF('quantities report'!$A$2:$A$10003=I$6,ROW('quantities report'!$A$2:$A$10003)-1,\"\"),ROWS($B$8:$B11))),\"0\"))","v":""},{"$f":"IF($B11=\"\",\"\",IFERROR(INDEX('quantities report'!$D$2:$D$10003,SMALL(IF('quantities report'!$A$2:$A$10003=J$6,ROW('quantities report'!$A$2:$A$10003)-1,\"\"),ROWS($B$8:$B11))),\"0\"))","v":""},{"$f":"IF($B11=\"\",\"\",IFERROR(INDEX('quantities report'!$D$2:$D$10003,SMALL(IF('quantities report'!$A$2:$A$10003=K$6,ROW('quantities report'!$A$2:$A$10003)-1,\"\"),ROWS($B$8:$B11))),\"0\"))","v":""},{"$f":"IF($B11=\"\",\"\",IFERROR(INDEX('quantities report'!$D$2:$D$10003,SMALL(IF('quantities report'!$A$2:$A$10003=L$6,ROW('quantities report'!$A$2:$A$10003)-1,\"\"),ROWS($B$8:$B11))),\"0\"))","v":""},null,null,{"$f":"IF($B11=\"\",\"\",IFERROR(INDEX('quantities report'!$D$2:$D$10003,SMALL(IF('quantities report'!$A$2:$A$10003=O$6,ROW('quantities report'!$A$2:$A$10003)-1,\"\"),ROWS($B$8:$B11))),\"0\"))","v":""},{"$f":"IF($B11=\"\",\"\",IFERROR(INDEX('quantities report'!$D$2:$D$10003,SMALL(IF('quantities report'!$A$2:$A$10003=P$6,ROW('quantities report'!$A$2:$A$10003)-1,\"\"),ROWS($B$8:$B11))),\"0\"))","v":""},{"$f":"IF($B11=\"\",\"\",IFERROR(INDEX('quantities report'!$D$2:$D$10003,SMALL(IF('quantities report'!$A$2:$A$10003=Q$6,ROW('quantities report'!$A$2:$A$10003)-1,\"\"),ROWS($B$8:$B11))),\"0\"))","v":""},"",{"$f":"IF($B11=\"\",\"\",IFERROR(INDEX('quantities report'!$D$2:$D$10003,SMALL(IF('quantities report'!$A$2:$A$10003=S$6,ROW('quantities report'!$A$2:$A$10003)-1,\"\"),ROWS($B$8:$B11))),\"0\"))","v":""},null,""]
[null,{"$f":"IFERROR(INDEX('manual inputs'!M:M,SMALL(IF('manual inputs'!M:M<>\"\",ROW('manual inputs'!M:M)),ROW(7:7))),\"\")","v":""},{"$f":"IF($B12=\"\",\"\",IFERROR(INDEX('quantities report'!$D$2:$D$10003,SMALL(IF('quantities report'!$A$2:$A$10003=C$6,ROW('quantities report'!$A$2:$A$10003)-1,\"\"),ROWS($B$8:$B12))),\"0\"))","v":""},"",{"$f":"IF($B12=\"\",\"\",IFERROR(INDEX('quantities report'!$D$2:$D$10003,SMALL(IF('quantities report'!$A$2:$A$10003=E$6,ROW('quantities report'!$A$2:$A$10003)-1,\"\"),ROWS($B$8:$B12))),\"0\"))","v":""},{"$f":"IF($B12=\"\",\"\",IFERROR(INDEX('quantities report'!$D$2:$D$10003,SMALL(IF('quantities report'!$A$2:$A$10003=F$6,ROW('quantities report'!$A$2:$A$10003)-1,\"\"),ROWS($B$8:$B12))),\"0\"))","v":""},null,"",{"$f":"IF($B12=\"\",\"\",IFERROR(INDEX('quantities report'!$D$2:$D$10003,SMALL(IF('quantities report'!$A$2:$A$10003=I$6,ROW('quantities report'!$A$2:$A$10003)-1,\"\"),ROWS($B$8:$B12))),\"0\"))","v":""},{"$f":"IF($B12=\"\",\"\",IFERROR(INDEX('quantities report'!$D$2:$D$10003,SMALL(IF('quantities report'!$A$2:$A$10003=J$6,ROW('quantities report'!$A$2:$A$10003)-1,\"\"),ROWS($B$8:$B12))),\"0\"))","v":""},{"$f":"IF($B12=\"\",\"\",IFERROR(INDEX('quantities report'!$D$2:$D$10003,SMALL(IF('quantities report'!$A$2:$A$10003=K$6,ROW('quantities report'!$A$2:$A$10003)-1,\"\"),ROWS($B$8:$B12))),\"0\"))","v":""},{"$f":"IF($B12=\"\",\"\",IFERROR(INDEX('quantities report'!$D$2:$D$10003,SMALL(IF('quantities report'!$A$2:$A$10003=L$6,ROW('quantities report'!$A$2:$A$10003)-1,\"\"),ROWS($B$8:$B12))),\"0\"))","v":""},null,null,{"$f":"IF($B12=\"\",\"\",IFERROR(INDEX('quantities report'!$D$2:$D$10003,SMALL(IF('quantities report'!$A$2:$A$10003=O$6,ROW('quantities report'!$A$2:$A$10003)-1,\"\"),ROWS($B$8:$B12))),\"0\"))","v":""},{"$f":"IF($B12=\"\",\"\",IFERROR(INDEX('quantities report'!$D$2:$D$10003,SMALL(IF('quantities report'!$A$2:$A$10003=P$6,ROW('quantities report'!$A$2:$A$10003)-1,\"\"),ROWS($B$8:$B12))),\"0\"))","v":""},{"$f":"IF($B12=\"\",\"\",IFERROR(INDEX('quantities report'!$D$2:$D$10003,SMALL(IF('quantities report'!$A$2:$A$10003=Q$6,ROW('quantities report'!$A$2:$A$10003)-1,\"\"),ROWS($B$8:$B12))),\"0\"))","v":""},"",{"$f":"IF($B12=\"\",\"\",IFERROR(INDEX('quantities report'!$D$2:$D$10003,SMALL(IF('quantities report'!$A$2:$A$10003=S$6,ROW('quantities report'!$A$2:$A$10003)-1,\"\"),ROWS($B$8:$B12))),\"0\"))","v":""},null,""]
[null,{"$f":"IFERROR(INDEX('manual inputs'!M:M,SMALL(IF('manual inputs'!M:M<>\"\",ROW('manual inputs'!M:M)),ROW(8:8))),\"\")","v":""},{"$f":"IF($B13=\"\",\"\",IFERROR(INDEX('quantities report'!$D$2:$D$10003,SMALL(IF('quantities report'!$A$2:$A$10003=C$6,ROW('quantities report'!$A$2:$A$10003)-1,\"\"),ROWS($B$8:$B13))),\"0\"))","v":""},"",{"$f":"IF($B13=\"\",\"\",IFERROR(INDEX('quantities report'!$D$2:$D$10003,SMALL(IF('quantities report'!$A$2:$A$10003=E$6,ROW('quantities report'!$A$2:$A$10003)-1,\"\"),ROWS($B$8:$B13))),\"0\"))","v":""},{"$f":"IF($B13=\"\",\"\",IFERROR(INDEX('quantities report'!$D$2:$D$10003,SMALL(IF('quantities report'!$A$2:$A$10003=F$6,ROW('quantities report'!$A$2:$A$10003)-1,\"\"),ROWS($B$8:$B13))),\"0\"))","v":""},null,"",{"$f":"IF($B13=\"\",\"\",IFERROR(INDEX('quantities report'!$D$2:$D$10003,SMALL(IF('quantities report'!$A$2:$A$10003=I$6,ROW('quantities report'!$A$2:$A$10003)-1,\"\"),ROWS($B$8:$B13))),\"0\"))","v":""},{"$f":"IF($B13=\"\",\"\",IFERROR(INDEX('quantities report'!$D$2:$D$10003,SMALL(IF('quantities report'!$A$2:$A$10003=J$6,ROW('quantities report'!$A$2:$A$10003)-1,\"\"),ROWS($B$8:$B13))),\"0\"))","v":""},{"$f":"IF($B13=\"\",\"\",IFERROR(INDEX('quantities report'!$D$2:$D$10003,SMALL(IF('quantities report'!$A$2:$A$10003=K$6,ROW('quantities report'!$A$2:$A$10003)-1,\"\"),ROWS($B$8:$B13))),\"0\"))","v":""},{"$f":"IF($B13=\"\",\"\",IFERROR(INDEX('quantities report'!$D$2:$D$10003,SMALL(IF('quantities report'!$A$2:$A$10003=L$6,ROW('quantities report'!$A$2:$A$10003)-1,\"\"),ROWS($B$8:$B13))),\"0\"))","v":""},null,null,{"$f":"IF($B13=\"\",\"\",IFERROR(INDEX('quantities report'!$D$2:$D$10003,SMALL(IF('quantities report'!$A$2:$A$10003=O$6,ROW('quantities report'!$A$2:$A$10003)-1,\"\"),ROWS($B$8:$B13))),\"0\"))","v":""},{"$f":"IF($B13=\"\",\"\",IFERROR(INDEX('quantities report'!$D$2:$D$10003,SMALL(IF('quantities report'!$A$2:$A$10003=P$6,ROW('quantities report'!$A$2:$A$10003)-1,\"\"),ROWS($B$8:$B13))),\"0\"))","v":""},{"$f":"IF($B13=\"\",\"\",IFERROR(INDEX('quantities report'!$D$2:$D$10003,SMALL(IF('quantities report'!$A$2:$A$10003=Q$6,ROW('quantities report'!$A$2:$A$10003)-1,\"\"),ROWS($B$8:$B13))),\"0\"))","v":""},"",{"$f":"IF($B13=\"\",\"\",IFERROR(INDEX('quantities report'!$D$2:$D$10003,SMALL(IF('quantities report'!$A$2:$A$10003=S$6,ROW('quantities report'!$A$2:$A$10003)-1,\"\"),ROWS($B$8:$B13))),\"0\"))","v":""},null,""]
[null,{"$f":"IFERROR(INDEX('manual inputs'!M:M,SMALL(IF('manual inputs'!M:M<>\"\",ROW('manual inputs'!M:M)),ROW(9:9))),\"\")","v":""},{"$f":"IF($B14=\"\",\"\",IFERROR(INDEX('quantities report'!$D$2:$D$10003,SMALL(IF('quantities report'!$A$2:$A$10003=C$6,ROW('quantities report'!$A$2:$A$10003)-1,\"\"),ROWS($B$8:$B14))),\"0\"))","v":""},"",{"$f":"IF($B14=\"\",\"\",IFERROR(INDEX('quantities report'!$D$2:$D$10003,SMALL(IF('quantities report'!$A$2:$A$10003=E$6,ROW('quantities report'!$A$2:$A$10003)-1,\"\"),ROWS($B$8:$B14))),\"0\"))","v":""},{"$f":"IF($B14=\"\",\"\",IFERROR(INDEX('quantities report'!$D$2:$D$10003,SMALL(IF('quantities report'!$A$2:$A$10003=F$6,ROW('quantities report'!$A$2:$A$10003)-1,\"\"),ROWS($B$8:$B14))),\"0\"))","v":""},null,"",{"$f":"IF($B14=\"\",\"\",IFERROR(INDEX('quantities report'!$D$2:$D$10003,SMALL(IF('quantities report'!$A$2:$A$10003=I$6,ROW('quantities report'!$A$2:$A$10003)-1,\"\"),ROWS($B$8:$B14))),\"0\"))","v":""},{"$f":"IF($B14=\"\",\"\",IFERROR(INDEX('quantities report'!$D$2:$D$10003,SMALL(IF('quantities report'!$A$2:$A$10003=J$6,ROW('quantities report'!$A$2:$A$10003)-1,\"\"),ROWS($B$8:$B14))),\"0\"))","v":""},{"$f":"IF($B14=\"\",\"\",IFERROR(INDEX('quantities report'!$D$2:$D$10003,SMALL(IF('quantities report'!$A$2:$A$10003=K$6,ROW('quantities report'!$A$2:$A$10003)-1,\"\"),ROWS($B$8:$B14))),\"0\"))","v":""},{"$f":"IF($B14=\"\",\"\",IFERROR(INDEX('quantities report'!$D$2:$D$10003,SMALL(IF('quantities report'!$A$2:$A$10003=L$6,ROW('quantities report'!$A$2:$A$10003)-1,\"\"),ROWS($B$8:$B14))),\"0\"))","v":""},null,null,{"$f":"IF($B14=\"\",\"\",IFERROR(INDEX('quantities report'!$D$2:$D$10003,SMALL(IF('quantities report'!$A$2:$A$10003=O$6,ROW('quantities report'!$A$2:$A$10003)-1,\"\"),ROWS($B$8:$B14))),\"0\"))","v":""},{"$f":"IF($B14=\"\",\"\",IFERROR(INDEX('quantities report'!$D$2:$D$10003,SMALL(IF('quantities report'!$A$2:$A$10003=P$6,ROW('quantities report'!$A$2:$A$10003)-1,\"\"),ROWS($B$8:$B14))),\"0\"))","v":""},{"$f":"IF($B14=\"\",\"\",IFERROR(INDEX('quantities report'!$D$2:$D$10003,SMALL(IF('quantities report'!$A$2:$A$10003=Q$6,ROW('quantities report'!$A$2:$A$10003)-1,\"\"),ROWS($B$8:$B14))),\"0\"))","v":""},"",{"$f":"IF($B14=\"\",\"\",IFERROR(INDEX('quantities report'!$D$2:$D$10003,SMALL(IF('quantities report'!$A$2:$A$10003=S$6,ROW('quantities report'!$A$2:$A$10003)-1,\"\"),ROWS($B$8:$B14))),\"0\"))","v":""},null,""]
[null,{"$f":"IFERROR(INDEX('manual inputs'!M:M,SMALL(IF('manual inputs'!M:M<>\"\",ROW('manual inputs'!M:M)),ROW(10:10))),\"\")","v":""},{"$f":"IF($B15=\"\",\"\",IFERROR(INDEX('quantities report'!$D$2:$D$10003,SMALL(IF('quantities report'!$A$2:$A$10003=C$6,ROW('quantities report'!$A$2:$A$10003)-1,\"\"),ROWS($B$8:$B15))),\"0\"))","v":""},"",{"$f":"IF($B15=\"\",\"\",IFERROR(INDEX('quantities report'!$D$2:$D$10003,SMALL(IF('quantities report'!$A$2:$A$10003=E$6,ROW('quantities report'!$A$2:$A$10003)-1,\"\"),ROWS($B$8:$B15))),\"0\"))","v":""},{"$f":"IF($B15=\"\",\"\",IFERROR(INDEX('quantities report'!$D$2:$D$10003,SMALL(IF('quantities report'!$A$2:$A$10003=F$6,ROW('quantities report'!$A$2:$A$10003)-1,\"\"),ROWS($B$8:$B15))),\"0\"))","v":""},null,"",{"$f":"IF($B15=\"\",\"\",IFERROR(INDEX('quantities report'!$D$2:$D$10003,SMALL(IF('quantities report'!$A$2:$A$10003=I$6,ROW('quantities report'!$A$2:$A$10003)-1,\"\"),ROWS($B$8:$B15))),\"0\"))","v":""},{"$f":"IF($B15=\"\",\"\",IFERROR(INDEX('quantities report'!$D$2:$D$10003,SMALL(IF('quantities report'!$A$2:$A$10003=J$6,ROW('quantities report'!$A$2:$A$10003)-1,\"\"),ROWS($B$8:$B15))),\"0\"))","v":""},{"$f":"IF($B15=\"\",\"\",IFERROR(INDEX('quantities report'!$D$2:$D$10003,SMALL(IF('quantities report'!$A$2:$A$10003=K$6,ROW('quantities report'!$A$2:$A$10003)-1,\"\"),ROWS($B$8:$B15))),\"0\"))","v":""},{"$f":"IF($B15=\"\",\"\",IFERROR(INDEX('quantities report'!$D$2:$D$10003,SMALL(IF('quantities report'!$A$2:$A$10003=L$6,ROW('quantities report'!$A$2:$A$10003)-1,\"\"),ROWS($B$8:$B15))),\"0\"))","v":""},null,null,{"$f":"IF($B15=\"\",\"\",IFERROR(INDEX('quantities report'!$D$2:$D$10003,SMALL(IF('quantities report'!$A$2:$A$10003=O$6,ROW('quantities report'!$A$2:$A$10003)-1,\"\"),ROWS($B$8:$B15))),\"0\"))","v":""},{"$f":"IF($B15=\"\",\"\",IFERROR(INDEX('quantities report'!$D$2:$D$10003,SMALL(IF('quantities report'!$A$2:$A$10003=P$6,ROW('quantities report'!$A$2:$A$10003)-1,\"\"),ROWS($B$8:$B15))),\"0\"))","v":""},{"$f":"IF($B15=\"\",\"\",IFERROR(INDEX('quantities report'!$D$2:$D$10003,SMALL(IF('quantities report'!$A$2:$A$10003=Q$6,ROW('quantities report'!$A$2:$A$10003)-1,\"\"),ROWS($B$8:$B15))),\"0\"))","v":""},"",{"$f":"IF($B15=\"\",\"\",IFERROR(INDEX('quantities report'!$D$2:$D$10003,SMALL(IF('quantities report'!$A$2:$A$10003=S$6,ROW('quantities report'!$A$2:$A$10003)-1,\"\"),ROWS($B$8:$B15))),\"0\"))","v":""},null,""]
[null,{"$f":"IFERROR(INDEX('manual inputs'!M:M,SMALL(IF('manual inputs'!M:M<>\"\",ROW('manual inputs'!M:M)),ROW(11:11))),\"\")","v":""},{"$f":"IF($B16=\"\",\"\",IFERROR(INDEX('quantities report'!$D$2:$D$10003,SMALL(IF('quantities report'!$A$2:$A$10003=C$6,ROW('quantities report'!$A$2:$A$10003)-1,\"\"),ROWS($B$8:$B16))),\"0\"))","v":""},"",{"$f":"IF($B16=\"\",\"\",IFERROR(INDEX('quantities report'!$D$2:$D$10003,SMALL(IF('quantities report'!$A$2:$A$10003=E$6,ROW('quantities report'!$A$2:$A$10003)-1,\"\"),ROWS($B$8:$B16))),\"0\"))","v":""},{"$f":"IF($B16=\"\",\"\",IFERROR(INDEX('quantities report'!$D$2:$D$10003,SMALL(IF('quantities report'!$A$2:$A$10003=F$6,ROW('quantities report'!$A$2:$A$10003)-1,\"\"),ROWS($B$8:$B16))),\"0\"))","v":""},null,"",{"$f":"IF($B16=\"\",\"\",IFERROR(INDEX('quantities report'!$D$2:$D$10003,SMALL(IF('quantities report'!$A$2:$A$10003=I$6,ROW('quantities report'!$A$2:$A$10003)-1,\"\"),ROWS($B$8:$B16))),\"0\"))","v":""},{"$f":"IF($B16=\"\",\"\",IFERROR(INDEX('quantities report'!$D$2:$D$10003,SMALL(IF('quantities report'!$A$2:$A$10003=J$6,ROW('quantities report'!$A$2:$A$10003)-1,\"\"),ROWS($B$8:$B16))),\"0\"))","v":""},{"$f":"IF($B16=\"\",\"\",IFERROR(INDEX('quantities report'!$D$2:$D$10003,SMALL(IF('quantities report'!$A$2:$A$10003=K$6,ROW('quantities report'!$A$2:$A$10003)-1,\"\"),ROWS($B$8:$B16))),\"0\"))","v":""},{"$f":"IF($B16=\"\",\"\",IFERROR(INDEX('quantities report'!$D$2:$D$10003,SMALL(IF('quantities report'!$A$2:$A$10003=L$6,ROW('quantities report'!$A$2:$A$10003)-1,\"\"),ROWS($B$8:$B16))),\"0\"))","v":""},null,null,{"$f":"IF($B16=\"\",\"\",IFERROR(INDEX('quantities report'!$D$2:$D$10003,SMALL(IF('quantities report'!$A$2:$A$10003=O$6,ROW('quantities report'!$A$2:$A$10003)-1,\"\"),ROWS($B$8:$B16))),\"0\"))","v":""},{"$f":"IF($B16=\"\",\"\",IFERROR(INDEX('quantities report'!$D$2:$D$10003,SMALL(IF('quantities report'!$A$2:$A$10003=P$6,ROW('quantities report'!$A$2:$A$10003)-1,\"\"),ROWS($B$8:$B16))),\"0\"))","v":""},{"$f":"IF($B16=\"\",\"\",IFERROR(INDEX('quantities report'!$D$2:$D$10003,SMALL(IF('quantities report'!$A$2:$A$10003=Q$6,ROW('quantities report'!$A$2:$A$10003)-1,\"\"),ROWS($B$8:$B16))),\"0\"))","v":""},"",{"$f":"IF($B16=\"\",\"\",IFERROR(INDEX('quantities report'!$D$2:$D$10003,SMALL(IF('quantities report'!$A$2:$A$10003=S$6,ROW('quantities report'!$A$2:$A$10003)-1,\"\"),ROWS($B$8:$B16))),\"0\"))","v":""},null,""]
[null,{"$f":"IFERROR(INDEX('manual inputs'!M:M,SMALL(IF('manual inputs'!M:M<>\"\",ROW('manual inputs'!M:M)),ROW(12:12))),\"\")","v":""},{"$f":"IF($B17=\"\",\"\",IFERROR(INDEX('quantities report'!$D$2:$D$10003,SMALL(IF('quantities report'!$A$2:$A$10003=C$6,ROW('quantities report'!$A$2:$A$10003)-1,\"\"),ROWS($B$8:$B17))),\"0\"))","v":""},"",{"$f":"IF($B17=\"\",\"\",IFERROR(INDEX('quantities report'!$D$2:$D$10003,SMALL(IF('quantities report'!$A$2:$A$10003=E$6,ROW('quantities report'!$A$2:$A$10003)-1,\"\"),ROWS($B$8:$B17))),\"0\"))","v":""},{"$f":"IF($B17=\"\",\"\",IFERROR(INDEX('quantities report'!$D$2:$D$10003,SMALL(IF('quantities report'!$A$2:$A$10003=F$6,ROW('quantities report'!$A$2:$A$10003)-1,\"\"),ROWS($B$8:$B17))),\"0\"))","v":""},null,"",{"$f":"IF($B17=\"\",\"\",IFERROR(INDEX('quantities report'!$D$2:$D$10003,SMALL(IF('quantities report'!$A$2:$A$10003=I$6,ROW('quantities report'!$A$2:$A$10003)-1,\"\"),ROWS($B$8:$B17))),\"0\"))","v":""},{"$f":"IF($B17=\"\",\"\",IFERROR(INDEX('quantities report'!$D$2:$D$10003,SMALL(IF('quantities report'!$A$2:$A$10003=J$6,ROW('quantities report'!$A$2:$A$10003)-1,\"\"),ROWS($B$8:$B17))),\"0\"))","v":""},{"$f":"IF($B17=\"\",\"\",IFERROR(INDEX('quantities report'!$D$2:$D$10003,SMALL(IF('quantities report'!$A$2:$A$10003=K$6,ROW('quantities report'!$A$2:$A$10003)-1,\"\"),ROWS($B$8:$B17))),\"0\"))","v":""},{"$f":"IF($B17=\"\",\"\",IFERROR(INDEX('quantities report'!$D$2:$D$10003,SMALL(IF('quantities report'!$A$2:$A$10003=L$6,ROW('quantities report'!$A$2:$A$10003)-1,\"\"),ROWS($B$8:$B17))),\"0\"))","v":""},null,null,{"$f":"IF($B17=\"\",\"\",IFERROR(INDEX('quantities report'!$D$2:$D$10003,SMALL(IF('quantities report'!$A$2:$A$10003=O$6,ROW('quantities report'!$A$2:$A$10003)-1,\"\"),ROWS($B$8:$B17))),\"0\"))","v":""},{"$f":"IF($B17=\"\",\"\",IFERROR(INDEX('quantities report'!$D$2:$D$10003,SMALL(IF('quantities report'!$A$2:$A$10003=P$6,ROW('quantities report'!$A$2:$A$10003)-1,\"\"),ROWS($B$8:$B17))),\"0\"))","v":""},{"$f":"IF($B17=\"\",\"\",IFERROR(INDEX('quantities report'!$D$2:$D$10003,SMALL(IF('quantities report'!$A$2:$A$10003=Q$6,ROW('quantities report'!$A$2:$A$10003)-1,\"\"),ROWS($B$8:$B17))),\"0\"))","v":""},"",{"$f":"IF($B17=\"\",\"\",IFERROR(INDEX('quantities report'!$D$2:$D$10003,SMALL(IF('quantities report'!$A$2:$A$10003=S$6,ROW('quantities report'!$A$2:$A$10003)-1,\"\"),ROWS($B$8:$B17))),\"0\"))","v":""},null,""]
[null,{"$f":"IFERROR(INDEX('manual inputs'!M:M,SMALL(IF('manual inputs'!M:M<>\"\",ROW('manual inputs'!M:M)),ROW(13:13))),\"\")","v":""},{"$f":"IF($B18=\"\",\"\",IFERROR(INDEX('quantities report'!$D$2:$D$10003,SMALL(IF('quantities report'!$A$2:$A$10003=C$6,ROW('quantities report'!$A$2:$A$10003)-1,\"\"),ROWS($B$8:$B18))),\"0\"))","v":""},"",{"$f":"IF($B18=\"\",\"\",IFERROR(INDEX('quantities report'!$D$2:$D$10003,SMALL(IF('quantities report'!$A$2:$A$10003=E$6,ROW('quantities report'!$A$2:$A$10003)-1,\"\"),ROWS($B$8:$B18))),\"0\"))","v":""},{"$f":"IF($B18=\"\",\"\",IFERROR(INDEX('quantities report'!$D$2:$D$10003,SMALL(IF('quantities report'!$A$2:$A$10003=F$6,ROW('quantities report'!$A$2:$A$10003)-1,\"\"),ROWS($B$8:$B18))),\"0\"))","v":""},null,"",{"$f":"IF($B18=\"\",\"\",IFERROR(INDEX('quantities report'!$D$2:$D$10003,SMALL(IF('quantities report'!$A$2:$A$10003=I$6,ROW('quantities report'!$A$2:$A$10003)-1,\"\"),ROWS($B$8:$B18))),\"0\"))","v":""},{"$f":"IF($B18=\"\",\"\",IFERROR(INDEX('quantities report'!$D$2:$D$10003,SMALL(IF('quantities report'!$A$2:$A$10003=J$6,ROW('quantities report'!$A$2:$A$10003)-1,\"\"),ROWS($B$8:$B18))),\"0\"))","v":""},{"$f":"IF($B18=\"\",\"\",IFERROR(INDEX('quantities report'!$D$2:$D$10003,SMALL(IF('quantities report'!$A$2:$A$10003=K$6,ROW('quantities report'!$A$2:$A$10003)-1,\"\"),ROWS($B$8:$B18))),\"0\"))","v":""},{"$f":"IF($B18=\"\",\"\",IFERROR(INDEX('quantities report'!$D$2:$D$10003,SMALL(IF('quantities report'!$A$2:$A$10003=L$6,ROW('quantities report'!$A$2:$A$10003)-1,\"\"),ROWS($B$8:$B18))),\"0\"))","v":""},null,null,{"$f":"IF($B18=\"\",\"\",IFERROR(INDEX('quantities report'!$D$2:$D$10003,SMALL(IF('quantities report'!$A$2:$A$10003=O$6,ROW('quantities report'!$A$2:$A$10003)-1,\"\"),ROWS($B$8:$B18))),\"0\"))","v":""},{"$f":"IF($B18=\"\",\"\",IFERROR(INDEX('quantities report'!$D$2:$D$10003,SMALL(IF('quantities report'!$A$2:$A$10003=P$6,ROW('quantities report'!$A$2:$A$10003)-1,\"\"),ROWS($B$8:$B18))),\"0\"))","v":""},{"$f":"IF($B18=\"\",\"\",IFERROR(INDEX('quantities report'!$D$2:$D$10003,SMALL(IF('quantities report'!$A$2:$A$10003=Q$6,ROW('quantities report'!$A$2:$A$10003)-1,\"\"),ROWS($B$8:$B18))),\"0\"))","v":""},"",{"$f":"IF($B18=\"\",\"\",IFERROR(INDEX('quantities report'!$D$2:$D$10003,SMALL(IF('quantities report'!$A$2:$A$10003=S$6,ROW('quantities report'!$A$2:$A$10003)-1,\"\"),ROWS($B$8:$B18))),\"0\"))","v":""},null,""]
[null,{"$f":"IFERROR(INDEX('manual inputs'!M:M,SMALL(IF('manual inputs'!M:M<>\"\",ROW('manual inputs'!M:M)),ROW(14:14))),\"\")","v":""},{"$f":"IF($B19=\"\",\"\",IFERROR(INDEX('quantities report'!$D$2:$D$10003,SMALL(IF('quantities report'!$A$2:$A$10003=C$6,ROW('quantities report'!$A$2:$A$10003)-1,\"\"),ROWS($B$8:$B19))),\"0\"))","v":""},"",{"$f":"IF($B19=\"\",\"\",IFERROR(INDEX('quantities report'!$D$2:$D$10003,SMALL(IF('quantities report'!$A$2:$A$10003=E$6,ROW('quantities report'!$A$2:$A$10003)-1,\"\"),ROWS($B$8:$B19))),\"0\"))","v":""},{"$f":"IF($B19=\"\",\"\",IFERROR(INDEX('quantities report'!$D$2:$D$10003,SMALL(IF('quantities report'!$A$2:$A$10003=F$6,ROW('quantities report'!$A$2:$A$10003)-1,\"\"),ROWS($B$8:$B19))),\"0\"))","v":""},null,"",{"$f":"IF($B19=\"\",\"\",IFERROR(INDEX('quantities report'!$D$2:$D$10003,SMALL(IF('quantities report'!$A$2:$A$10003=I$6,ROW('quantities report'!$A$2:$A$10003)-1,\"\"),ROWS($B$8:$B19))),\"0\"))","v":""},{"$f":"IF($B19=\"\",\"\",IFERROR(INDEX('quantities report'!$D$2:$D$10003,SMALL(IF('quantities report'!$A$2:$A$10003=J$6,ROW('quantities report'!$A$2:$A$10003)-1,\"\"),ROWS($B$8:$B19))),\"0\"))","v":""},{"$f":"IF($B19=\"\",\"\",IFERROR(INDEX('quantities report'!$D$2:$D$10003,SMALL(IF('quantities report'!$A$2:$A$10003=K$6,ROW('quantities report'!$A$2:$A$10003)-1,\"\"),ROWS($B$8:$B19))),\"0\"))","v":""},{"$f":"IF($B19=\"\",\"\",IFERROR(INDEX('quantities report'!$D$2:$D$10003,SMALL(IF('quantities report'!$A$2:$A$10003=L$6,ROW('quantities report'!$A$2:$A$10003)-1,\"\"),ROWS($B$8:$B19))),\"0\"))","v":""},null,null,{"$f":"IF($B19=\"\",\"\",IFERROR(INDEX('quantities report'!$D$2:$D$10003,SMALL(IF('quantities report'!$A$2:$A$10003=O$6,ROW('quantities report'!$A$2:$A$10003)-1,\"\"),ROWS($B$8:$B19))),\"0\"))","v":""},{"$f":"IF($B19=\"\",\"\",IFERROR(INDEX('quantities report'!$D$2:$D$10003,SMALL(IF('quantities report'!$A$2:$A$10003=P$6,ROW('quantities report'!$A$2:$A$10003)-1,\"\"),ROWS($B$8:$B19))),\"0\"))","v":""},{"$f":"IF($B19=\"\",\"\",IFERROR(INDEX('quantities report'!$D$2:$D$10003,SMALL(IF('quantities report'!$A$2:$A$10003=Q$6,ROW('quantities report'!$A$2:$A$10003)-1,\"\"),ROWS($B$8:$B19))),\"0\"))","v":""},"",{"$f":"IF($B19=\"\",\"\",IFERROR(INDEX('quantities report'!$D$2:$D$10003,SMALL(IF('quantities report'!$A$2:$A$10003=S$6,ROW('quantities report'!$A$2:$A$10003)-1,\"\"),ROWS($B$8:$B19))),\"0\"))","v":""},null,""]
[null,{"$f":"IFERROR(INDEX('manual inputs'!M:M,SMALL(IF('manual inputs'!M:M<>\"\",ROW('manual inputs'!M:M)),ROW(15:15))),\"\")","v":""},{"$f":"IF($B20=\"\",\"\",IFERROR(INDEX('quantities report'!$D$2:$D$10003,SMALL(IF('quantities report'!$A$2:$A$10003=C$6,ROW('quantities report'!$A$2:$A$10003)-1,\"\"),ROWS($B$8:$B20))),\"0\"))","v":""},"",{"$f":"IF($B20=\"\",\"\",IFERROR(INDEX('quantities report'!$D$2:$D$10003,SMALL(IF('quantities report'!$A$2:$A$10003=E$6,ROW('quantities report'!$A$2:$A$10003)-1,\"\"),ROWS($B$8:$B20))),\"0\"))","v":""},{"$f":"IF($B20=\"\",\"\",IFERROR(INDEX('quantities report'!$D$2:$D$10003,SMALL(IF('quantities report'!$A$2:$A$10003=F$6,ROW('quantities report'!$A$2:$A$10003)-1,\"\"),ROWS($B$8:$B20))),\"0\"))","v":""},null,"",{"$f":"IF($B20=\"\",\"\",IFERROR(INDEX('quantities report'!$D$2:$D$10003,SMALL(IF('quantities report'!$A$2:$A$10003=I$6,ROW('quantities report'!$A$2:$A$10003)-1,\"\"),ROWS($B$8:$B20))),\"0\"))","v":""},{"$f":"IF($B20=\"\",\"\",IFERROR(INDEX('quantities report'!$D$2:$D$10003,SMALL(IF('quantities report'!$A$2:$A$10003=J$6,ROW('quantities report'!$A$2:$A$10003)-1,\"\"),ROWS($B$8:$B20))),\"0\"))","v":""},{"$f":"IF($B20=\"\",\"\",IFERROR(INDEX('quantities report'!$D$2:$D$10003,SMALL(IF('quantities report'!$A$2:$A$10003=K$6,ROW('quantities report'!$A$2:$A$10003)-1,\"\"),ROWS($B$8:$B20))),\"0\"))","v":""},{"$f":"IF($B20=\"\",\"\",IFERROR(INDEX('quantities report'!$D$2:$D$10003,SMALL(IF('quantities report'!$A$2:$A$10003=L$6,ROW('quantities report'!$A$2:$A$10003)-1,\"\"),ROWS($B$8:$B20))),\"0\"))","v":""},null,null,{"$f":"IF($B20=\"\",\"\",IFERROR(INDEX('quantities report'!$D$2:$D$10003,SMALL(IF('quantities report'!$A$2:$A$10003=O$6,ROW('quantities report'!$A$2:$A$10003)-1,\"\"),ROWS($B$8:$B20))),\"0\"))","v":""},{"$f":"IF($B20=\"\",\"\",IFERROR(INDEX('quantities report'!$D$2:$D$10003,SMALL(IF('quantities report'!$A$2:$A$10003=P$6,ROW('quantities report'!$A$2:$A$10003)-1,\"\"),ROWS($B$8:$B20))),\"0\"))","v":""},{"$f":"IF($B20=\"\",\"\",IFERROR(INDEX('quantities report'!$D$2:$D$10003,SMALL(IF('quantities report'!$A$2:$A$10003=Q$6,ROW('quantities report'!$A$2:$A$10003)-1,\"\"),ROWS($B$8:$B20))),\"0\"))","v":""},"",{"$f":"IF($B20=\"\",\"\",IFERROR(INDEX('quantities report'!$D$2:$D$10003,SMALL(IF('quantities report'!$A$2:$A$10003=S$6,ROW('quantities report'!$A$2:$A$10003)-1,\"\"),ROWS($B$8:$B20))),\"0\"))","v":""},null,""]
[null,{"$f":"IFERROR(INDEX('manual inputs'!M:M,SMALL(IF('manual inputs'!M:M<>\"\",ROW('manual inputs'!M:M)),ROW(16:16))),\"\")","v":""},{"$f":"IF($B21=\"\",\"\",IFERROR(INDEX('quantities report'!$D$2:$D$10003,SMALL(IF('quantities report'!$A$2:$A$10003=C$6,ROW('quantities report'!$A$2:$A$10003)-1,\"\"),ROWS($B$8:$B21))),\"0\"))","v":""},"",{"$f":"IF($B21=\"\",\"\",IFERROR(INDEX('quantities report'!$D$2:$D$10003,SMALL(IF('quantities report'!$A$2:$A$10003=E$6,ROW('quantities report'!$A$2:$A$10003)-1,\"\"),ROWS($B$8:$B21))),\"0\"))","v":""},{"$f":"IF($B21=\"\",\"\",IFERROR(INDEX('quantities report'!$D$2:$D$10003,SMALL(IF('quantities report'!$A$2:$A$10003=F$6,ROW('quantities report'!$A$2:$A$10003)-1,\"\"),ROWS($B$8:$B21))),\"0\"))","v":""},null,"",{"$f":"IF($B21=\"\",\"\",IFERROR(INDEX('quantities report'!$D$2:$D$10003,SMALL(IF('quantities report'!$A$2:$A$10003=I$6,ROW('quantities report'!$A$2:$A$10003)-1,\"\"),ROWS($B$8:$B21))),\"0\"))","v":""},{"$f":"IF($B21=\"\",\"\",IFERROR(INDEX('quantities report'!$D$2:$D$10003,SMALL(IF('quantities report'!$A$2:$A$10003=J$6,ROW('quantities report'!$A$2:$A$10003)-1,\"\"),ROWS($B$8:$B21))),\"0\"))","v":""},{"$f":"IF($B21=\"\",\"\",IFERROR(INDEX('quantities report'!$D$2:$D$10003,SMALL(IF('quantities report'!$A$2:$A$10003=K$6,ROW('quantities report'!$A$2:$A$10003)-1,\"\"),ROWS($B$8:$B21))),\"0\"))","v":""},{"$f":"IF($B21=\"\",\"\",IFERROR(INDEX('quantities report'!$D$2:$D$10003,SMALL(IF('quantities report'!$A$2:$A$10003=L$6,ROW('quantities report'!$A$2:$A$10003)-1,\"\"),ROWS($B$8:$B21))),\"0\"))","v":""},null,null,{"$f":"IF($B21=\"\",\"\",IFERROR(INDEX('quantities report'!$D$2:$D$10003,SMALL(IF('quantities report'!$A$2:$A$10003=O$6,ROW('quantities report'!$A$2:$A$10003)-1,\"\"),ROWS($B$8:$B21))),\"0\"))","v":""},{"$f":"IF($B21=\"\",\"\",IFERROR(INDEX('quantities report'!$D$2:$D$10003,SMALL(IF('quantities report'!$A$2:$A$10003=P$6,ROW('quantities report'!$A$2:$A$10003)-1,\"\"),ROWS($B$8:$B21))),\"0\"))","v":""},{"$f":"IF($B21=\"\",\"\",IFERROR(INDEX('quantities report'!$D$2:$D$10003,SMALL(IF('quantities report'!$A$2:$A$10003=Q$6,ROW('quantities report'!$A$2:$A$10003)-1,\"\"),ROWS($B$8:$B21))),\"0\"))","v":""},"",{"$f":"IF($B21=\"\",\"\",IFERROR(INDEX('quantities report'!$D$2:$D$10003,SMALL(IF('quantities report'!$A$2:$A$10003=S$6,ROW('quantities report'!$A$2:$A$10003)-1,\"\"),ROWS($B$8:$B21))),\"0\"))","v":""},null,""]
[null,{"$f":"IFERROR(INDEX('manual inputs'!M:M,SMALL(IF('manual inputs'!M:M<>\"\",ROW('manual inputs'!M:M)),ROW(17:17))),\"\")","v":""},{"$f":"IF($B22=\"\",\"\",IFERROR(INDEX('quantities report'!$D$2:$D$10003,SMALL(IF('quantities report'!$A$2:$A$10003=C$6,ROW('quantities report'!$A$2:$A$10003)-1,\"\"),ROWS($B$8:$B22))),\"0\"))","v":""},"",{"$f":"IF($B22=\"\",\"\",IFERROR(INDEX('quantities report'!$D$2:$D$10003,SMALL(IF('quantities report'!$A$2:$A$10003=E$6,ROW('quantities report'!$A$2:$A$10003)-1,\"\"),ROWS($B$8:$B22))),\"0\"))","v":""},{"$f":"IF($B22=\"\",\"\",IFERROR(INDEX('quantities report'!$D$2:$D$10003,SMALL(IF('quantities report'!$A$2:$A$10003=F$6,ROW('quantities report'!$A$2:$A$10003)-1,\"\"),ROWS($B$8:$B22))),\"0\"))","v":""},null,"",{"$f":"IF($B22=\"\",\"\",IFERROR(INDEX('quantities report'!$D$2:$D$10003,SMALL(IF('quantities report'!$A$2:$A$10003=I$6,ROW('quantities report'!$A$2:$A$10003)-1,\"\"),ROWS($B$8:$B22))),\"0\"))","v":""},{"$f":"IF($B22=\"\",\"\",IFERROR(INDEX('quantities report'!$D$2:$D$10003,SMALL(IF('quantities report'!$A$2:$A$10003=J$6,ROW('quantities report'!$A$2:$A$10003)-1,\"\"),ROWS($B$8:$B22))),\"0\"))","v":""},{"$f":"IF($B22=\"\",\"\",IFERROR(INDEX('quantities report'!$D$2:$D$10003,SMALL(IF('quantities report'!$A$2:$A$10003=K$6,ROW('quantities report'!$A$2:$A$10003)-1,\"\"),ROWS($B$8:$B22))),\"0\"))","v":""},{"$f":"IF($B22=\"\",\"\",IFERROR(INDEX('quantities report'!$D$2:$D$10003,SMALL(IF('quantities report'!$A$2:$A$10003=L$6,ROW('quantities report'!$A$2:$A$10003)-1,\"\"),ROWS($B$8:$B22))),\"0\"))","v":""},null,null,{"$f":"IF($B22=\"\",\"\",IFERROR(INDEX('quantities report'!$D$2:$D$10003,SMALL(IF('quantities report'!$A$2:$A$10003=O$6,ROW('quantities report'!$A$2:$A$10003)-1,\"\"),ROWS($B$8:$B22))),\"0\"))","v":""},{"$f":"IF($B22=\"\",\"\",IFERROR(INDEX('quantities report'!$D$2:$D$10003,SMALL(IF('quantities report'!$A$2:$A$10003=P$6,ROW('quantities report'!$A$2:$A$10003)-1,\"\"),ROWS($B$8:$B22))),\"0\"))","v":""},{"$f":"IF($B22=\"\",\"\",IFERROR(INDEX('quantities report'!$D$2:$D$10003,SMALL(IF('quantities report'!$A$2:$A$10003=Q$6,ROW('quantities report'!$A$2:$A$10003)-1,\"\"),ROWS($B$8:$B22))),\"0\"))","v":""},"",{"$f":"IF($B22=\"\",\"\",IFERROR(INDEX('quantities report'!$D$2:$D$10003,SMALL(IF('quantities report'!$A$2:$A$10003=S$6,ROW('quantities report'!$A$2:$A$10003)-1,\"\"),ROWS($B$8:$B22))),\"0\"))","v":""},null,""]
[null,{"$f":"IFERROR(INDEX('manual inputs'!M:M,SMALL(IF('manual inputs'!M:M<>\"\",ROW('manual inputs'!M:M)),ROW(18:18))),\"\")","v":""},{"$f":"IF($B23=\"\",\"\",IFERROR(INDEX('quantities report'!$D$2:$D$10003,SMALL(IF('quantities report'!$A$2:$A$10003=C$6,ROW('quantities report'!$A$2:$A$10003)-1,\"\"),ROWS($B$8:$B23))),\"0\"))","v":""},"",{"$f":"IF($B23=\"\",\"\",IFERROR(INDEX('quantities report'!$D$2:$D$10003,SMALL(IF('quantities report'!$A$2:$A$10003=E$6,ROW('quantities report'!$A$2:$A$10003)-1,\"\"),ROWS($B$8:$B23))),\"0\"))","v":""},{"$f":"IF($B23=\"\",\"\",IFERROR(INDEX('quantities report'!$D$2:$D$10003,SMALL(IF('quantities report'!$A$2:$A$10003=F$6,ROW('quantities report'!$A$2:$A$10003)-1,\"\"),ROWS($B$8:$B23))),\"0\"))","v":""},null,"",{"$f":"IF($B23=\"\",\"\",IFERROR(INDEX('quantities report'!$D$2:$D$10003,SMALL(IF('quantities report'!$A$2:$A$10003=I$6,ROW('quantities report'!$A$2:$A$10003)-1,\"\"),ROWS($B$8:$B23))),\"0\"))","v":""},{"$f":"IF($B23=\"\",\"\",IFERROR(INDEX('quantities report'!$D$2:$D$10003,SMALL(IF('quantities report'!$A$2:$A$10003=J$6,ROW('quantities report'!$A$2:$A$10003)-1,\"\"),ROWS($B$8:$B23))),\"0\"))","v":""},{"$f":"IF($B23=\"\",\"\",IFERROR(INDEX('quantities report'!$D$2:$D$10003,SMALL(IF('quantities report'!$A$2:$A$10003=K$6,ROW('quantities report'!$A$2:$A$10003)-1,\"\"),ROWS($B$8:$B23))),\"0\"))","v":""},{"$f":"IF($B23=\"\",\"\",IFERROR(INDEX('quantities report'!$D$2:$D$10003,SMALL(IF('quantities report'!$A$2:$A$10003=L$6,ROW('quantities report'!$A$2:$A$10003)-1,\"\"),ROWS($B$8:$B23))),\"0\"))","v":""},null,null,{"$f":"IF($B23=\"\",\"\",IFERROR(INDEX('quantities report'!$D$2:$D$10003,SMALL(IF('quantities report'!$A$2:$A$10003=O$6,ROW('quantities report'!$A$2:$A$10003)-1,\"\"),ROWS($B$8:$B23))),\"0\"))","v":""},{"$f":"IF($B23=\"\",\"\",IFERROR(INDEX('quantities report'!$D$2:$D$10003,SMALL(IF('quantities report'!$A$2:$A$10003=P$6,ROW('quantities report'!$A$2:$A$10003)-1,\"\"),ROWS($B$8:$B23))),\"0\"))","v":""},{"$f":"IF($B23=\"\",\"\",IFERROR(INDEX('quantities report'!$D$2:$D$10003,SMALL(IF('quantities report'!$A$2:$A$10003=Q$6,ROW('quantities report'!$A$2:$A$10003)-1,\"\"),ROWS($B$8:$B23))),\"0\"))","v":""},"",{"$f":"IF($B23=\"\",\"\",IFERROR(INDEX('quantities report'!$D$2:$D$10003,SMALL(IF('quantities report'!$A$2:$A$10003=S$6,ROW('quantities report'!$A$2:$A$10003)-1,\"\"),ROWS($B$8:$B23))),\"0\"))","v":""},null,""]
[null,{"$f":"IFERROR(INDEX('manual inputs'!M:M,SMALL(IF('manual inputs'!M:M<>\"\",ROW('manual inputs'!M:M)),ROW(19:19))),\"\")","v":""},{"$f":"IF($B24=\"\",\"\",IFERROR(INDEX('quantities report'!$D$2:$D$10003,SMALL(IF('quantities report'!$A$2:$A$10003=C$6,ROW('quantities report'!$A$2:$A$10003)-1,\"\"),ROWS($B$8:$B24))),\"0\"))","v":""},"",{"$f":"IF($B24=\"\",\"\",IFERROR(INDEX('quantities report'!$D$2:$D$10003,SMALL(IF('quantities report'!$A$2:$A$10003=E$6,ROW('quantities report'!$A$2:$A$10003)-1,\"\"),ROWS($B$8:$B24))),\"0\"))","v":""},{"$f":"IF($B24=\"\",\"\",IFERROR(INDEX('quantities report'!$D$2:$D$10003,SMALL(IF('quantities report'!$A$2:$A$10003=F$6,ROW('quantities report'!$A$2:$A$10003)-1,\"\"),ROWS($B$8:$B24))),\"0\"))","v":""},null,"",{"$f":"IF($B24=\"\",\"\",IFERROR(INDEX('quantities report'!$D$2:$D$10003,SMALL(IF('quantities report'!$A$2:$A$10003=I$6,ROW('quantities report'!$A$2:$A$10003)-1,\"\"),ROWS($B$8:$B24))),\"0\"))","v":""},{"$f":"IF($B24=\"\",\"\",IFERROR(INDEX('quantities report'!$D$2:$D$10003,SMALL(IF('quantities report'!$A$2:$A$10003=J$6,ROW('quantities report'!$A$2:$A$10003)-1,\"\"),ROWS($B$8:$B24))),\"0\"))","v":""},{"$f":"IF($B24=\"\",\"\",IFERROR(INDEX('quantities report'!$D$2:$D$10003,SMALL(IF('quantities report'!$A$2:$A$10003=K$6,ROW('quantities report'!$A$2:$A$10003)-1,\"\"),ROWS($B$8:$B24))),\"0\"))","v":""},{"$f":"IF($B24=\"\",\"\",IFERROR(INDEX('quantities report'!$D$2:$D$10003,SMALL(IF('quantities report'!$A$2:$A$10003=L$6,ROW('quantities report'!$A$2:$A$10003)-1,\"\"),ROWS($B$8:$B24))),\"0\"))","v":""},null,null,{"$f":"IF($B24=\"\",\"\",IFERROR(INDEX('quantities report'!$D$2:$D$10003,SMALL(IF('quantities report'!$A$2:$A$10003=O$6,ROW('quantities report'!$A$2:$A$10003)-1,\"\"),ROWS($B$8:$B24))),\"0\"))","v":""},{"$f":"IF($B24=\"\",\"\",IFERROR(INDEX('quantities report'!$D$2:$D$10003,SMALL(IF('quantities report'!$A$2:$A$10003=P$6,ROW('quantities report'!$A$2:$A$10003)-1,\"\"),ROWS($B$8:$B24))),\"0\"))","v":""},{"$f":"IF($B24=\"\",\"\",IFERROR(INDEX('quantities report'!$D$2:$D$10003,SMALL(IF('quantities report'!$A$2:$A$10003=Q$6,ROW('quantities report'!$A$2:$A$10003)-1,\"\"),ROWS($B$8:$B24))),\"0\"))","v":""},"",{"$f":"IF($B24=\"\",\"\",IFERROR(INDEX('quantities report'!$D$2:$D$10003,SMALL(IF('quantities report'!$A$2:$A$10003=S$6,ROW('quantities report'!$A$2:$A$10003)-1,\"\"),ROWS($B$8:$B24))),\"0\"))","v":""},null,""]
[null,{"$f":"IFERROR(INDEX('manual inputs'!M:M,SMALL(IF('manual inputs'!M:M<>\"\",ROW('manual inputs'!M:M)),ROW(20:20))),\"\")","v":""},{"$f":"IF($B25=\"\",\"\",IFERROR(INDEX('quantities report'!$D$2:$D$10003,SMALL(IF('quantities report'!$A$2:$A$10003=C$6,ROW('quantities report'!$A$2:$A$10003)-1,\"\"),ROWS($B$8:$B25))),\"0\"))","v":""},"",{"$f":"IF($B25=\"\",\"\",IFERROR(INDEX('quantities report'!$D$2:$D$10003,SMALL(IF('quantities report'!$A$2:$A$10003=E$6,ROW('quantities report'!$A$2:$A$10003)-1,\"\"),ROWS($B$8:$B25))),\"0\"))","v":""},{"$f":"IF($B25=\"\",\"\",IFERROR(INDEX('quantities report'!$D$2:$D$10003,SMALL(IF('quantities report'!$A$2:$A$10003=F$6,ROW('quantities report'!$A$2:$A$10003)-1,\"\"),ROWS($B$8:$B25))),\"0\"))","v":""},null,"",{"$f":"IF($B25=\"\",\"\",IFERROR(INDEX('quantities report'!$D$2:$D$10003,SMALL(IF('quantities report'!$A$2:$A$10003=I$6,ROW('quantities report'!$A$2:$A$10003)-1,\"\"),ROWS($B$8:$B25))),\"0\"))","v":""},{"$f":"IF($B25=\"\",\"\",IFERROR(INDEX('quantities report'!$D$2:$D$10003,SMALL(IF('quantities report'!$A$2:$A$10003=J$6,ROW('quantities report'!$A$2:$A$10003)-1,\"\"),ROWS($B$8:$B25))),\"0\"))","v":""},{"$f":"IF($B25=\"\",\"\",IFERROR(INDEX('quantities report'!$D$2:$D$10003,SMALL(IF('quantities report'!$A$2:$A$10003=K$6,ROW('quantities report'!$A$2:$A$10003)-1,\"\"),ROWS($B$8:$B25))),\"0\"))","v":""},{"$f":"IF($B25=\"\",\"\",IFERROR(INDEX('quantities report'!$D$2:$D$10003,SMALL(IF('quantities report'!$A$2:$A$10003=L$6,ROW('quantities report'!$A$2:$A$10003)-1,\"\"),ROWS($B$8:$B25))),\"0\"))","v":""},null,null,{"$f":"IF($B25=\"\",\"\",IFERROR(INDEX('quantities report'!$D$2:$D$10003,SMALL(IF('quantities report'!$A$2:$A$10003=O$6,ROW('quantities report'!$A$2:$A$10003)-1,\"\"),ROWS($B$8:$B25))),\"0\"))","v":""},{"$f":"IF($B25=\"\",\"\",IFERROR(INDEX('quantities report'!$D$2:$D$10003,SMALL(IF('quantities report'!$A$2:$A$10003=P$6,ROW('quantities report'!$A$2:$A$10003)-1,\"\"),ROWS($B$8:$B25))),\"0\"))","v":""},{"$f":"IF($B25=\"\",\"\",IFERROR(INDEX('quantities report'!$D$2:$D$10003,SMALL(IF('quantities report'!$A$2:$A$10003=Q$6,ROW('quantities report'!$A$2:$A$10003)-1,\"\"),ROWS($B$8:$B25))),\"0\"))","v":""},"",{"$f":"IF($B25=\"\",\"\",IFERROR(INDEX('quantities report'!$D$2:$D$10003,SMALL(IF('quantities report'!$A$2:$A$10003=S$6,ROW('quantities report'!$A$2:$A$10003)-1,\"\"),ROWS($B$8:$B25))),\"0\"))","v":""},null,""]
[null,{"$f":"IFERROR(INDEX('manual inputs'!M:M,SMALL(IF('manual inputs'!M:M<>\"\",ROW('manual inputs'!M:M)),ROW(21:21))),\"\")","v":""},{"$f":"IF($B26=\"\",\"\",IFERROR(INDEX('quantities report'!$D$2:$D$10003,SMALL(IF('quantities report'!$A$2:$A$10003=C$6,ROW('quantities report'!$A$2:$A$10003)-1,\"\"),ROWS($B$8:$B26))),\"0\"))","v":""},"",{"$f":"IF($B26=\"\",\"\",IFERROR(INDEX('quantities report'!$D$2:$D$10003,SMALL(IF('quantities report'!$A$2:$A$10003=E$6,ROW('quantities report'!$A$2:$A$10003)-1,\"\"),ROWS($B$8:$B26))),\"0\"))","v":""},{"$f":"IF($B26=\"\",\"\",IFERROR(INDEX('quantities report'!$D$2:$D$10003,SMALL(IF('quantities report'!$A$2:$A$10003=F$6,ROW('quantities report'!$A$2:$A$10003)-1,\"\"),ROWS($B$8:$B26))),\"0\"))","v":""},null,"",{"$f":"IF($B26=\"\",\"\",IFERROR(INDEX('quantities report'!$D$2:$D$10003,SMALL(IF('quantities report'!$A$2:$A$10003=I$6,ROW('quantities report'!$A$2:$A$10003)-1,\"\"),ROWS($B$8:$B26))),\"0\"))","v":""},{"$f":"IF($B26=\"\",\"\",IFERROR(INDEX('quantities report'!$D$2:$D$10003,SMALL(IF('quantities report'!$A$2:$A$10003=J$6,ROW('quantities report'!$A$2:$A$10003)-1,\"\"),ROWS($B$8:$B26))),\"0\"))","v":""},{"$f":"IF($B26=\"\",\"\",IFERROR(INDEX('quantities report'!$D$2:$D$10003,SMALL(IF('quantities report'!$A$2:$A$10003=K$6,ROW('quantities report'!$A$2:$A$10003)-1,\"\"),ROWS($B$8:$B26))),\"0\"))","v":""},{"$f":"IF($B26=\"\",\"\",IFERROR(INDEX('quantities report'!$D$2:$D$10003,SMALL(IF('quantities report'!$A$2:$A$10003=L$6,ROW('quantities report'!$A$2:$A$10003)-1,\"\"),ROWS($B$8:$B26))),\"0\"))","v":""},null,null,{"$f":"IF($B26=\"\",\"\",IFERROR(INDEX('quantities report'!$D$2:$D$10003,SMALL(IF('quantities report'!$A$2:$A$10003=O$6,ROW('quantities report'!$A$2:$A$10003)-1,\"\"),ROWS($B$8:$B26))),\"0\"))","v":""},{"$f":"IF($B26=\"\",\"\",IFERROR(INDEX('quantities report'!$D$2:$D$10003,SMALL(IF('quantities report'!$A$2:$A$10003=P$6,ROW('quantities report'!$A$2:$A$10003)-1,\"\"),ROWS($B$8:$B26))),\"0\"))","v":""},{"$f":"IF($B26=\"\",\"\",IFERROR(INDEX('quantities report'!$D$2:$D$10003,SMALL(IF('quantities report'!$A$2:$A$10003=Q$6,ROW('quantities report'!$A$2:$A$10003)-1,\"\"),ROWS($B$8:$B26))),\"0\"))","v":""},"",{"$f":"IF($B26=\"\",\"\",IFERROR(INDEX('quantities report'!$D$2:$D$10003,SMALL(IF('quantities report'!$A$2:$A$10003=S$6,ROW('quantities report'!$A$2:$A$10003)-1,\"\"),ROWS($B$8:$B26))),\"0\"))","v":""},null,""]
[null,{"$f":"IFERROR(INDEX('manual inputs'!M:M,SMALL(IF('manual inputs'!M:M<>\"\",ROW('manual inputs'!M:M)),ROW(22:22))),\"\")","v":""},{"$f":"IF($B27=\"\",\"\",IFERROR(INDEX('quantities report'!$D$2:$D$10003,SMALL(IF('quantities report'!$A$2:$A$10003=C$6,ROW('quantities report'!$A$2:$A$10003)-1,\"\"),ROWS($B$8:$B27))),\"0\"))","v":""},"",{"$f":"IF($B27=\"\",\"\",IFERROR(INDEX('quantities report'!$D$2:$D$10003,SMALL(IF('quantities report'!$A$2:$A$10003=E$6,ROW('quantities report'!$A$2:$A$10003)-1,\"\"),ROWS($B$8:$B27))),\"0\"))","v":""},{"$f":"IF($B27=\"\",\"\",IFERROR(INDEX('quantities report'!$D$2:$D$10003,SMALL(IF('quantities report'!$A$2:$A$10003=F$6,ROW('quantities report'!$A$2:$A$10003)-1,\"\"),ROWS($B$8:$B27))),\"0\"))","v":""},null,"",{"$f":"IF($B27=\"\",\"\",IFERROR(INDEX('quantities report'!$D$2:$D$10003,SMALL(IF('quantities report'!$A$2:$A$10003=I$6,ROW('quantities report'!$A$2:$A$10003)-1,\"\"),ROWS($B$8:$B27))),\"0\"))","v":""},{"$f":"IF($B27=\"\",\"\",IFERROR(INDEX('quantities report'!$D$2:$D$10003,SMALL(IF('quantities report'!$A$2:$A$10003=J$6,ROW('quantities report'!$A$2:$A$10003)-1,\"\"),ROWS($B$8:$B27))),\"0\"))","v":""},{"$f":"IF($B27=\"\",\"\",IFERROR(INDEX('quantities report'!$D$2:$D$10003,SMALL(IF('quantities report'!$A$2:$A$10003=K$6,ROW('quantities report'!$A$2:$A$10003)-1,\"\"),ROWS($B$8:$B27))),\"0\"))","v":""},{"$f":"IF($B27=\"\",\"\",IFERROR(INDEX('quantities report'!$D$2:$D$10003,SMALL(IF('quantities report'!$A$2:$A$10003=L$6,ROW('quantities report'!$A$2:$A$10003)-1,\"\"),ROWS($B$8:$B27))),\"0\"))","v":""},null,null,{"$f":"IF($B27=\"\",\"\",IFERROR(INDEX('quantities report'!$D$2:$D$10003,SMALL(IF('quantities report'!$A$2:$A$10003=O$6,ROW('quantities report'!$A$2:$A$10003)-1,\"\"),ROWS($B$8:$B27))),\"0\"))","v":""},{"$f":"IF($B27=\"\",\"\",IFERROR(INDEX('quantities report'!$D$2:$D$10003,SMALL(IF('quantities report'!$A$2:$A$10003=P$6,ROW('quantities report'!$A$2:$A$10003)-1,\"\"),ROWS($B$8:$B27))),\"0\"))","v":""},{"$f":"IF($B27=\"\",\"\",IFERROR(INDEX('quantities report'!$D$2:$D$10003,SMALL(IF('quantities report'!$A$2:$A$10003=Q$6,ROW('quantities report'!$A$2:$A$10003)-1,\"\"),ROWS($B$8:$B27))),\"0\"))","v":""},"",{"$f":"IF($B27=\"\",\"\",IFERROR(INDEX('quantities report'!$D$2:$D$10003,SMALL(IF('quantities report'!$A$2:$A$10003=S$6,ROW('quantities report'!$A$2:$A$10003)-1,\"\"),ROWS($B$8:$B27))),\"0\"))","v":""},null,""]
[null,{"$f":"IFERROR(INDEX('manual inputs'!M:M,SMALL(IF('manual inputs'!M:M<>\"\",ROW('manual inputs'!M:M)),ROW(23:23))),\"\")","v":""},{"$f":"IF($B28=\"\",\"\",IFERROR(INDEX('quantities report'!$D$2:$D$10003,SMALL(IF('quantities report'!$A$2:$A$10003=C$6,ROW('quantities report'!$A$2:$A$10003)-1,\"\"),ROWS($B$8:$B28))),\"0\"))","v":""},"",{"$f":"IF($B28=\"\",\"\",IFERROR(INDEX('quantities report'!$D$2:$D$10003,SMALL(IF('quantities report'!$A$2:$A$10003=E$6,ROW('quantities report'!$A$2:$A$10003)-1,\"\"),ROWS($B$8:$B28))),\"0\"))","v":""},{"$f":"IF($B28=\"\",\"\",IFERROR(INDEX('quantities report'!$D$2:$D$10003,SMALL(IF('quantities report'!$A$2:$A$10003=F$6,ROW('quantities report'!$A$2:$A$10003)-1,\"\"),ROWS($B$8:$B28))),\"0\"))","v":""},null,"",{"$f":"IF($B28=\"\",\"\",IFERROR(INDEX('quantities report'!$D$2:$D$10003,SMALL(IF('quantities report'!$A$2:$A$10003=I$6,ROW('quantities report'!$A$2:$A$10003)-1,\"\"),ROWS($B$8:$B28))),\"0\"))","v":""},{"$f":"IF($B28=\"\",\"\",IFERROR(INDEX('quantities report'!$D$2:$D$10003,SMALL(IF('quantities report'!$A$2:$A$10003=J$6,ROW('quantities report'!$A$2:$A$10003)-1,\"\"),ROWS($B$8:$B28))),\"0\"))","v":""},{"$f":"IF($B28=\"\",\"\",IFERROR(INDEX('quantities report'!$D$2:$D$10003,SMALL(IF('quantities report'!$A$2:$A$10003=K$6,ROW('quantities report'!$A$2:$A$10003)-1,\"\"),ROWS($B$8:$B28))),\"0\"))","v":""},{"$f":"IF($B28=\"\",\"\",IFERROR(INDEX('quantities report'!$D$2:$D$10003,SMALL(IF('quantities report'!$A$2:$A$10003=L$6,ROW('quantities report'!$A$2:$A$10003)-1,\"\"),ROWS($B$8:$B28))),\"0\"))","v":""},null,null,{"$f":"IF($B28=\"\",\"\",IFERROR(INDEX('quantities report'!$D$2:$D$10003,SMALL(IF('quantities report'!$A$2:$A$10003=O$6,ROW('quantities report'!$A$2:$A$10003)-1,\"\"),ROWS($B$8:$B28))),\"0\"))","v":""},{"$f":"IF($B28=\"\",\"\",IFERROR(INDEX('quantities report'!$D$2:$D$10003,SMALL(IF('quantities report'!$A$2:$A$10003=P$6,ROW('quantities report'!$A$2:$A$10003)-1,\"\"),ROWS($B$8:$B28))),\"0\"))","v":""},{"$f":"IF($B28=\"\",\"\",IFERROR(INDEX('quantities report'!$D$2:$D$10003,SMALL(IF('quantities report'!$A$2:$A$10003=Q$6,ROW('quantities report'!$A$2:$A$10003)-1,\"\"),ROWS($B$8:$B28))),\"0\"))","v":""},"",{"$f":"IF($B28=\"\",\"\",IFERROR(INDEX('quantities report'!$D$2:$D$10003,SMALL(IF('quantities report'!$A$2:$A$10003=S$6,ROW('quantities report'!$A$2:$A$10003)-1,\"\"),ROWS($B$8:$B28))),\"0\"))","v":""},null,{"$f":"IF($B28=\"\",\"\",SUM(R28:S28))","v":""}]
[null,{"$f":"IFERROR(INDEX('manual inputs'!M:M,SMALL(IF('manual inputs'!M:M<>\"\",ROW('manual inputs'!M:M)),ROW(24:24))),\"\")","v":""},{"$f":"IF($B29=\"\",\"\",IFERROR(INDEX('quantities report'!$D$2:$D$10003,SMALL(IF('quantities report'!$A$2:$A$10003=C$6,ROW('quantities report'!$A$2:$A$10003)-1,\"\"),ROWS($B$8:$B29))),\"0\"))","v":""},"",{"$f":"IF($B29=\"\",\"\",IFERROR(INDEX('quantities report'!$D$2:$D$10003,SMALL(IF('quantities report'!$A$2:$A$10003=E$6,ROW('quantities report'!$A$2:$A$10003)-1,\"\"),ROWS($B$8:$B29))),\"0\"))","v":""},{"$f":"IF($B29=\"\",\"\",IFERROR(INDEX('quantities report'!$D$2:$D$10003,SMALL(IF('quantities report'!$A$2:$A$10003=F$6,ROW('quantities report'!$A$2:$A$10003)-1,\"\"),ROWS($B$8:$B29))),\"0\"))","v":""},null,"",{"$f":"IF($B29=\"\",\"\",IFERROR(INDEX('quantities report'!$D$2:$D$10003,SMALL(IF('quantities report'!$A$2:$A$10003=I$6,ROW('quantities report'!$A$2:$A$10003)-1,\"\"),ROWS($B$8:$B29))),\"0\"))","v":""},{"$f":"IF($B29=\"\",\"\",IFERROR(INDEX('quantities report'!$D$2:$D$10003,SMALL(IF('quantities report'!$A$2:$A$10003=J$6,ROW('quantities report'!$A$2:$A$10003)-1,\"\"),ROWS($B$8:$B29))),\"0\"))","v":""},{"$f":"IF($B29=\"\",\"\",IFERROR(INDEX('quantities report'!$D$2:$D$10003,SMALL(IF('quantities report'!$A$2:$A$10003=K$6,ROW('quantities report'!$A$2:$A$10003)-1,\"\"),ROWS($B$8:$B29))),\"0\"))","v":""},{"$f":"IF($B29=\"\",\"\",IFERROR(INDEX('quantities report'!$D$2:$D$10003,SMALL(IF('quantities report'!$A$2:$A$10003=L$6,ROW('quantities report'!$A$2:$A$10003)-1,\"\"),ROWS($B$8:$B29))),\"0\"))","v":""},null,null,{"$f":"IF($B29=\"\",\"\",IFERROR(INDEX('quantities report'!$D$2:$D$10003,SMALL(IF('quantities report'!$A$2:$A$10003=O$6,ROW('quantities report'!$A$2:$A$10003)-1,\"\"),ROWS($B$8:$B29))),\"0\"))","v":""},{"$f":"IF($B29=\"\",\"\",IFERROR(INDEX('quantities report'!$D$2:$D$10003,SMALL(IF('quantities report'!$A$2:$A$10003=P$6,ROW('quantities report'!$A$2:$A$10003)-1,\"\"),ROWS($B$8:$B29))),\"0\"))","v":""},{"$f":"IF($B29=\"\",\"\",IFERROR(INDEX('quantities report'!$D$2:$D$10003,SMALL(IF('quantities report'!$A$2:$A$10003=Q$6,ROW('quantities report'!$A$2:$A$10003)-1,\"\"),ROWS($B$8:$B29))),\"0\"))","v":""},"",{"$f":"IF($B29=\"\",\"\",IFERROR(INDEX('quantities report'!$D$2:$D$10003,SMALL(IF('quantities report'!$A$2:$A$10003=S$6,ROW('quantities report'!$A$2:$A$10003)-1,\"\"),ROWS($B$8:$B29))),\"0\"))","v":""},null,""]
[null,{"$f":"IFERROR(INDEX('manual inputs'!M:M,SMALL(IF('manual inputs'!M:M<>\"\",ROW('manual inputs'!M:M)),ROW(25:25))),\"\")","v":""},{"$f":"IF($B30=\"\",\"\",IFERROR(INDEX('quantities report'!$D$2:$D$10003,SMALL(IF('quantities report'!$A$2:$A$10003=C$6,ROW('quantities report'!$A$2:$A$10003)-1,\"\"),ROWS($B$8:$B30))),\"0\"))","v":""},"",{"$f":"IF($B30=\"\",\"\",IFERROR(INDEX('quantities report'!$D$2:$D$10003,SMALL(IF('quantities report'!$A$2:$A$10003=E$6,ROW('quantities report'!$A$2:$A$10003)-1,\"\"),ROWS($B$8:$B30))),\"0\"))","v":""},{"$f":"IF($B30=\"\",\"\",IFERROR(INDEX('quantities report'!$D$2:$D$10003,SMALL(IF('quantities report'!$A$2:$A$10003=F$6,ROW('quantities report'!$A$2:$A$10003)-1,\"\"),ROWS($B$8:$B30))),\"0\"))","v":""},null,"",{"$f":"IF($B30=\"\",\"\",IFERROR(INDEX('quantities report'!$D$2:$D$10003,SMALL(IF('quantities report'!$A$2:$A$10003=I$6,ROW('quantities report'!$A$2:$A$10003)-1,\"\"),ROWS($B$8:$B30))),\"0\"))","v":""},{"$f":"IF($B30=\"\",\"\",IFERROR(INDEX('quantities report'!$D$2:$D$10003,SMALL(IF('quantities report'!$A$2:$A$10003=J$6,ROW('quantities report'!$A$2:$A$10003)-1,\"\"),ROWS($B$8:$B30))),\"0\"))","v":""},{"$f":"IF($B30=\"\",\"\",IFERROR(INDEX('quantities report'!$D$2:$D$10003,SMALL(IF('quantities report'!$A$2:$A$10003=K$6,ROW('quantities report'!$A$2:$A$10003)-1,\"\"),ROWS($B$8:$B30))),\"0\"))","v":""},{"$f":"IF($B30=\"\",\"\",IFERROR(INDEX('quantities report'!$D$2:$D$10003,SMALL(IF('quantities report'!$A$2:$A$10003=L$6,ROW('quantities report'!$A$2:$A$10003)-1,\"\"),ROWS($B$8:$B30))),\"0\"))","v":""},null,null,{"$f":"IF($B30=\"\",\"\",IFERROR(INDEX('quantities report'!$D$2:$D$10003,SMALL(IF('quantities report'!$A$2:$A$10003=O$6,ROW('quantities report'!$A$2:$A$10003)-1,\"\"),ROWS($B$8:$B30))),\"0\"))","v":""},{"$f":"IF($B30=\"\",\"\",IFERROR(INDEX('quantities report'!$D$2:$D$10003,SMALL(IF('quantities report'!$A$2:$A$10003=P$6,ROW('quantities report'!$A$2:$A$10003)-1,\"\"),ROWS($B$8:$B30))),\"0\"))","v":""},{"$f":"IF($B30=\"\",\"\",IFERROR(INDEX('quantities report'!$D$2:$D$10003,SMALL(IF('quantities report'!$A$2:$A$10003=Q$6,ROW('quantities report'!$A$2:$A$10003)-1,\"\"),ROWS($B$8:$B30))),\"0\"))","v":""},"",{"$f":"IF($B30=\"\",\"\",IFERROR(INDEX('quantities report'!$D$2:$D$10003,SMALL(IF('quantities report'!$A$2:$A$10003=S$6,ROW('quantities report'!$A$2:$A$10003)-1,\"\"),ROWS($B$8:$B30))),\"0\"))","v":""},null,""]
[null,{"$f":"IFERROR(INDEX('manual inputs'!M:M,SMALL(IF('manual inputs'!M:M<>\"\",ROW('manual inputs'!M:M)),ROW(27:27))),\"\")","v":""},{"$f":"IF($B31=\"\",\"\",IFERROR(INDEX('quantities report'!$D$2:$D$10003,SMALL(IF('quantities report'!$A$2:$A$10003=C$6,ROW('quantities report'!$A$2:$A$10003)-1,\"\"),ROWS($B$8:$B31))),\"0\"))","v":""},"",{"$f":"IF($B31=\"\",\"\",IFERROR(INDEX('quantities report'!$D$2:$D$10003,SMALL(IF('quantities report'!$A$2:$A$10003=E$6,ROW('quantities report'!$A$2:$A$10003)-1,\"\"),ROWS($B$8:$B31))),\"0\"))","v":""},{"$f":"IF($B31=\"\",\"\",IFERROR(INDEX('quantities report'!$D$2:$D$10003,SMALL(IF('quantities report'!$A$2:$A$10003=F$6,ROW('quantities report'!$A$2:$A$10003)-1,\"\"),ROWS($B$8:$B31))),\"0\"))","v":""},null,"",{"$f":"IF($B31=\"\",\"\",IFERROR(INDEX('quantities report'!$D$2:$D$10003,SMALL(IF('quantities report'!$A$2:$A$10003=I$6,ROW('quantities report'!$A$2:$A$10003)-1,\"\"),ROWS($B$8:$B31))),\"0\"))","v":""},{"$f":"IF($B31=\"\",\"\",IFERROR(INDEX('quantities report'!$D$2:$D$10003,SMALL(IF('quantities report'!$A$2:$A$10003=J$6,ROW('quantities report'!$A$2:$A$10003)-1,\"\"),ROWS($B$8:$B31))),\"0\"))","v":""},{"$f":"IF($B31=\"\",\"\",IFERROR(INDEX('quantities report'!$D$2:$D$10003,SMALL(IF('quantities report'!$A$2:$A$10003=K$6,ROW('quantities report'!$A$2:$A$10003)-1,\"\"),ROWS($B$8:$B31))),\"0\"))","v":""},{"$f":"IF($B31=\"\",\"\",IFERROR(INDEX('quantities report'!$D$2:$D$10003,SMALL(IF('quantities report'!$A$2:$A$10003=L$6,ROW('quantities report'!$A$2:$A$10003)-1,\"\"),ROWS($B$8:$B31))),\"0\"))","v":""},null,null,{"$f":"IF($B31=\"\",\"\",IFERROR(INDEX('quantities report'!$D$2:$D$10003,SMALL(IF('quantities report'!$A$2:$A$10003=O$6,ROW('quantities report'!$A$2:$A$10003)-1,\"\"),ROWS($B$8:$B31))),\"0\"))","v":""},{"$f":"IF($B31=\"\",\"\",IFERROR(INDEX('quantities report'!$D$2:$D$10003,SMALL(IF('quantities report'!$A$2:$A$10003=P$6,ROW('quantities report'!$A$2:$A$10003)-1,\"\"),ROWS($B$8:$B31))),\"0\"))","v":""},{"$f":"IF($B31=\"\",\"\",IFERROR(INDEX('quantities report'!$D$2:$D$10003,SMALL(IF('quantities report'!$A$2:$A$10003=Q$6,ROW('quantities report'!$A$2:$A$10003)-1,\"\"),ROWS($B$8:$B31))),\"0\"))","v":""},"",{"$f":"IF($B31=\"\",\"\",IFERROR(INDEX('quantities report'!$D$2:$D$10003,SMALL(IF('quantities report'!$A$2:$A$10003=S$6,ROW('quantities report'!$A$2:$A$10003)-1,\"\"),ROWS($B$8:$B31))),\"0\"))","v":""},null,""]
[null,{"$f":"IFERROR(INDEX(#REF!,SMALL(IF(#REF!<>\"\",ROW(#REF!)),ROW(27:27))),\"\")","v":""}]

{"sheet":"calc wrksht-rdwy exc pay item","index":8,"n_rows":52,"n_cols":5,"rows_kept":52,"cut":false,"hidden":false,"merged":[[1,1,1,4]]}
[]
[null,"EARTHWORK SUMMARY\nUSING ROADWAY EXCAVATION AND EITHER BORROW OR WASTE PAY ITEMS"]
[]
[null,"EXCAVATION (unadjusted volumes)"]
[null,null,"Total Roadway Prism Excavation =",{"$f":"SUM(Grading!D3)+SUM(Grading_secondary!D3)","v":0},"CUYD"]
[null,null,"Total Approach Road Prism Excavation =",{"$f":"Grading!E3+Grading_secondary!E3","v":0},"CUYD"]
[null,null,"Total Pay Item 20401-0000 Roadway Excavation =",{"$f":"SUM(D5:D6)","v":0},"CUYD"]
[]
[null,"EXCAVATION MATERIAL AVAILABLE FOR FILL (unadjusted volumes)"]
[null,null,"Total Structure Excavation (walls) =",{"$f":"Grading!G3+Grading_secondary!G3","v":0},"CUYD"]
[null,null,"Total Excavation from Roadway Obliteration = ",{"$f":"Grading!H3+Grading_secondary!H3","v":0},"CUYD"]
[null,null,"Total Subexcavation =",{"$f":"Grading!I3+Grading_secondary!I3","v":0},"CUYD"]
[null,null,"Total =",{"$f":"SUM(D10:D12)","v":0},"CUYD"]
[]
[null,"EXCAVATION MATERIAL UNAVAILABLE FOR FILL (unadjusted volumes)"]
[null,null,"Total Pavement Removal in Cuts =",{"$f":"Grading!J3+Grading_secondary!J3","v":0},"CUYD"]
[null,null,"Total Topsoil Stripping in Cuts =",{"$f":"Grading!K3+Grading_secondary!K3","v":0},"CUYD"]
[null,null,"Total Waste Subexcavation =",{"$f":"Grading!L3+Grading_secondary!L3","v":0},"CUYD"]
[null,null,"Total =",{"$f":"SUM(D16:D18)","v":0},"CUYD"]
[]
[null,"TOTAL EXCAVATION AVAILABLE FOR FILLS (adjusted volume)"]
[null,null,"Total Volume After Adjustments Applied (Including Shrink/Swell) =",{"$f":"Grading!N3+Grading_secondary!N3","v":0},"CUYD"]
[]
[null,"EMBANKMENT (unadjusted volumes)"]
[null,null,"Total Roadway Prism Fill =",{"$f":"Grading!P3+Grading_secondary!P3","v":0},"CUYD"]
[null,null,"Total Approach Road Prism Fill =",{"$f":"Grading!Q3+Grading_secondary!Q3","v":0},"CUYD"]
[null,null,"Total =",{"$f":"SUM(D25:D26)","v":0},"CUYD"]
[]
[null,"BACKFILL"]
[null,null,"Total Various Types of Wall Backfill Material =",{"$f":"SUM(Grading!S3:Z3)+SUM(Grading_secondary!S3:Z3)","v":0},"CUYD"]
[null,null,"Total Backfill for Pavement Removal Under Fill =",{"$f":"Grading!AA3+Grading_secondary!AA3","v":0},"CUYD"]
[null,null,"Total Topsoil Replacement Under Fill =",{"$f":"Grading!AB3+Grading_secondary!AB3","v":0},"CUYD"]
[null,null,"Total Volume for Riprap =",{"$f":"Grading!AE3+Grading_secondary!AE3","v":0},"CUYD"]
[null,null,"Total Volume for Special Rock Embankment =",{"$f":"Grading!AF3+Grading_secondary!AF3","v":0},"CUYD"]
[null,null,"Total Embankment for Roadway Obliteration =",{"$f":"Grading!AG3+Grading_secondary!AG3","v":0},"CUYD"]
[null,null,"Total Subexcavation =",{"$f":"Grading!AC3+Grading_secondary!AC3","v":0},"CUYD"]
[null,null,"Total Volume for Topping or Select Topping =",{"$f":"Grading!AH3+Grading_secondary!AH3","v":0},"CUYD"]
[null,null,"Total Volume for Aggregate Base =",{"$f":"Grading!AD3+Grading_secondary!AD3","v":0},"CUYD"]
[null,null,"Total =",{"$f":"SUM(D30:D38)","v":0},"CUYD"]
[]
[null,"EXCAVATION MINUS EMBANKMENT"]
[null,null,"Total Estimated Excavation Available for Fills =",{"$f":"D22","v":0},"CUYD"]
[null,null,"Total Estimated Fill Material Required =",{"$f":"D27+D39","v":0},"CUYD"]
[null,null,"Excavation - Embankment = ",{"$f":"D42-D43","v":0},"CUYD"]
[]
[null,"WASTE"]
[null,null,"Estimated Total Pay Item 20441-0000 Waste =",{"$f":"IF(D44>0,D44,\"NA\")","v":"NA"},"CUYD"]
[]
[null,"BORROW"]
[null,null,"Estimated Unadjusted Volume of Unclassified Borrow Required =",{"$f":"IF(D44<0,ABS(D44), \"NA\" )","v":"NA"},"CUYD"]
[null,null,"Estimated Shrink / Swell at Borrow Pit Site =",0.9]
[null,null,"Estimated Total Pay Item 20403-0000 Unclassified Borrow  =",{"$f":"IF(D50=\"NA\",\"NA\",ABS((ROUNDUP(D50/D51,0))))","v":"NA"},"CUYD"]

{"sheet":"Grading Summary - rdwy exc","index":9,"n_rows":57,"n_cols":20,"rows_kept":57,"cut":false,"hidden":false,"merged":[[48,6,48,19],[28,4,28,6],[6,12,6,13],[7,12,11,12],[7,13,11,13],[6,7,6,8],[6,10,6,11],[6,14,6,15],[7,4,12,6],[7,7,11,7],[7,8,11,8],[6,16,6,18],[7,17,11,17],[7,18,11,18],[47,6,47,19],[11,0,11,1],[12,0,12,1],[40,20,40,29],[7,9,11,9],[7,10,11,10],[7,11,11,11],[7,14,11,14],[7,15,11,15],[7,16,11,16],[7,19,11,19],[37,4,37,6],[40,6,40,19],[1,0,10,0],[1,1,10,1],[5,4,5,19],[6,4,6,6],[28,0,28,1],[41,6,41,19],[41,20,41,29],[45,6,45,19],[46,6,46,19],[42,6,42,13],[43,6,43,13],[44,6,44,18]]}
[]
["<---Type Beginning Row Number","<---Automatic calculates except for last row",null,null,"NOTE TO DESIGNER:  Adjust the Notes below the Grading Summary to fit your project."]
[]
[null,null,null,null,null,null,null,"Column D","Column E","Column F","Columns G,H,I","Columns J,K,L","Column M","Column N","Column P","Column Q","Columns S-AH","Column AI","Column AJ","Column AK or AO"]
[]
[null,null,null,null,"GRADING SUMMARY"]
[null,null,null,null,null,null,null,"Roadway Excavation",null,"Pay Item\n20401-0000","Additional Excavation\nFor info only",null,"For info only",null,"Embankment\nFor info only",null,"For info only",null,null,"For Info Only"]
[null,null,null,null,"Station to Station",null,null,"Prismoidal Volume","Approach\nRoads","ROADWAY EXCAVATION","(+)\nAvailable\nMaterial\n(see note 3)","(-)\nUnavailable\nMaterial\n(see note 4)","Shrink/Swell Factor\n(see note 5)","Total Excavation Avaliable For Fills","Prismoidal Volume","Approach\nRoads","(+)\nBackfill\n(see note 6)","Total Embankment","Excavation-Embankment",{"$f":"IF('calc wrksht-rdwy exc pay item'!$D$47=\"NA\", \"UNCLASSIFIED BORROW\n(see note 7)\",\"WASTE\n(see note 7)\")","v":"UNCLASSIFIED BORROW\n(see note 7)"}]
[]
[]
[]
["Rows from"]
["Grading",null,null,null,null,null,null,"BCY","BCY","CUYD","BCY","BCY",null,"CCY","CCY","CCY","CCY","CCY","CCY","CUYD"]
[null,{"$f":"IF(A15=\"\",\"\",+A15)","v":""},null,null,{"$f":"IF(A14=\"\",\"\",INDIRECT(CONCATENATE($A$13,\"!\",\"B\",A14)))","v":""},{"$f":"IF(E14=\"\",\"\",\"-\")","v":""},{"$f":"IF(A14=\"\",\"\",INDIRECT(CONCATENATE($A$13,\"!\",\"b\",B14)))","v":""},{"$f":"IF(E14=\"\",\"\",ROUND(SUM(INDIRECT(CONCATENATE($A$13,\"!\",\"D\",$B14))),0))","v":""},{"$f":"IF(F14=\"\",\"\",ROUND(SUM(INDIRECT(CONCATENATE($A$13,\"!\",\"E\",$B14))),0))","v":""},{"$f":"IF(F14=\"\",\"\",ROUND(SUM(INDIRECT(CONCATENATE($A$13,\"!\",\"F\",$B14))),0))","v":""},{"$f":"IF(E14=\"\",\"\",ROUND(SUM(INDIRECT(CONCATENATE($A$13,\"!\",\"G\",$B14,\":\",\"I\",$B14))),0))","v":""},{"$f":"IF(E14=\"\",\"\",ROUND(SUM(INDIRECT(CONCATENATE($A$13,\"!\",\"J\",$B14,\":\",\"L\",$B14))),0))","v":""},{"$f":"IF(G14=\"\",\"\",ROUND(AVERAGE(INDIRECT(CONCATENATE($A$13,\"!\",\"M\",$B14))),2))","v":""},{"$f":"IF(H14=\"\",\"\",ROUND(SUM(INDIRECT(CONCATENATE($A$13,\"!\",\"n\",$B14))),0))","v":""},{"$f":"IF(F14=\"\",\"\",ROUND(SUM(INDIRECT(CONCATENATE($A$13,\"!\",\"p\",$B14))),0))","v":""},{"$f":"IF(F14=\"\",\"\",ROUND(SUM(INDIRECT(CONCATENATE($A$13,\"!\",\"Q\",$B14))),0))","v":""},{"$f":"IF(E14=\"\",\"\",ROUND(SUM(INDIRECT(CONCATENATE($A$13,\"!\",\"s\",$B14,\":\",\"Ah\",$B14))),0))","v":""},{"$f":"IF(G14=\"\",\"\",ROUND(SUM(INDIRECT(CONCATENATE($A$13,\"!\",\"Ai\",$B14))),0))","v":""},{"$f":"IF(H14=\"\",\"\",ROUND(SUM(INDIRECT(CONCATENATE($A$13,\"!\",\"AJ\",$B14))),0))","v":""}]
[null,{"$f":"IF(A16=\"\",\"\",+A16)","v":""},null,null,{"$f":"IF(A15=\"\",\"\",INDIRECT(CONCATENATE($A$13,\"!\",\"B\",A15)))","v":""},"",{"$f":"IF(A15=\"\",\"\",INDIRECT(CONCATENATE($A$13,\"!\",\"b\",B15)))","v":""},{"$f":"IF(E15=\"\",\"\",ROUND(SUM(INDIRECT(CONCATENATE($A$13,\"!\",\"D\",$B15))),0))","v":""},{"$f":"IF(F15=\"\",\"\",ROUND(SUM(INDIRECT(CONCATENATE($A$13,\"!\",\"E\",$B15))),0))","v":""},{"$f":"IF(F15=\"\",\"\",ROUND(SUM(INDIRECT(CONCATENATE($A$13,\"!\",\"F\",$B15))),0))","v":""},{"$f":"IF(E15=\"\",\"\",ROUND(SUM(INDIRECT(CONCATENATE($A$13,\"!\",\"G\",$B15,\":\",\"I\",$B15))),0))","v":""},{"$f":"IF(E15=\"\",\"\",ROUND(SUM(INDIRECT(CONCATENATE($A$13,\"!\",\"J\",$B15,\":\",\"L\",$B15))),0))","v":""},{"$f":"IF(G15=\"\",\"\",ROUND(AVERAGE(INDIRECT(CONCATENATE($A$13,\"!\",\"M\",$B15))),2))","v":""},{"$f":"IF(H15=\"\",\"\",ROUND(SUM(INDIRECT(CONCATENATE($A$13,\"!\",\"n\",$B15))),0))","v":""},{"$f":"IF(F15=\"\",\"\",ROUND(SUM(INDIRECT(CONCATENATE($A$13,\"!\",\"p\",$B15))),0))","v":""},{"$f":"IF(F15=\"\",\"\",ROUND(SUM(INDIRECT(CONCATENATE($A$13,\"!\",\"Q\",$B15))),0))","v":""},{"$f":"IF(E15=\"\",\"\",ROUND(SUM(INDIRECT(CONCATENATE($A$13,\"!\",\"s\",$B15,\":\",\"Ah\",$B15))),0))","v":""},{"$f":"IF(G15=\"\",\"\",ROUND(SUM(INDIRECT(CONCATENATE($A$13,\"!\",\"Ai\",$B15))),0))","v":""},{"$f":"IF(H15=\"\",\"\",ROUND(SUM(INDIRECT(CONCATENATE($A$13,\"!\",\"AJ\",$B15))),0))","v":""}]
[null,"",null,null,"","","","","","","","","","","","","","",""]
[null,{"$f":"IF(A18=\"\",\"\",+A18)","v":""},null,null,"","","","","","","","","","","","","","",""]
[null,"",null,null,"","","","","","","","","","","","","","",""]
[null,"",null,null,"","","","","","","","","","","","","","",""]
[null,"",null,null,"","","","","","","","","","","","","","",""]
[null,"",null,null,"","","","","","","","","","","","","","",""]
[null,"",null,null,"","","","","","","","","","","","","","",""]
[null,"",null,null,"","","","","","","","","","","","","","",""]
[null,"",null,null,"","","","","","","","","","","","","","",""]
[null,null,null,null,"","","","","","","","","","","","","","",""]
[null,"",null,null,"","","","","","","","","","","","","","",""]
[null,"",null,null,null,null,null,"","","","","","","","","","","",""]
[]
["Grading_Secondary",null,null,null,"Secondary Alignment"]
[null,{"$f":"IF(A31=\"\",\"\",+A31)","v":""},null,null,{"$f":"IF(A30=\"\",\"\",INDIRECT(CONCATENATE($A$29,\"!\",\"B\",A30)))","v":""},"",{"$f":"IF(A30=\"\",\"\",INDIRECT(CONCATENATE($A$29,\"!\",\"b\",B30)))","v":""},{"$f":"IF(E30=\"\",\"\",ROUND(SUM(INDIRECT(CONCATENATE($A$29,\"!\",\"D\",$B30))),0))","v":""},{"$f":"IF(F30=\"\",\"\",ROUND(SUM(INDIRECT(CONCATENATE($A$29,\"!\",\"E\",$B30))),0))","v":""},{"$f":"IF(F30=\"\",\"\",ROUND(SUM(INDIRECT(CONCATENATE($A$29,\"!\",\"F\",$B30))),0))","v":""},{"$f":"IF(E30=\"\",\"\",ROUND(SUM(INDIRECT(CONCATENATE($A$29,\"!\",\"G\",$B30,\":\",\"I\",$B30))),0))","v":""},{"$f":"IF(E30=\"\",\"\",ROUND(SUM(INDIRECT(CONCATENATE($A$29,\"!\",\"J\",$B30,\":\",\"L\",$B30))),0))","v":""},{"$f":"IF(G30=\"\",\"\",ROUND(AVERAGE(INDIRECT(CONCATENATE($A$29,\"!\",\"M\",$B30))),2))","v":""},{"$f":"IF(H30=\"\",\"\",ROUND(SUM(INDIRECT(CONCATENATE($A$29,\"!\",\"N\",$B30))),0))","v":""},{"$f":"IF(F30=\"\",\"\",ROUND(SUM(INDIRECT(CONCATENATE($A$29,\"!\",\"P\",$B30))),0))","v":""},{"$f":"IF(F30=\"\",\"\",ROUND(SUM(INDIRECT(CONCATENATE($A$29,\"!\",\"Q\",$B30))),0))","v":""},{"$f":"IF(E30=\"\",\"\",ROUND(SUM(INDIRECT(CONCATENATE($A$29,\"!\",\"S\",$B30,\":\",\"AH\",$B30))),0))","v":""},{"$f":"IF(G30=\"\",\"\",ROUND(SUM(INDIRECT(CONCATENATE($A$29,\"!\",\"aI\",$B30))),0))","v":""},{"$f":"IF(H30=\"\",\"\",ROUND(SUM(INDIRECT(CONCATENATE($A$29,\"!\",\"aj\",$B30))),0))","v":""}]
[null,"",null,null,{"$f":"IF(A31=\"\",\"\",INDIRECT(CONCATENATE($A$29,\"!\",\"B\",A31)))","v":""},{"$f":"IF(E31=\"\",\"\",\"-\")","v":""},{"$f":"IF(A31=\"\",\"\",INDIRECT(CONCATENATE($A$29,\"!\",\"b\",B31)))","v":""},{"$f":"IF(E31=\"\",\"\",ROUND(SUM(INDIRECT(CONCATENATE($A$29,\"!\",\"D\",$B31))),0))","v":""},{"$f":"IF(F31=\"\",\"\",ROUND(SUM(INDIRECT(CONCATENATE($A$29,\"!\",\"E\",$B31))),0))","v":""},{"$f":"IF(F31=\"\",\"\",ROUND(SUM(INDIRECT(CONCATENATE($A$29,\"!\",\"F\",$B31))),0))","v":""},{"$f":"IF(E31=\"\",\"\",ROUND(SUM(INDIRECT(CONCATENATE($A$29,\"!\",\"G\",$B31,\":\",\"I\",$B31))),0))","v":""},{"$f":"IF(E31=\"\",\"\",ROUND(SUM(INDIRECT(CONCATENATE($A$29,\"!\",\"J\",$B31,\":\",\"L\",$B31))),0))","v":""},{"$f":"IF(G31=\"\",\"\",ROUND(AVERAGE(INDIRECT(CONCATENATE($A$29,\"!\",\"M\",$B31))),2))","v":""},{"$f":"IF(H31=\"\",\"\",ROUND(SUM(INDIRECT(CONCATENATE($A$29,\"!\",\"N\",$B31))),0))","v":""},{"$f":"IF(F31=\"\",\"\",ROUND(SUM(INDIRECT(CONCATENATE($A$29,\"!\",\"P\",$B31))),0))","v":""},{"$f":"IF(F31=\"\",\"\",ROUND(SUM(INDIRECT(CONCATENATE($A$29,\"!\",\"Q\",$B31))),0))","v":""},{"$f":"IF(E31=\"\",\"\",ROUND(SUM(INDIRECT(CONCATENATE($A$29,\"!\",\"S\",$B31,\":\",\"AH\",$B31))),0))","v":""},{"$f":"IF(G31=\"\",\"\",ROUND(SUM(INDIRECT(CONCATENATE($A$29,\"!\",\"aI\",$B31))),0))","v":""},{"$f":"IF(H31=\"\",\"\",ROUND(SUM(INDIRECT(CONCATENATE($A$29,\"!\",\"aj\",$B31))),0))","v":""}]
[null,"",null,null,"","","","","","","","","","","","","","",""]
[null,"",null,null,"","","","","","","","","","","","","","",""]
[null,"",null,null,"","","","","","","","","","","","","","",""]
[null,"",null,null,"","","","","","","","","","","","","","",""]
[null,"",null,null,"","","","","","","","","","","","","","",""]
[null,""]
[null,null,null,null,"TOTALS",null,null,{"$f":"SUM(H14:H37)","v":0},0,0,0,0,null,0,0,0,0,0,0,{"$f":"IF($T$8=\"UNCLASSIFIED BORROW\n(see note 6)\",'calc wrksht-rdwy exc pay item'!$D$52,'calc wrksht-rdwy exc pay item'!$D$47)","v":"NA"}]
[]
[null,null,null,null,"NOTE:"]
[null,null,null,null,null,1,"Quantities based on prismoidal (surface to surface) volumes."]
[null,null,null,null,null,2,"Conserve <<XXX>> inches of topsoil in cut and fill slope areas.  "]
[null,null,null,null,null,3,"Available material includes <<INSERT PROJECT SPECIFIC INFORMATION-See Notes to Designer Note 1>>."]
[null,null,null,null,null,4,"Unavailable material includes <<INSERT PROJECT SPECIFIC INFORMATION-See Notes to Designer Note 2>>."]
[null,null,null,null,null,5,"The average shrink/swell factor shown is computed by taking an average of recommended values over the specified range. Refer to the Geotech Report for recommended shrink/swell factors."]
[null,null,null,null,null,6,"Backfill includes <<INSERT PROJECT SPECIFIC INFORMATION-See Notes to Designer Note 3>>."]
[null,null,null,null,null,7,{"$f":"IF('calc wrksht-rdwy exc pay item'!$D$47=\"NA\", \"Unclassified borrow quantity calculated using volumes adjusted using shrink/swell. An assumed value of 0.9 was used for borrow material calculations. The contractor is responsible for determining the actual shrink/swell on the borrow material.\",\"Waste quantity calculated using volumes adjusted with shrink/swell shown.\")","v":"Unclassified borrow quantity calculated using volumes adjusted using shrink/swell. An assumed value of 0.9 was used for borrow material calculations. The contractor is responsible for determining the actual shrink/swell on the borrow material."}]
[null,null,null,null,null,8,"The quantities shown herein are approximations.  Payment will be made for the actual quantities of work performed."]
[null,null,null,null,null,9,"BCY = Bank cubic yard - one cubic yard of material as it lies in the natural state.\nCCY = Compacted cubic yard - one cubic yard of material after it has been compacted to specification density."]
[]
[]
[null,null,null,null,"NOTES TO DESIGNER:"]
[null,null,null,null,1,"Available material is anything in the grading tab in columns G, H and I"]
[null,null,null,null,2,"Unavailable material is anything in the grading tab in columns J, K and L"]
[null,null,null,null,3,"Backfill is anything in the grading tab in columns S, T, U, V, W, X, Y, Z, AA, AB, AC, AD, AE, AF, AG and AH"]
[null,null,null,null,4,"Note 7 should update based on waste vs. borrow.  Please check to make sure the correct note is being shown."]
[null,null,null,null,5,"Be sure to change all text to black before printing."]

{"sheet":"calc wrksht-emb const pay item","index":10,"n_rows":52,"n_cols":5,"rows_kept":52,"cut":false,"hidden":false,"merged":[[1,1,1,4]]}
[]
[null,"EARTHWORK SUMMARY\nUSING EMBANKMENT CONSTRUCTION PAY ITEM"]
[]
[null,"EXCAVATION (unadjusted volumes)"]
[null,null,"Total Roadway Prism Excavation =",{"$f":"SUM(Grading!D3)+SUM(Grading_secondary!D3)","v":0},"CUYD"]
[null,null,"Total Approach Road Prism Excavation =",{"$f":"Grading!E3+Grading_secondary!E3","v":0},"CUYD"]
[null,null,"Total =",{"$f":"SUM(D5:D6)","v":0},"CUYD"]
[]
[null,"EXCAVATION MATERIAL AVAILABLE FOR FILL (unadjusted volumes)"]
[null,null,"Total Structure Excavation (walls) =",{"$f":"Grading!G3+Grading_secondary!G3","v":0},"CUYD"]
[null,null,"Total Excavation from Roadway Obliteration = ",{"$f":"Grading!H3+Grading_secondary!H3","v":0},"CUYD"]
[null,null,"Total Subexcavation =",{"$f":"Grading!I3+Grading_secondary!I3","v":0},"CUYD"]
[null,null,"Total =",{"$f":"SUM(D10:D12)","v":0},"CUYD"]
[]
[null,"EXCAVATION MATERIAL UNAVAILABLE FOR FILL (unadjusted volumes)"]
[null,null,"Total Pavement Removal in Cuts =",{"$f":"Grading!J3+Grading_secondary!J3","v":0},"CUYD"]
[null,null,"Total Topsoil Stripping in Cuts =",{"$f":"Grading!K3+Grading_secondary!K3","v":0},"CUYD"]
[null,null,"Total Waste Subexcavation =",{"$f":"Grading!L3+Grading_secondary!L3","v":0},"CUYD"]
[null,null,"Total =",{"$f":"SUM(D16:D18)","v":0},"CUYD"]
[]
[null,"TOTAL EXCAVATION AVAILABLE FOR FILLS (adjusted volume)"]
[null,null,"Total Volume After Adjustments Applied (Including Shrink/Swell) =",{"$f":"Grading!N3+Grading_secondary!N3","v":0},"CUYD"]
[]
[null,"EMBANKMENT (unadjusted volumes)"]
[null,null,"Total Roadway Prism Fill =",{"$f":"Grading!P3+Grading_secondary!P3","v":0},"CUYD"]
[null,null,"Total Approach Road Prism Fill =",{"$f":"Grading!Q3+Grading_secondary!Q3","v":0},"CUYD"]
[null,null,"Total =",{"$f":"SUM(D25:D26)","v":0},"CUYD"]
[]
[null,"BACKFILL"]
[null,null,"Total Various Types of Wall Backfill Material =",{"$f":"SUM(Grading!S3:Z3)+SUM(Grading_secondary!S3:Z3)","v":0},"CUYD"]
[null,null,"Total Backfill for Pavement Removal Under Fill =",{"$f":"Grading!AA3+Grading_secondary!AA3","v":0},"CUYD"]
[null,null,"Total Topsoil Replacement Under Fill =",{"$f":"Grading!AB3+Grading_secondary!AB3","v":0},"CUYD"]
[null,null,"Total Volume for Riprap =",{"$f":"Grading!AE3+Grading_secondary!AE3","v":0},"CUYD"]
[null,null,"Total Volume for Special Rock Embankment =",{"$f":"Grading!AF3+Grading_secondary!AF3","v":0},"CUYD"]
[null,null,"Total Embankment for Roadway Obliteration =",{"$f":"Grading!AG3+Grading_secondary!AG3","v":0},"CUYD"]
[null,null,"Total Subexcavation =",{"$f":"Grading!AC3+Grading_secondary!AC3","v":0},"CUYD"]
[null,null,"Total Volume for Topping or Select Topping =",{"$f":"Grading!AH3+Grading_secondary!AH3","v":0},"CUYD"]
[null,null,"Total Volume for Aggregate Base =",{"$f":"Grading!AD3+Grading_secondary!AD3","v":0},"CUYD"]
[null,null,"Total =",{"$f":"SUM(D30:D38)","v":0},"CUYD"]
[]
[null,"EXCAVATION MINUS EMBANKMENT"]
[null,null,"Total Estimated Excavation Available for Fills =",{"$f":"D22","v":0},"CUYD"]
[null,null,"Total Estimated Fill Material Required =",{"$f":"D27+D39","v":0},"CUYD"]
[null,null,"Excavation - Embankment = ",{"$f":"D42-D43","v":0},"CUYD"]
[]
[null,"EMBANKMENT CONSTRUCTION"]
[null,null,"Estimated Total Pay Item 20420-0000 Embankment Construction =",{"$f":"D27","v":0},"CUYD"]
[]
[null,"UNCLASSIFIED BORROW"]
[null,null,"Estimated Unadjusted Volume of Unclassified Borrow Required =",{"$f":"ABS(Grading!AM3+Grading_secondary!AM3)","v":0},"CUYD"]
[null,null,"Estimated Shrink / Swell at Borrow Pit Site =",{"$f":"Grading!AN3","v":0.8999999999999998}]
[null,null,"Estimated Quantity of Unclassified Borrow Required =",{"$f":"ABS(Grading!AO3+Grading_secondary!AO3)","v":0},"CUYD"]

{"sheet":"Grading Summary - emb const","index":11,"n_rows":56,"n_cols":21,"rows_kept":56,"cut":false,"hidden":false,"merged":[[45,6,45,19],[48,6,48,19],[41,6,41,19],[7,8,11,8],[42,6,42,13],[43,6,43,13],[44,6,44,18],[7,4,12,6],[7,7,11,7],[46,6,46,19],[47,6,47,19],[28,4,28,6],[40,6,40,19],[6,17,6,19],[7,18,11,18],[7,19,11,19],[7,17,11,17],[7,11,11,11],[7,14,11,14],[7,15,11,15],[7,16,11,16],[58,6,58,17],[57,6,57,17],[53,22,53,31],[54,22,54,31],[56,6,56,20],[11,0,11,1],[12,0,12,1],[37,4,37,6],[1,0,10,0],[1,1,10,1],[5,4,5,20],[6,4,6,6],[6,7,6,9],[6,10,6,11],[6,14,6,15],[7,12,11,12],[7,13,11,13],[6,12,6,13],[7,9,11,9],[7,10,11,10],[7,20,11,20]]}
[]
["<---Type Beginning Row Number","<---Automatic calculates except for last row",null,null,"NOTE TO DESIGNER:  Adjust the Notes below the Grading Summary to fit your project."]
[]
[null,null,null,null,null,null,null,"Column D","Column E","Column F","Columns G,H,I","Columns J,K,L","Column M","Column N","Column P","Column Q","Column R","Columns S-AH","Column AI","Column AJ","Column AO"]
[]
[null,null,null,null,"GRADING SUMMARY"]
[null,null,null,null,null,null,null,"Roadway Excavation",null,null,"Additional Excavation\nFor info only",null,"For info only",null,"Embankment",null,"Pay Item\n20420-0000","For info only",null,null,"For info only"]
[null,null,null,null,"Station to Station",null,null,"Prismoidal Volume","Approach\nRoads","Roadway\nExcavation","(+)\nAvailable\nMaterial\n(see note 3)","(-)\nUnavailable\nMaterial\n(see note 4)","Shrink/Swell Factor\n(see note 5)","Total Excavation Available For Fills","Prismoidal Volume","Approach\nRoads","Embankment Construction","(+)\nBackfill\n(see note 6)","Total Embankment","Excavation - Embankment","Estimated Unclassified Borrow Volume\n(see note 7)"]
[]
[]
[]
["Rows from"]
["Grading",null,null,null,null,null,null,"BCY","BCY","BCY","BCY","BCY",null,"CCY","CCY","CCY","CUYD","CCY","CCY","CCY","BCY"]
[null,{"$f":"IF(A15=\"\",\"\",+A15)","v":""},null,null,{"$f":"IF(B14=\"\",\"\",INDIRECT(CONCATENATE($A$13,\"!\",\"B\",A14)))","v":""},{"$f":"IF(E14=\"\",\"\",\"-\")","v":""},{"$f":"IF(A14=\"\",\"\",INDIRECT(CONCATENATE($A$13,\"!\",\"B\",B14)))","v":""},{"$f":"IF(E14=\"\",\"\",ROUND(SUM(INDIRECT(CONCATENATE($A$13,\"!\",\"D\",$B14))),0))","v":""},{"$f":"IF(F14=\"\",\"\",ROUND(SUM(INDIRECT(CONCATENATE($A$13,\"!\",\"E\",$B14))),0))","v":""},{"$f":"IF(F14=\"\",\"\",ROUND(SUM(INDIRECT(CONCATENATE($A$13,\"!\",\"F\",$B14))),0))","v":""},{"$f":"IF(E14=\"\",\"\",ROUND(SUM(INDIRECT(CONCATENATE($A$13,\"!\",\"G\",$A14,\":\",\"I\",$B14))),0))","v":""},{"$f":"IF(E14=\"\",\"\",ROUND(SUM(INDIRECT(CONCATENATE($A$13,\"!\",\"J\",$A14,\":\",\"L\",$B14))),0))","v":""},{"$f":"IF(G14=\"\",\"\",ROUND(AVERAGE(INDIRECT(CONCATENATE($A$13,\"!\",\"M\",$B14))),2))","v":""},{"$f":"IF(H14=\"\",\"\",ROUND(SUM(INDIRECT(CONCATENATE($A$13,\"!\",\"N\",$B14))),0))","v":""},{"$f":"IF(F14=\"\",\"\",ROUND(SUM(INDIRECT(CONCATENATE($A$13,\"!\",\"P\",$B14))),0))","v":""},{"$f":"IF(F14=\"\",\"\",ROUND(SUM(INDIRECT(CONCATENATE($A$13,\"!\",\"Q\",$B14))),0))","v":""},{"$f":"IF(G14=\"\",\"\",ROUND(SUM(INDIRECT(CONCATENATE($A$13,\"!\",\"R\",$B14))),0))","v":""},{"$f":"IF(F14=\"\",\"\",ROUND(SUM(INDIRECT(CONCATENATE($A$13,\"!\",\"S\",$A14,\":\",\"AH\",$B14))),0))","v":""},{"$f":"IF(H14=\"\",\"\",ROUND(SUM(INDIRECT(CONCATENATE($A$13,\"!\",\"AI\",$B14))),0))","v":""},{"$f":"IF(I14=\"\",\"\",ROUND(SUM(INDIRECT(CONCATENATE($A$13,\"!\",\"AJ\",$B14))),0))","v":""},{"$f":"IF(H14=\"\",\"\",ROUND(SUM(INDIRECT(CONCATENATE($A$13,\"!\",\"AO\",$B14))),0))","v":""}]
[null,{"$f":"IF(A16=\"\",\"\",+A16)","v":""},null,null,{"$f":"IF(A15=\"\",\"\",INDIRECT(CONCATENATE($A$13,\"!\",\"B\",A15)))","v":""},"",{"$f":"IF(A15=\"\",\"\",INDIRECT(CONCATENATE($A$13,\"!\",\"B\",B15)))","v":""},{"$f":"IF(E15=\"\",\"\",ROUND(SUM(INDIRECT(CONCATENATE($A$13,\"!\",\"D\",$B15))),0))","v":""},{"$f":"IF(F15=\"\",\"\",ROUND(SUM(INDIRECT(CONCATENATE($A$13,\"!\",\"E\",$B15))),0))","v":""},{"$f":"IF(F15=\"\",\"\",ROUND(SUM(INDIRECT(CONCATENATE($A$13,\"!\",\"F\",$B15))),0))","v":""},{"$f":"IF(E15=\"\",\"\",ROUND(SUM(INDIRECT(CONCATENATE($A$13,\"!\",\"G\",$B15,\":\",\"I\",$B15))),0))","v":""},{"$f":"IF(E15=\"\",\"\",ROUND(SUM(INDIRECT(CONCATENATE($A$13,\"!\",\"J\",$B15,\":\",\"L\",$B15))),0))","v":""},{"$f":"IF(G15=\"\",\"\",ROUND(AVERAGE(INDIRECT(CONCATENATE($A$13,\"!\",\"M\",$B15))),2))","v":""},{"$f":"IF(H15=\"\",\"\",ROUND(SUM(INDIRECT(CONCATENATE($A$13,\"!\",\"N\",$B15))),0))","v":""},{"$f":"IF(F15=\"\",\"\",ROUND(SUM(INDIRECT(CONCATENATE($A$13,\"!\",\"P\",$B15))),0))","v":""},{"$f":"IF(F15=\"\",\"\",ROUND(SUM(INDIRECT(CONCATENATE($A$13,\"!\",\"Q\",$B15))),0))","v":""},{"$f":"IF(G15=\"\",\"\",ROUND(SUM(INDIRECT(CONCATENATE($A$13,\"!\",\"r\",$B15))),0))","v":""},{"$f":"IF(F15=\"\",\"\",ROUND(SUM(INDIRECT(CONCATENATE($A$13,\"!\",\"s\",$B15,\":\",\"Ah\",$B15))),0))","v":""},{"$f":"IF(H15=\"\",\"\",ROUND(SUM(INDIRECT(CONCATENATE($A$13,\"!\",\"ai\",$B15))),0))","v":""},{"$f":"IF(I15=\"\",\"\",ROUND(SUM(INDIRECT(CONCATENATE($A$13,\"!\",\"aj\",$B15))),0))","v":""},{"$f":"IF(H15=\"\",\"\",ROUND(SUM(INDIRECT(CONCATENATE($A$13,\"!\",\"Ao\",$B15))),0))","v":""}]
[null,{"$f":"IF(A17=\"\",\"\",+A17)","v":""},null,null,{"$f":"IF(A16=\"\",\"\",INDIRECT(CONCATENATE($A$13,\"!\",\"B\",A16)))","v":""},"",{"$f":"IF(A16=\"\",\"\",INDIRECT(CONCATENATE($A$13,\"!\",\"B\",B16)))","v":""},{"$f":"IF(E16=\"\",\"\",ROUND(SUM(INDIRECT(CONCATENATE($A$13,\"!\",\"D\",$B16))),0))","v":""},{"$f":"IF(F16=\"\",\"\",ROUND(SUM(INDIRECT(CONCATENATE($A$13,\"!\",\"E\",$B16))),0))","v":""},{"$f":"IF(F16=\"\",\"\",ROUND(SUM(INDIRECT(CONCATENATE($A$13,\"!\",\"F\",$B16))),0))","v":""},{"$f":"IF(E16=\"\",\"\",ROUND(SUM(INDIRECT(CONCATENATE($A$13,\"!\",\"G\",$B16,\":\",\"I\",$B16))),0))","v":""},{"$f":"IF(E16=\"\",\"\",ROUND(SUM(INDIRECT(CONCATENATE($A$13,\"!\",\"J\",$B16,\":\",\"L\",$B16))),0))","v":""},{"$f":"IF(G16=\"\",\"\",ROUND(AVERAGE(INDIRECT(CONCATENATE($A$13,\"!\",\"M\",$B16))),2))","v":""},{"$f":"IF(H16=\"\",\"\",ROUND(SUM(INDIRECT(CONCATENATE($A$13,\"!\",\"N\",$B16))),0))","v":""},{"$f":"IF(F16=\"\",\"\",ROUND(SUM(INDIRECT(CONCATENATE($A$13,\"!\",\"P\",$B16))),0))","v":""},{"$f":"IF(F16=\"\",\"\",ROUND(SUM(INDIRECT(CONCATENATE($A$13,\"!\",\"Q\",$B16))),0))","v":""},{"$f":"IF(G16=\"\",\"\",ROUND(SUM(INDIRECT(CONCATENATE($A$13,\"!\",\"r\",$B16))),0))","v":""},{"$f":"IF(F16=\"\",\"\",ROUND(SUM(INDIRECT(CONCATENATE($A$13,\"!\",\"s\",$B16,\":\",\"Ah\",$B16))),0))","v":""},{"$f":"IF(H16=\"\",\"\",ROUND(SUM(INDIRECT(CONCATENATE($A$13,\"!\",\"ai\",$B16))),0))","v":""},{"$f":"IF(I16=\"\",\"\",ROUND(SUM(INDIRECT(CONCATENATE($A$13,\"!\",\"aj\",$B16))),0))","v":""},{"$f":"IF(H16=\"\",\"\",ROUND(SUM(INDIRECT(CONCATENATE($A$13,\"!\",\"Ao\",$B16))),0))","v":""}]
[null,"",null,null,"","","","","","","","","","","","","","","","",""]
[null,"",null,null,"","","","","","","","","","","","","","","","",""]
[null,"",null,null,"","","","","","","","","","","","","","","","",""]
[null,"",null,null,"","","","","","","","","","","","","","","","",""]
[null,"",null,null,"","","","","","","","","","","","","","","","",""]
[null,"",null,null,"","",{"$f":"IF(A22=\"\",\"\",INDIRECT(CONCATENATE($A$13,\"!\",\"B\",B22)))","v":""},{"$f":"IF(E22=\"\",\"\",ROUND(SUM(INDIRECT(CONCATENATE($A$13,\"!\",\"D\",$B22))),0))","v":""},{"$f":"IF(F22=\"\",\"\",ROUND(SUM(INDIRECT(CONCATENATE($A$13,\"!\",\"E\",$B22))),0))","v":""},{"$f":"IF(F22=\"\",\"\",ROUND(SUM(INDIRECT(CONCATENATE($A$13,\"!\",\"F\",$B22))),0))","v":""},{"$f":"IF(E22=\"\",\"\",ROUND(SUM(INDIRECT(CONCATENATE($A$13,\"!\",\"G\",$B22,\":\",\"I\",$B22))),0))","v":""},{"$f":"IF(E22=\"\",\"\",ROUND(SUM(INDIRECT(CONCATENATE($A$13,\"!\",\"J\",$B22,\":\",\"L\",$B22))),0))","v":""},{"$f":"IF(G22=\"\",\"\",ROUND(AVERAGE(INDIRECT(CONCATENATE($A$13,\"!\",\"M\",$B22))),2))","v":""},{"$f":"IF(H22=\"\",\"\",ROUND(SUM(INDIRECT(CONCATENATE($A$13,\"!\",\"N\",$B22))),0))","v":""},{"$f":"IF(F22=\"\",\"\",ROUND(SUM(INDIRECT(CONCATENATE($A$13,\"!\",\"P\",$B22))),0))","v":""},{"$f":"IF(F22=\"\",\"\",ROUND(SUM(INDIRECT(CONCATENATE($A$13,\"!\",\"Q\",$B22))),0))","v":""},{"$f":"IF(G22=\"\",\"\",ROUND(SUM(INDIRECT(CONCATENATE($A$13,\"!\",\"r\",$B22))),0))","v":""},{"$f":"IF(F22=\"\",\"\",ROUND(SUM(INDIRECT(CONCATENATE($A$13,\"!\",\"s\",$B22,\":\",\"Ah\",$B22))),0))","v":""},{"$f":"IF(H22=\"\",\"\",ROUND(SUM(INDIRECT(CONCATENATE($A$13,\"!\",\"ai\",$B22))),0))","v":""},{"$f":"IF(I22=\"\",\"\",ROUND(SUM(INDIRECT(CONCATENATE($A$13,\"!\",\"aj\",$B22))),0))","v":""},{"$f":"IF(H22=\"\",\"\",ROUND(SUM(INDIRECT(CONCATENATE($A$13,\"!\",\"Ao\",$B22))),0))","v":""}]
[null,"",null,null,"","","","","","","","","","","","","","","","",""]
[null,"",null,null,"","","","","","","","","","","","","","","","",""]
[null,"",null,null,"","","","","","","","","","","","","","","","",""]
[null,"",null,null,"","","","","","","","","","","","","","","","",""]
[null,"",null,null,"","","","","","","","","","","","","","","","",""]
[null,null,null,null,null,null,null,"","","","","","","","","","","","","",""]
["Grading_secondary",{"$f":"IF(A30=\"\",\"\",+A30)","v":""},null,null,"Secondary Alignment"]
[null,"",null,null,{"$f":"IF(A30=\"\",\"\",INDIRECT(CONCATENATE($A$29,\"!\",\"B\",A30)))","v":""},"",{"$f":"IF(A30=\"\",\"\",INDIRECT(CONCATENATE($A$29,\"!\",\"B\",B30)))","v":""},{"$f":"IF(E30=\"\",\"\",ROUND(SUM(INDIRECT(CONCATENATE($A$29,\"!\",\"D\",$B30))),0))","v":""},{"$f":"IF(F30=\"\",\"\",ROUND(SUM(INDIRECT(CONCATENATE($A$29,\"!\",\"E\",$B30))),0))","v":""},{"$f":"IF(F30=\"\",\"\",ROUND(SUM(INDIRECT(CONCATENATE($A$29,\"!\",\"F\",$B30))),0))","v":""},{"$f":"IF(E30=\"\",\"\",ROUND(SUM(INDIRECT(CONCATENATE($A$29,\"!\",\"G\",$B30,\":\",\"I\",$B30))),0))","v":""},{"$f":"IF(E30=\"\",\"\",ROUND(SUM(INDIRECT(CONCATENATE($A$29,\"!\",\"J\",$B30,\":\",\"L\",$B30))),0))","v":""},{"$f":"IF(G30=\"\",\"\",ROUND(AVERAGE(INDIRECT(CONCATENATE($A$29,\"!\",\"m\",$B30))),2))","v":""},{"$f":"IF(H30=\"\",\"\",ROUND(SUM(INDIRECT(CONCATENATE($A$29,\"!\",\"n\",$B30))),0))","v":""},{"$f":"IF(F30=\"\",\"\",ROUND(SUM(INDIRECT(CONCATENATE($A$29,\"!\",\"P\",$B30))),0))","v":""},{"$f":"IF(F30=\"\",\"\",ROUND(SUM(INDIRECT(CONCATENATE($A$29,\"!\",\"Q\",$B30))),0))","v":""},{"$f":"IF(G30=\"\",\"\",ROUND(SUM(INDIRECT(CONCATENATE($A$29,\"!\",\"R\",$B30))),0))","v":""},{"$f":"IF(F30=\"\",\"\",ROUND(SUM(INDIRECT(CONCATENATE($A$29,\"!\",\"S\",$B30,\":\",\"ah\",$B30))),0))","v":""},{"$f":"IF(H30=\"\",\"\",ROUND(SUM(INDIRECT(CONCATENATE($A$29,\"!\",\"ai\",$B30))),0))","v":""},{"$f":"IF(I30=\"\",\"\",ROUND(SUM(INDIRECT(CONCATENATE($A$29,\"!\",\"aj\",$B30))),0))","v":""},{"$f":"IF(H30=\"\",\"\",ROUND(SUM(INDIRECT(CONCATENATE($A$29,\"!\",\"Ao\",$B30))),0))","v":""}]
[null,"",null,null,{"$f":"IF(A31=\"\",\"\",INDIRECT(CONCATENATE($A$29,\"!\",\"B\",A31)))","v":""},{"$f":"IF(E31=\"\",\"\",\"-\")","v":""},{"$f":"IF(A31=\"\",\"\",INDIRECT(CONCATENATE($A$29,\"!\",\"B\",B31)))","v":""},{"$f":"IF(E31=\"\",\"\",ROUND(SUM(INDIRECT(CONCATENATE($A$29,\"!\",\"D\",$B31))),0))","v":""},{"$f":"IF(F31=\"\",\"\",ROUND(SUM(INDIRECT(CONCATENATE($A$29,\"!\",\"E\",$B31))),0))","v":""},{"$f":"IF(F31=\"\",\"\",ROUND(SUM(INDIRECT(CONCATENATE($A$29,\"!\",\"F\",$B31))),0))","v":""},{"$f":"IF(E31=\"\",\"\",ROUND(SUM(INDIRECT(CONCATENATE($A$29,\"!\",\"G\",$B31,\":\",\"I\",$B31))),0))","v":""},{"$f":"IF(E31=\"\",\"\",ROUND(SUM(INDIRECT(CONCATENATE($A$29,\"!\",\"J\",$B31,\":\",\"L\",$B31))),0))","v":""},{"$f":"IF(G31=\"\",\"\",ROUND(AVERAGE(INDIRECT(CONCATENATE($A$29,\"!\",\"m\",$B31))),2))","v":""},{"$f":"IF(H31=\"\",\"\",ROUND(SUM(INDIRECT(CONCATENATE($A$29,\"!\",\"n\",$B31))),0))","v":""},{"$f":"IF(F31=\"\",\"\",ROUND(SUM(INDIRECT(CONCATENATE($A$29,\"!\",\"P\",$B31))),0))","v":""},{"$f":"IF(F31=\"\",\"\",ROUND(SUM(INDIRECT(CONCATENATE($A$29,\"!\",\"Q\",$B31))),0))","v":""},{"$f":"IF(G31=\"\",\"\",ROUND(SUM(INDIRECT(CONCATENATE($A$29,\"!\",\"R\",$B31))),0))","v":""},{"$f":"IF(F31=\"\",\"\",ROUND(SUM(INDIRECT(CONCATENATE($A$29,\"!\",\"S\",$B31,\":\",\"ah\",$B31))),0))","v":""},{"$f":"IF(H31=\"\",\"\",ROUND(SUM(INDIRECT(CONCATENATE($A$29,\"!\",\"ai\",$B31))),0))","v":""},{"$f":"IF(I31=\"\",\"\",ROUND(SUM(INDIRECT(CONCATENATE($A$29,\"!\",\"aj\",$B31))),0))","v":""},{"$f":"IF(H31=\"\",\"\",ROUND(SUM(INDIRECT(CONCATENATE($A$29,\"!\",\"Ao\",$B31))),0))","v":""}]
[null,"",null,null,"","","","","","","","","","","","","","","","",""]
[null,"",null,null,"","","","","","","","","","","","","","","","",""]
[null,"",null,null,"","","","","","","","","","","","","","","","",""]
[null,"",null,null,"","","","","","","","","","","","","","","","",""]
[null,"",null,null,"","","","","","","","","","","","","","","","",""]
[null,""]
[null,null,null,null,"TOTALS",null,null,{"$f":"SUM(H14:H37)","v":0},0,0,0,0,null,0,0,0,0,0,0,0,0]
[]
[null,null,null,null,"NOTE:"]
[null,null,null,null,null,1,"Quantities based on prismoidal (surface to surface) volumes."]
[null,null,null,null,null,2,"Conserve <<XXX>> inches of topsoil in cut and fill slope areas.  "]
[null,null,null,null,null,3,"Available material includes <<INSERT PROJECT SPECIFIC INFORMATION-See Notes to Designer Note 1>>."]
[null,null,null,null,null,4,"Unavailable material includes <<INSERT PROJECT SPECIFIC INFORMATION-See Notes to Designer Note 2>>."]
[null,null,null,null,null,5,"The average shrink/swell factor shown is computed by taking an average of recommended values over the specified range. Refer to the Geotech Report for recommended shrink/swell factors."]
[null,null,null,null,null,6,"Backfill includes <<INSERT PROJECT SPECIFIC INFORMATION-See Notes to Designer Note 3>>."]
[null,null,null,null,null,7,"Unclassified borrow quantity calculated using volumes adjusted using shrink/swell. An assumed value of 0.9 was used for borrow material calculations. The contractor is responsible for determining the actual shrink/swell on the borrow material."]
[null,null,null,null,null,8,"The quantities shown herein are approximations.  Payment will be made for the actual quantities of work performed."]
[null,null,null,null,null,9,"BCY = Bank cubic yard - one cubic yard of material as it lies in the natural state.\nCCY = Compacted cubic yard - one cubic yard of material after it has been compacted to specification density."]
[]
[]
[null,null,null,null,"NOTES TO DESIGNER:"]
[null,null,null,null,1,"Available material is anything in the grading tab in columns G, H and I"]
[null,null,null,null,2,"Unavailable material is anything in the grading tab in columns J, K and L"]
[null,null,null,null,3,"Backfill is anything in the grading tab in columns S, T, U, V, W, X, Y, Z, AA, AB, AC, AD, AE, AF, AG and AH"]
[null,null,null,null,4,"Be sure to change all text to black before printing."]

{"sheet":"Conserved Topsoil Summary","index":12,"n_rows":54,"n_cols":19,"rows_kept":54,"cut":false,"hidden":false,"merged":[[11,0,11,1],[12,0,12,1],[28,4,28,6],[37,4,37,6],[7,8,11,8],[7,7,11,7],[1,0,10,0],[1,1,10,1],[5,4,5,13],[6,4,6,6],[7,4,12,6],[3,7,4,8],[6,7,6,8],[3,9,4,12],[58,6,58,8],[53,6,53,8],[52,6,52,13],[40,6,40,8],[41,6,41,8],[45,6,45,8],[55,6,55,8],[56,6,56,13],[46,6,46,8],[47,6,47,8],[57,6,57,8],[53,15,53,24],[54,6,54,8],[54,15,54,24],[7,13,11,13],[6,15,8,19],[13,16,13,17],[7,9,11,9],[7,12,11,12],[7,10,11,10],[7,11,11,11],[10,15,12,19]]}
[]
["<---Type Beginning Row Number","<---Automatic calculates except for last row",null,null,"NOTE TO DESIGNER:  Adjust the Notes below the Grading Summary to fit your project."]
[]
[null,null,null,null,null,null,null,"TOTAL Topsoil Being Conserved",null,"Hide Columns before Printing"]
[null,null,null,null,null,null,null,null,null,null,null,null,null,null,null,null,null,43560,"sqft/acre"]
[null,null,null,null,"CONSERVED TOPSOIL SUMMARY"]
[null,null,null,null,null,null,null,"For info only",null,null,null,null,null,"62406-0300",null,"To use the component quantites for this table run a Named Boundary Report, Export to Excel and Paste in the Named Boundary Report Tab"]
[null,null,null,null,"Station to Station",null,null,"Topsoil conserved in cuts","Topsoil conserved in fills","Turf Establishment: ","Fill: ","Cut: ","Total Area","PLACING CONSERVED TOPSOIL, 4-INCH DEPTH"]
[]
[]
[null,null,null,null,null,null,null,null,null,null,null,null,null,null,null,"Note:  Delete all the Cut: and Fill: lines that have a length associated with them.  These will cause the next line to not populate."]
["Rows from"]
["Grading",null,null,null,null,null,null,"BCY","BCY","SQFT","SQFT","SQFT","ACRE","ACRE"]
[null,{"$f":"IF(A15=\"\",\"\",+A15)","v":""},null,null,{"$f":"IF(B14=\"\",\"\",INDIRECT(CONCATENATE($A$13,\"!\",\"B\",A14)))","v":""},{"$f":"IF(E14=\"\",\"\",\"-\")","v":""},{"$f":"IF(A14=\"\",\"\",INDIRECT(CONCATENATE($A$13,\"!\",\"B\",B14)))","v":""},{"$f":"IF(E14=\"\",\"\",ROUND(SUM(INDIRECT(CONCATENATE($A$13,\"!\",\"K\",$B14,\":\",\"K\",$B14))),0))","v":""},{"$f":"IF(F14=\"\",\"\",ROUND(SUM(INDIRECT(CONCATENATE($A$13,\"!\",\"AB\",$B14,\":\",\"AB\",$B14))),0))","v":""},{"$f":"IF(E14=\"\",\"\",IFERROR(INDEX('Named Boundary Report'!$F$2:$F$10003,SMALL(IF('Named Boundary Report'!$A$2:$A$10003=J$8,ROW('Named Boundary Report'!$A$2:$A$10003)-1,\"\"),ROWS($E$15:$E15))),\"0\"))","v":""},{"$f":"IF(E14=\"\",\"\",IFERROR(INDEX('Named Boundary Report'!$F$2:$F$10003,SMALL(IF('Named Boundary Report'!$A$2:$A$10003=K$8,ROW('Named Boundary Report'!$A$2:$A$10003)-1,\"\"),ROWS($E$15:$E15))),\"0\"))","v":""},{"$f":"IF(E14=\"\",\"\",IFERROR(INDEX('Named Boundary Report'!$F$2:$F$10003,SMALL(IF('Named Boundary Report'!$A$2:$A$10003=L$8,ROW('Named Boundary Report'!$A$2:$A$10003)-1,\"\"),ROWS($E$15:$E15))),\"0\"))","v":""},{"$f":"IF($F14=\"\", \" \",((J14+K14+L14)/$R$5))","v":" "},{"$f":"IF(M14=\"\", \" \", M14)","v":" "}]
[null,{"$f":"IF(A16=\"\",\"\",+A16)","v":""},null,null,{"$f":"IF(A15=\"\",\"\",INDIRECT(CONCATENATE($A$13,\"!\",\"B\",A15)))","v":""},"",{"$f":"IF(A15=\"\",\"\",INDIRECT(CONCATENATE($A$13,\"!\",\"B\",B15)))","v":""},{"$f":"IF(E15=\"\",\"\",ROUND(SUM(INDIRECT(CONCATENATE($A$13,\"!\",\"K\",$B15,\":\",\"K\",$B15))),0))","v":""},{"$f":"IF(F15=\"\",\"\",ROUND(SUM(INDIRECT(CONCATENATE($A$13,\"!\",\"AB\",$B15,\":\",\"AB\",$B15))),0))","v":""},{"$f":"IF(E15=\"\",\"\",IFERROR(INDEX('Named Boundary Report'!$F$2:$F$10003,SMALL(IF('Named Boundary Report'!$A$2:$A$10003=J$8,ROW('Named Boundary Report'!$A$2:$A$10003)-1,\"\"),ROWS($E$15:$E16))),\"0\"))","v":""},{"$f":"IF(E15=\"\",\"\",IFERROR(INDEX('Named Boundary Report'!$F$2:$F$10003,SMALL(IF('Named Boundary Report'!$A$2:$A$10003=K$8,ROW('Named Boundary Report'!$A$2:$A$10003)-1,\"\"),ROWS($E$15:$E16))),\"0\"))","v":""},{"$f":"IF(E15=\"\",\"\",IFERROR(INDEX('Named Boundary Report'!$F$2:$F$10003,SMALL(IF('Named Boundary Report'!$A$2:$A$10003=L$8,ROW('Named Boundary Report'!$A$2:$A$10003)-1,\"\"),ROWS($E$15:$E16))),\"0\"))","v":""},{"$f":"IF($F15=\"\", \" \",((J15+K15+L15)/$R$5))","v":" "},{"$f":"IF(M15=\"\", \" \", M15)","v":" "}]
[null,"",null,null,{"$f":"IF(A16=\"\",\"\",INDIRECT(CONCATENATE($A$13,\"!\",\"B\",A16)))","v":""},{"$f":"IF(E16=\"\",\"\",\"-\")","v":""},{"$f":"IF(A16=\"\",\"\",INDIRECT(CONCATENATE($A$13,\"!\",\"B\",B16)))","v":""},{"$f":"IF(E16=\"\",\"\",ROUND(SUM(INDIRECT(CONCATENATE($A$13,\"!\",\"K\",$B16,\":\",\"K\",$B16))),0))","v":""},{"$f":"IF(F16=\"\",\"\",ROUND(SUM(INDIRECT(CONCATENATE($A$13,\"!\",\"AB\",$B16,\":\",\"AB\",$B16))),0))","v":""},{"$f":"IF(E16=\"\",\"\",IFERROR(INDEX('Named Boundary Report'!$F$2:$F$10003,SMALL(IF('Named Boundary Report'!$A$2:$A$10003=J$8,ROW('Named Boundary Report'!$A$2:$A$10003)-1,\"\"),ROWS($E$15:$E17))),\"0\"))","v":""},{"$f":"IF(E16=\"\",\"\",IFERROR(INDEX('Named Boundary Report'!$F$2:$F$10003,SMALL(IF('Named Boundary Report'!$A$2:$A$10003=K$8,ROW('Named Boundary Report'!$A$2:$A$10003)-1,\"\"),ROWS($E$15:$E17))),\"0\"))","v":""},{"$f":"IF(E16=\"\",\"\",IFERROR(INDEX('Named Boundary Report'!$F$2:$F$10003,SMALL(IF('Named Boundary Report'!$A$2:$A$10003=L$8,ROW('Named Boundary Report'!$A$2:$A$10003)-1,\"\"),ROWS($E$15:$E17))),\"0\"))","v":""}," "," "]
[null,"",null,null,"","","","","",{"$f":"IF(E17=\"\",\"\",IFERROR(INDEX('Named Boundary Report'!$F$2:$F$10003,SMALL(IF('Named Boundary Report'!$A$2:$A$10003=J$8,ROW('Named Boundary Report'!$A$2:$A$10003)-1,\"\"),ROWS($E$15:$E18))),\"0\"))","v":""},{"$f":"IF(E17=\"\",\"\",IFERROR(INDEX('Named Boundary Report'!$F$2:$F$10003,SMALL(IF('Named Boundary Report'!$A$2:$A$10003=K$8,ROW('Named Boundary Report'!$A$2:$A$10003)-1,\"\"),ROWS($E$15:$E18))),\"0\"))","v":""},{"$f":"IF(E17=\"\",\"\",IFERROR(INDEX('Named Boundary Report'!$F$2:$F$10003,SMALL(IF('Named Boundary Report'!$A$2:$A$10003=L$8,ROW('Named Boundary Report'!$A$2:$A$10003)-1,\"\"),ROWS($E$15:$E18))),\"0\"))","v":""}," "," "]
[null,"",null,null,"","","","","",{"$f":"IF(E18=\"\",\"\",IFERROR(INDEX('Named Boundary Report'!$F$2:$F$10003,SMALL(IF('Named Boundary Report'!$A$2:$A$10003=J$8,ROW('Named Boundary Report'!$A$2:$A$10003)-1,\"\"),ROWS($E$15:$E19))),\"0\"))","v":""},{"$f":"IF(E18=\"\",\"\",IFERROR(INDEX('Named Boundary Report'!$F$2:$F$10003,SMALL(IF('Named Boundary Report'!$A$2:$A$10003=K$8,ROW('Named Boundary Report'!$A$2:$A$10003)-1,\"\"),ROWS($E$15:$E19))),\"0\"))","v":""},{"$f":"IF(E18=\"\",\"\",IFERROR(INDEX('Named Boundary Report'!$F$2:$F$10003,SMALL(IF('Named Boundary Report'!$A$2:$A$10003=L$8,ROW('Named Boundary Report'!$A$2:$A$10003)-1,\"\"),ROWS($E$15:$E19))),\"0\"))","v":""}," "," "]
[null,{"$f":"IF(A20=\"\",\"\",+A20)","v":""},null,null,"","","","","",{"$f":"IF(E19=\"\",\"\",IFERROR(INDEX('Named Boundary Report'!$F$2:$F$10003,SMALL(IF('Named Boundary Report'!$A$2:$A$10003=J$8,ROW('Named Boundary Report'!$A$2:$A$10003)-1,\"\"),ROWS($E$15:$E20))),\"0\"))","v":""},{"$f":"IF(E19=\"\",\"\",IFERROR(INDEX('Named Boundary Report'!$F$2:$F$10003,SMALL(IF('Named Boundary Report'!$A$2:$A$10003=K$8,ROW('Named Boundary Report'!$A$2:$A$10003)-1,\"\"),ROWS($E$15:$E20))),\"0\"))","v":""},{"$f":"IF(E19=\"\",\"\",IFERROR(INDEX('Named Boundary Report'!$F$2:$F$10003,SMALL(IF('Named Boundary Report'!$A$2:$A$10003=L$8,ROW('Named Boundary Report'!$A$2:$A$10003)-1,\"\"),ROWS($E$15:$E20))),\"0\"))","v":""}," "," "]
[null,"",null,null,"","","","","",{"$f":"IF(E20=\"\",\"\",IFERROR(INDEX('Named Boundary Report'!$F$2:$F$10003,SMALL(IF('Named Boundary Report'!$A$2:$A$10003=J$8,ROW('Named Boundary Report'!$A$2:$A$10003)-1,\"\"),ROWS($E$15:$E21))),\"0\"))","v":""},{"$f":"IF(E20=\"\",\"\",IFERROR(INDEX('Named Boundary Report'!$F$2:$F$10003,SMALL(IF('Named Boundary Report'!$A$2:$A$10003=K$8,ROW('Named Boundary Report'!$A$2:$A$10003)-1,\"\"),ROWS($E$15:$E21))),\"0\"))","v":""},{"$f":"IF(E20=\"\",\"\",IFERROR(INDEX('Named Boundary Report'!$F$2:$F$10003,SMALL(IF('Named Boundary Report'!$A$2:$A$10003=L$8,ROW('Named Boundary Report'!$A$2:$A$10003)-1,\"\"),ROWS($E$15:$E21))),\"0\"))","v":""}," "," "]
[null,"",null,null,"","","","","",{"$f":"IF(E21=\"\",\"\",IFERROR(INDEX('Named Boundary Report'!$F$2:$F$10003,SMALL(IF('Named Boundary Report'!$A$2:$A$10003=J$8,ROW('Named Boundary Report'!$A$2:$A$10003)-1,\"\"),ROWS($E$15:$E22))),\"0\"))","v":""},{"$f":"IF(E21=\"\",\"\",IFERROR(INDEX('Named Boundary Report'!$F$2:$F$10003,SMALL(IF('Named Boundary Report'!$A$2:$A$10003=K$8,ROW('Named Boundary Report'!$A$2:$A$10003)-1,\"\"),ROWS($E$15:$E22))),\"0\"))","v":""},{"$f":"IF(E21=\"\",\"\",IFERROR(INDEX('Named Boundary Report'!$F$2:$F$10003,SMALL(IF('Named Boundary Report'!$A$2:$A$10003=L$8,ROW('Named Boundary Report'!$A$2:$A$10003)-1,\"\"),ROWS($E$15:$E22))),\"0\"))","v":""}," "," "]
[null,"",null,null,"","","","","",{"$f":"IF(E22=\"\",\"\",IFERROR(INDEX('Named Boundary Report'!$F$2:$F$10003,SMALL(IF('Named Boundary Report'!$A$2:$A$10003=J$8,ROW('Named Boundary Report'!$A$2:$A$10003)-1,\"\"),ROWS($E$15:$E23))),\"0\"))","v":""},{"$f":"IF(E22=\"\",\"\",IFERROR(INDEX('Named Boundary Report'!$F$2:$F$10003,SMALL(IF('Named Boundary Report'!$A$2:$A$10003=K$8,ROW('Named Boundary Report'!$A$2:$A$10003)-1,\"\"),ROWS($E$15:$E23))),\"0\"))","v":""},{"$f":"IF(E22=\"\",\"\",IFERROR(INDEX('Named Boundary Report'!$F$2:$F$10003,SMALL(IF('Named Boundary Report'!$A$2:$A$10003=L$8,ROW('Named Boundary Report'!$A$2:$A$10003)-1,\"\"),ROWS($E$15:$E23))),\"0\"))","v":""}," "," "]
[null,"",null,null,"","","","","",{"$f":"IF(E23=\"\",\"\",IFERROR(INDEX('Named Boundary Report'!$F$2:$F$10003,SMALL(IF('Named Boundary Report'!$A$2:$A$10003=J$8,ROW('Named Boundary Report'!$A$2:$A$10003)-1,\"\"),ROWS($E$15:$E24))),\"0\"))","v":""},{"$f":"IF(E23=\"\",\"\",IFERROR(INDEX('Named Boundary Report'!$F$2:$F$10003,SMALL(IF('Named Boundary Report'!$A$2:$A$10003=K$8,ROW('Named Boundary Report'!$A$2:$A$10003)-1,\"\"),ROWS($E$15:$E24))),\"0\"))","v":""},{"$f":"IF(E23=\"\",\"\",IFERROR(INDEX('Named Boundary Report'!$F$2:$F$10003,SMALL(IF('Named Boundary Report'!$A$2:$A$10003=L$8,ROW('Named Boundary Report'!$A$2:$A$10003)-1,\"\"),ROWS($E$15:$E24))),\"0\"))","v":""}," "," "]
[null,"",null,null,"","","","","",{"$f":"IF(E24=\"\",\"\",IFERROR(INDEX('Named Boundary Report'!$F$2:$F$10003,SMALL(IF('Named Boundary Report'!$A$2:$A$10003=J$8,ROW('Named Boundary Report'!$A$2:$A$10003)-1,\"\"),ROWS($E$15:$E25))),\"0\"))","v":""},{"$f":"IF(E24=\"\",\"\",IFERROR(INDEX('Named Boundary Report'!$F$2:$F$10003,SMALL(IF('Named Boundary Report'!$A$2:$A$10003=K$8,ROW('Named Boundary Report'!$A$2:$A$10003)-1,\"\"),ROWS($E$15:$E25))),\"0\"))","v":""},{"$f":"IF(E24=\"\",\"\",IFERROR(INDEX('Named Boundary Report'!$F$2:$F$10003,SMALL(IF('Named Boundary Report'!$A$2:$A$10003=L$8,ROW('Named Boundary Report'!$A$2:$A$10003)-1,\"\"),ROWS($E$15:$E25))),\"0\"))","v":""}," "," "]
[null,"",null,null,"","","","","",{"$f":"IF(E25=\"\",\"\",IFERROR(INDEX('Named Boundary Report'!$F$2:$F$10003,SMALL(IF('Named Boundary Report'!$A$2:$A$10003=J$8,ROW('Named Boundary Report'!$A$2:$A$10003)-1,\"\"),ROWS($E$15:$E26))),\"0\"))","v":""},{"$f":"IF(E25=\"\",\"\",IFERROR(INDEX('Named Boundary Report'!$F$2:$F$10003,SMALL(IF('Named Boundary Report'!$A$2:$A$10003=K$8,ROW('Named Boundary Report'!$A$2:$A$10003)-1,\"\"),ROWS($E$15:$E26))),\"0\"))","v":""},{"$f":"IF(E25=\"\",\"\",IFERROR(INDEX('Named Boundary Report'!$F$2:$F$10003,SMALL(IF('Named Boundary Report'!$A$2:$A$10003=L$8,ROW('Named Boundary Report'!$A$2:$A$10003)-1,\"\"),ROWS($E$15:$E26))),\"0\"))","v":""}," "," "]
[null,"",null,null,"","","","","",{"$f":"IF(E26=\"\",\"\",IFERROR(INDEX('Named Boundary Report'!$F$2:$F$10003,SMALL(IF('Named Boundary Report'!$A$2:$A$10003=J$8,ROW('Named Boundary Report'!$A$2:$A$10003)-1,\"\"),ROWS($E$15:$E27))),\"0\"))","v":""},{"$f":"IF(E26=\"\",\"\",IFERROR(INDEX('Named Boundary Report'!$F$2:$F$10003,SMALL(IF('Named Boundary Report'!$A$2:$A$10003=K$8,ROW('Named Boundary Report'!$A$2:$A$10003)-1,\"\"),ROWS($E$15:$E27))),\"0\"))","v":""},{"$f":"IF(E26=\"\",\"\",IFERROR(INDEX('Named Boundary Report'!$F$2:$F$10003,SMALL(IF('Named Boundary Report'!$A$2:$A$10003=L$8,ROW('Named Boundary Report'!$A$2:$A$10003)-1,\"\"),ROWS($E$15:$E27))),\"0\"))","v":""}," "," "]
[null,"",null,null,"","","","","",{"$f":"IF(E27=\"\",\"\",IFERROR(INDEX('Named Boundary Report'!$F$2:$F$10003,SMALL(IF('Named Boundary Report'!$A$2:$A$10003=J$8,ROW('Named Boundary Report'!$A$2:$A$10003)-1,\"\"),ROWS($E$15:$E28))),\"0\"))","v":""},{"$f":"IF(E27=\"\",\"\",IFERROR(INDEX('Named Boundary Report'!$F$2:$F$10003,SMALL(IF('Named Boundary Report'!$A$2:$A$10003=K$8,ROW('Named Boundary Report'!$A$2:$A$10003)-1,\"\"),ROWS($E$15:$E28))),\"0\"))","v":""},{"$f":"IF(E27=\"\",\"\",IFERROR(INDEX('Named Boundary Report'!$F$2:$F$10003,SMALL(IF('Named Boundary Report'!$A$2:$A$10003=L$8,ROW('Named Boundary Report'!$A$2:$A$10003)-1,\"\"),ROWS($E$15:$E28))),\"0\"))","v":""}," "," "]
[null,null,null,null,null,null,null,"","",{"$f":"IF(E28=\"\",\"\",IFERROR(INDEX('Named Boundary Report'!$F$2:$F$10003,SMALL(IF('Named Boundary Report'!$A$2:$A$10003=J$8,ROW('Named Boundary Report'!$A$2:$A$10003)-1,\"\"),ROWS($E$15:$E29))),\"0\"))","v":""},{"$f":"IF(E28=\"\",\"\",IFERROR(INDEX('Named Boundary Report'!$F$2:$F$10003,SMALL(IF('Named Boundary Report'!$A$2:$A$10003=K$8,ROW('Named Boundary Report'!$A$2:$A$10003)-1,\"\"),ROWS($E$15:$E29))),\"0\"))","v":""},{"$f":"IF(E28=\"\",\"\",IFERROR(INDEX('Named Boundary Report'!$F$2:$F$10003,SMALL(IF('Named Boundary Report'!$A$2:$A$10003=L$8,ROW('Named Boundary Report'!$A$2:$A$10003)-1,\"\"),ROWS($E$15:$E29))),\"0\"))","v":""}," "," "]
["Grading_secondary",{"$f":"IF(A30=\"\",\"\",+A30)","v":""},null,null,null,null,null,null,null,{"$f":"IF(E29=\"\",\"\",IFERROR(INDEX('Named Boundary Report'!$F$2:$F$10003,SMALL(IF('Named Boundary Report'!$A$2:$A$10003=J$8,ROW('Named Boundary Report'!$A$2:$A$10003)-1,\"\"),ROWS($E$15:$E30))),\"0\"))","v":""},{"$f":"IF(E29=\"\",\"\",IFERROR(INDEX('Named Boundary Report'!$F$2:$F$10003,SMALL(IF('Named Boundary Report'!$A$2:$A$10003=K$8,ROW('Named Boundary Report'!$A$2:$A$10003)-1,\"\"),ROWS($E$15:$E30))),\"0\"))","v":""},{"$f":"IF(E29=\"\",\"\",IFERROR(INDEX('Named Boundary Report'!$F$2:$F$10003,SMALL(IF('Named Boundary Report'!$A$2:$A$10003=L$8,ROW('Named Boundary Report'!$A$2:$A$10003)-1,\"\"),ROWS($E$15:$E30))),\"0\"))","v":""}," "]
[null,"",null,null,{"$f":"IF(A30=\"\",\"\",INDIRECT(CONCATENATE($A$29,\"!\",\"B\",A30)))","v":""},"",{"$f":"IF(A30=\"\",\"\",INDIRECT(CONCATENATE($A$29,\"!\",\"B\",B30)))","v":""},{"$f":"IF(E30=\"\",\"\",ROUND(SUM(INDIRECT(CONCATENATE($A$29,\"!\",\"K\",$B30,\":\",\"K\",$B30))),0))","v":""},{"$f":"IF(F30=\"\",\"\",ROUND(SUM(INDIRECT(CONCATENATE($A$29,\"!\",\"AB\",$B30,\":\",\"AB\",$B30))),0))","v":""},{"$f":"IF(E30=\"\",\"\",IFERROR(INDEX('Named Boundary Report'!$F$2:$F$10003,SMALL(IF('Named Boundary Report'!$A$2:$A$10003=J$8,ROW('Named Boundary Report'!$A$2:$A$10003)-1,\"\"),ROWS($E$15:$E31))),\"0\"))","v":""},{"$f":"IF(E30=\"\",\"\",IFERROR(INDEX('Named Boundary Report'!$F$2:$F$10003,SMALL(IF('Named Boundary Report'!$A$2:$A$10003=K$8,ROW('Named Boundary Report'!$A$2:$A$10003)-1,\"\"),ROWS($E$15:$E31))),\"0\"))","v":""},{"$f":"IF(E30=\"\",\"\",IFERROR(INDEX('Named Boundary Report'!$F$2:$F$10003,SMALL(IF('Named Boundary Report'!$A$2:$A$10003=L$8,ROW('Named Boundary Report'!$A$2:$A$10003)-1,\"\"),ROWS($E$15:$E31))),\"0\"))","v":""}," "," "]
[null,"",null,null,{"$f":"IF(A31=\"\",\"\",INDIRECT(CONCATENATE($A$29,\"!\",\"B\",A31)))","v":""},"",{"$f":"IF(A31=\"\",\"\",INDIRECT(CONCATENATE($A$29,\"!\",\"B\",B31)))","v":""},{"$f":"IF(E31=\"\",\"\",ROUND(SUM(INDIRECT(CONCATENATE($A$29,\"!\",\"i\",$B31,\":\",\"k\",$B31))),0))","v":""},{"$f":"IF(F31=\"\",\"\",ROUND(SUM(INDIRECT(CONCATENATE($A$29,\"!\",\"AB\",$B31,\":\",\"AB\",$B31))),0))","v":""},{"$f":"IF(E31=\"\",\"\",IFERROR(INDEX('Named Boundary Report'!$F$2:$F$10003,SMALL(IF('Named Boundary Report'!$A$2:$A$10003=J$8,ROW('Named Boundary Report'!$A$2:$A$10003)-1,\"\"),ROWS($E$15:$E32))),\"0\"))","v":""},{"$f":"IF(E31=\"\",\"\",IFERROR(INDEX('Named Boundary Report'!$F$2:$F$10003,SMALL(IF('Named Boundary Report'!$A$2:$A$10003=K$8,ROW('Named Boundary Report'!$A$2:$A$10003)-1,\"\"),ROWS($E$15:$E32))),\"0\"))","v":""},{"$f":"IF(E31=\"\",\"\",IFERROR(INDEX('Named Boundary Report'!$F$2:$F$10003,SMALL(IF('Named Boundary Report'!$A$2:$A$10003=L$8,ROW('Named Boundary Report'!$A$2:$A$10003)-1,\"\"),ROWS($E$15:$E32))),\"0\"))","v":""}," "," "]
[null,"",null,null,"","","","","",{"$f":"IF(E32=\"\",\"\",IFERROR(INDEX('Named Boundary Report'!$F$2:$F$10003,SMALL(IF('Named Boundary Report'!$A$2:$A$10003=J$8,ROW('Named Boundary Report'!$A$2:$A$10003)-1,\"\"),ROWS($E$15:$E33))),\"0\"))","v":""},{"$f":"IF(E32=\"\",\"\",IFERROR(INDEX('Named Boundary Report'!$F$2:$F$10003,SMALL(IF('Named Boundary Report'!$A$2:$A$10003=K$8,ROW('Named Boundary Report'!$A$2:$A$10003)-1,\"\"),ROWS($E$15:$E33))),\"0\"))","v":""},{"$f":"IF(E32=\"\",\"\",IFERROR(INDEX('Named Boundary Report'!$F$2:$F$10003,SMALL(IF('Named Boundary Report'!$A$2:$A$10003=L$8,ROW('Named Boundary Report'!$A$2:$A$10003)-1,\"\"),ROWS($E$15:$E33))),\"0\"))","v":""}," "," "]
[null,"",null,null,"","","","","",{"$f":"IF(E33=\"\",\"\",IFERROR(INDEX('Named Boundary Report'!$F$2:$F$10003,SMALL(IF('Named Boundary Report'!$A$2:$A$10003=J$8,ROW('Named Boundary Report'!$A$2:$A$10003)-1,\"\"),ROWS($E$15:$E34))),\"0\"))","v":""},{"$f":"IF(E33=\"\",\"\",IFERROR(INDEX('Named Boundary Report'!$F$2:$F$10003,SMALL(IF('Named Boundary Report'!$A$2:$A$10003=K$8,ROW('Named Boundary Report'!$A$2:$A$10003)-1,\"\"),ROWS($E$15:$E34))),\"0\"))","v":""},{"$f":"IF(E33=\"\",\"\",IFERROR(INDEX('Named Boundary Report'!$F$2:$F$10003,SMALL(IF('Named Boundary Report'!$A$2:$A$10003=L$8,ROW('Named Boundary Report'!$A$2:$A$10003)-1,\"\"),ROWS($E$15:$E34))),\"0\"))","v":""}," "," "]
[null,"",null,null,"","","","","",{"$f":"IF(E34=\"\",\"\",IFERROR(INDEX('Named Boundary Report'!$F$2:$F$10003,SMALL(IF('Named Boundary Report'!$A$2:$A$10003=J$8,ROW('Named Boundary Report'!$A$2:$A$10003)-1,\"\"),ROWS($E$15:$E35))),\"0\"))","v":""},{"$f":"IF(E34=\"\",\"\",IFERROR(INDEX('Named Boundary Report'!$F$2:$F$10003,SMALL(IF('Named Boundary Report'!$A$2:$A$10003=K$8,ROW('Named Boundary Report'!$A$2:$A$10003)-1,\"\"),ROWS($E$15:$E35))),\"0\"))","v":""},{"$f":"IF(E34=\"\",\"\",IFERROR(INDEX('Named Boundary Report'!$F$2:$F$10003,SMALL(IF('Named Boundary Report'!$A$2:$A$10003=L$8,ROW('Named Boundary Report'!$A$2:$A$10003)-1,\"\"),ROWS($E$15:$E35))),\"0\"))","v":""}," "," "]
[null,"",null,null,"","","","","",{"$f":"IF(E35=\"\",\"\",IFERROR(INDEX('Named Boundary Report'!$F$2:$F$10003,SMALL(IF('Named Boundary Report'!$A$2:$A$10003=J$8,ROW('Named Boundary Report'!$A$2:$A$10003)-1,\"\"),ROWS($E$15:$E36))),\"0\"))","v":""},{"$f":"IF(E35=\"\",\"\",IFERROR(INDEX('Named Boundary Report'!$F$2:$F$10003,SMALL(IF('Named Boundary Report'!$A$2:$A$10003=K$8,ROW('Named Boundary Report'!$A$2:$A$10003)-1,\"\"),ROWS($E$15:$E36))),\"0\"))","v":""},{"$f":"IF(E35=\"\",\"\",IFERROR(INDEX('Named Boundary Report'!$F$2:$F$10003,SMALL(IF('Named Boundary Report'!$A$2:$A$10003=L$8,ROW('Named Boundary Report'!$A$2:$A$10003)-1,\"\"),ROWS($E$15:$E36))),\"0\"))","v":""}," "," "]
[null,"",null,null,"","","","","",{"$f":"IF(E36=\"\",\"\",IFERROR(INDEX('Named Boundary Report'!$F$2:$F$10003,SMALL(IF('Named Boundary Report'!$A$2:$A$10003=J$8,ROW('Named Boundary Report'!$A$2:$A$10003)-1,\"\"),ROWS($E$15:$E37))),\"0\"))","v":""},{"$f":"IF(E36=\"\",\"\",IFERROR(INDEX('Named Boundary Report'!$F$2:$F$10003,SMALL(IF('Named Boundary Report'!$A$2:$A$10003=K$8,ROW('Named Boundary Report'!$A$2:$A$10003)-1,\"\"),ROWS($E$15:$E37))),\"0\"))","v":""},{"$f":"IF(E36=\"\",\"\",IFERROR(INDEX('Named Boundary Report'!$F$2:$F$10003,SMALL(IF('Named Boundary Report'!$A$2:$A$10003=L$8,ROW('Named Boundary Report'!$A$2:$A$10003)-1,\"\"),ROWS($E$15:$E37))),\"0\"))","v":""}," "," "]
[null,""]
[null,"",null,null,"TOTALS",null,null,{"$f":"SUM(H14:H37)","v":0},0,0,0,0,0,0]
[null,"",null,null,null,null,null,null,null,null,null,null,null,null,null,null,null,{"$f":"IF(Q40=\"\",\"\",+Q40)","v":""}]
[null,{"$f":"IF(A53=\"\",\"\",+A53)","v":""}]
[]
[]
[]
[]
[]
[]
[]
[]
[]
[]
[]
[]
[null,""]
[null,""]

{"sheet":"Named Boundary Report","index":13,"n_rows":0,"n_cols":0,"rows_kept":0,"cut":false,"hidden":false,"merged":[[1,11,2,21]]}

{"sheet":"Conserved EX Pave Summary","index":14,"n_rows":54,"n_cols":9,"rows_kept":54,"cut":false,"hidden":false,"merged":[[11,0,11,1],[12,0,12,1],[28,4,28,6],[37,4,37,6],[7,8,11,8],[7,7,11,7],[1,0,10,0],[1,1,10,1],[5,4,5,8],[6,4,6,6],[7,4,12,6],[6,7,6,8],[53,10,53,19],[54,6,54,8],[54,10,54,19],[55,6,55,8],[38,4,38,8],[40,6,40,8],[41,6,41,8],[45,6,45,8],[46,6,46,8],[47,6,47,8],[56,6,56,8],[57,6,57,8],[58,6,58,8],[52,6,52,8],[53,6,53,8]]}
[]
["<---Type Beginning Row Number","<---Automatic calculates except for last row",null,null,"NOTE TO DESIGNER:  Adjust the Notes below the Grading Summary to fit your project."]
[]
[]
[]
[null,null,null,null,"CONSERVED EXISTING PAVEMENT SUMMARY"]
[null,null,null,null,null,null,null,"For info only"]
[null,null,null,null,"Station to Station",null,null,"Existing pavement conserved in cuts","Existing pavement conserved in fills"]
[]
[]
[]
["Rows from"]
["Grading",null,null,null,null,null,null,"BCY","BCY"]
[null,{"$f":"IF(A15=\"\",\"\",+A15)","v":""},null,null,{"$f":"IF(B14=\"\",\"\",INDIRECT(CONCATENATE($A$13,\"!\",\"B\",A14)))","v":""},{"$f":"IF(E14=\"\",\"\",\"-\")","v":""},{"$f":"IF(A14=\"\",\"\",INDIRECT(CONCATENATE($A$13,\"!\",\"B\",B14)))","v":""},{"$f":"IF(E14=\"\",\"\",ROUND(SUM(INDIRECT(CONCATENATE($A$13,\"!\",\"j\",$B14,\":\",\"j\",$B14))),0))","v":""},{"$f":"IF(F14=\"\",\"\",ROUND(SUM(INDIRECT(CONCATENATE($A$13,\"!\",\"aa\",$B14,\":\",\"aa\",$B14))),0))","v":""}]
[null,{"$f":"IF(A16=\"\",\"\",+A16)","v":""},null,null,{"$f":"IF(A15=\"\",\"\",INDIRECT(CONCATENATE($A$13,\"!\",\"B\",A15)))","v":""},"",{"$f":"IF(A15=\"\",\"\",INDIRECT(CONCATENATE($A$13,\"!\",\"B\",B15)))","v":""},{"$f":"IF(E15=\"\",\"\",ROUND(SUM(INDIRECT(CONCATENATE($A$13,\"!\",\"j\",$B15,\":\",\"j\",$B15))),0))","v":""},{"$f":"IF(F15=\"\",\"\",ROUND(SUM(INDIRECT(CONCATENATE($A$13,\"!\",\"aa\",$B15,\":\",\"aa\",$B15))),0))","v":""}]
[null,"",null,null,{"$f":"IF(A16=\"\",\"\",INDIRECT(CONCATENATE($A$13,\"!\",\"B\",A16)))","v":""},"",{"$f":"IF(A16=\"\",\"\",INDIRECT(CONCATENATE($A$13,\"!\",\"B\",B16)))","v":""},{"$f":"IF(E16=\"\",\"\",ROUND(SUM(INDIRECT(CONCATENATE($A$13,\"!\",\"j\",$B16,\":\",\"j\",$B16))),0))","v":""},{"$f":"IF(F16=\"\",\"\",ROUND(SUM(INDIRECT(CONCATENATE($A$13,\"!\",\"aa\",$B16,\":\",\"aa\",$B16))),0))","v":""}]
[null,"",null,null,"","","","",""]
[null,"",null,null,"","","","",""]
[null,"",null,null,"","","","",""]
[null,"",null,null,"","","","",""]
[null,"",null,null,"","","","",""]
[null,"",null,null,"","","","",""]
[null,"",null,null,"","","","",""]
[null,"",null,null,"","","","",""]
[null,"",null,null,"","","","",""]
[null,"",null,null,"","","","",""]
[null,null,null,null,"","",{"$f":"IF(A27=\"\",\"\",INDIRECT(CONCATENATE($A$13,\"!\",\"B\",B27)))","v":""},"",""]
[21]
["Grading_secondary",{"$f":"IF(A30=\"\",\"\",+A30)","v":""}]
[null,"",null,null,{"$f":"IF(A30=\"\",\"\",INDIRECT(CONCATENATE($A$29,\"!\",\"B\",A30)))","v":""},"",{"$f":"IF(A30=\"\",\"\",INDIRECT(CONCATENATE($A$29,\"!\",\"B\",B30)))","v":""},{"$f":"IF(E30=\"\",\"\",ROUND(SUM(INDIRECT(CONCATENATE($A$29,\"!\",\"j\",$B30,\":\",\"j\",$B30))),0))","v":""},{"$f":"IF(F30=\"\",\"\",ROUND(SUM(INDIRECT(CONCATENATE($A$29,\"!\",\"aa\",$B30,\":\",\"aa\",$B30))),0))","v":""}]
[null,"",null,null,{"$f":"IF(A31=\"\",\"\",INDIRECT(CONCATENATE($A$29,\"!\",\"B\",A31)))","v":""},"",{"$f":"IF(A31=\"\",\"\",INDIRECT(CONCATENATE($A$29,\"!\",\"B\",B31)))","v":""},{"$f":"IF(E31=\"\",\"\",ROUND(SUM(INDIRECT(CONCATENATE($A$29,\"!\",\"j\",$B31,\":\",\"j\",$B31))),0))","v":""},{"$f":"IF(F31=\"\",\"\",ROUND(SUM(INDIRECT(CONCATENATE($A$29,\"!\",\"aa\",$B31,\":\",\"aa\",$B31))),0))","v":""}]
[null,"",null,null,"","","","",""]
[null,"",null,null,"","","","",""]
[null,"",null,null,"","","","",""]
[null,"",null,null,"","","","",""]
[null,"",null,null,"","","","",""]
[null,"",null,null,"","","",{"$f":"IF(E37=\"\",\"\",ROUND(SUM(INDIRECT(CONCATENATE($A$29,\"!\",\"i\",$B37,\":\",\"k\",$B37))),0))","v":""},{"$f":"IF(F37=\"\",\"\",ROUND(SUM(INDIRECT(CONCATENATE($A$29,\"!\",\"q\",$B37,\":\",\"af\",$B37))),0))","v":""}]
[null,"",null,null,"TOTALS",null,null,{"$f":"SUM(H14:H37)","v":0},0]
[null,"",null,null,"Note: "]
[null,{"$f":"IF(A53=\"\",\"\",+A53)","v":""}]
[]
[]
[]
[]
[]
[]
[]
[]
[]
[]
[]
[]
[null,""]
[null,""]

{"sheet":"quantities report_secondary","index":15,"n_rows":0,"n_cols":0,"rows_kept":0,"cut":false,"hidden":false,"merged":[]}

{"sheet":"manual inputs_secondary","index":16,"n_rows":39,"n_cols":13,"rows_kept":39,"cut":false,"hidden":false,"merged":[]}
[]
[null,"Shrink/Swell Factor Summary",null,null,null,"Various Backfill Material Generated Onsite",null,null,"Number of Rows",null,null,null,"Station Range"]
[null,"Begin Station","End Station","Factor",null,"Place an 'x' in the row for any backfill material that is expected to be generated from onsite excavation.",null,null,{"$f":"LOOKUP(2,1/('quantities report_secondary'!A:A<>\"\"),ROW('quantities report_secondary'!A:A))","v":{"$error":"#N/A"}},null,null,"Add Starting Station"]
[null,null,null,null,null,"If the material below is expected to be imported because there is not any material from onsite that will meet the material quality requirements, leave the row blank."]
[]
[null,null,null,null,null,"………………..Verify with Geotech and Materials……………….."]
[null,{"$f":"IFERROR(INDEX('manual inputs_secondary'!M:M,SMALL(IF(#REF!<>\"\",ROW(#REF!)),ROW(8:8))),\"\")","v":""},null,null,null,"Material Type","Typical Uses","Generated from Onsite Material?"]
[]
[]
[null,null,null,null,null,"Wall Backfill","MSE Wall, SMSE Wall, Rockery, Concrete Retaining Wall with Parapet"]
[]
[null,null,null,null,null,"Foundation Fill","MSE Wall, SMSE Wall, Rockery, Concrete Cut Wall, Concrete Retaining Wall with Parapet, Concrete Fill Wall"]
[]
[]
[null,null,null,null,null,"Select Wall Backfill","MSE Wall, SMSE Wall, GFMSE Wall"]
[]
[null,null,null,null,null,"Rock","Rockery"]
[]
[null,null,null,null,null,"Granular Rock Backdrain","Rockery"]
[]
[null,null,null,null,null,"Structural Backfill","Guardwall, Concrete Cut Wall, Concrete Retaining Wall with Parapet, Concrete Fill Wall"]
[]
[null,"Note:  Do not use '+' sign in begin and end stations above",null,null,null,"Backfill Material","Guardwall, Concrete Retaining Wall with Parapet, Soil Nail Wall"]
[]
[null,null,null,null,null,"Granular Backfill","GFMSE Wall"]
[]
[]
[null,null,null,null,null,"Subex Backfill","Volume may be calculated by\n a. GEOPAK, \n b. Input by hand, or\n c. Both GEOPAK and hand calculations"]
[]
[]
[null,null,null,null,null,"Aggregate Base","Volume not generated by GEOPAK - input by hand."]
[]
[null,null,null,null,null,"Riprap","Volume not generated by GEOPAK - input by hand."]
[]
[null,null,null,null,null,"Special Rock Embankment","Volume not generated by GEOPAK - input by hand."]
[]
[null,null,null,null,null,"Embankment for Roadway Obliteration","Volume not generated by GEOPAK - input by hand."]
[]
[null,null,null,null,null,"Topping or Select Topping","Volume not generated by GEOPAK - input by hand."]

{"sheet":"Grading_secondary","index":17,"n_rows":32,"n_cols":42,"rows_kept":32,"cut":false,"hidden":false,"merged":[[3,14,3,17],[3,2,3,4],[3,6,3,8],[3,9,3,11],[3,12,5,12],[3,13,5,13],[3,39,4,39],[3,40,4,40],[3,41,4,41],[3,18,3,33],[3,34,4,34],[3,35,4,35],[3,36,4,36],[3,37,4,37],[3,38,4,38]]}
[null,null,null,null,null,"Pay Column",null,null,null,null,null,null,null,null,null,null,null,"Pay Column"]
[]
["TOTALS",null,{"$f":"SUM(C8:C32)","v":0},{"$f":"SUM(D8:D32)","v":0},{"$f":"SUM(E8:E32)","v":0},{"$f":"SUM(F8:F32)","v":0},{"$f":"SUM(G8:G32)","v":0},0,0,0,0,0,null,{"$f":"SUM(N8:N32)","v":0},{"$f":"SUM(O8:O32)","v":0},{"$f":"SUM(P8:P32)","v":0},{"$f":"SUM(Q8:Q32)","v":0},{"$f":"SUM(R8:R32)","v":0},{"$f":"SUM(S8:S32)","v":0},0,0,0,0,0,0,0,0,0,0,0,0,0,0,0,{"$f":"SUM(AI8:AI32)","v":0},{"$f":"SUM(AJ7:AJ186)","v":0},{"$f":"SUM(AK7:AK186)","v":0},{"$f":"SUM(AL7:AL186)","v":0},{"$f":"SUM(AM7:AM186)","v":0},{"$f":"AVERAGE(AN8:AN186)","v":0.8999999999999998},{"$f":"SUM(AO7:AO186)","v":0}]
[null,null,"Excavation",null,null,"Total","Excavation Material Available for Fill",null,null,"Excavation Material Unavailable for Fills",null,null,"Shrink/Swell Factor","Total Excavation Available for Fills","Embankment",null,null,null,"Needed Volume for Backfill Generated on Site",null,null,null,null,null,null,null,null,null,null,null,null,null,null,null,"Total Embankment","Excavation \n-\nEmbankment","Waste","Embankment Construction","Unclassifed Borrow Required","Unclassified Borrow Shrink/Swell","Unclassified Borrow","Mass Ordinate"]
[null,null,"Roadway prism minus topsoil and pavement","Total Excavation\nVolumes_Cut+Existing_Payment (removed)+Topsoil (removed)","Approach Road","Total Excavation for Pay","(+)\nStructure Excavation (Walls)","(+)\nExcavation\nFrom\nRoadway\nObliteration","(+)\nSubexcavation","(-)\nPavement Removal in Cuts","(-)\nTopsoil Stripping in Cuts","(-)\nDisposal of Subexcavation Material",null,null,"Roadway Prism (Embankment) plus backfill for topsoil in fills and existing pavment in fills\n","Total Roadway Prism Fill","Approach Road","Total Roadway Prism Fill for Pay","(+)\nCommon Backfill","(+)\nFoundation\nFill","(+)\nSelect Granular\nBackfill","(+)\nRock","(+)\nGranular\nRock Backdrain","(+)\nStructural Backfill","(+)\nCommon\nBackfill","(+)\nGranular\nBackfill","\nBackfill for Pavement Removal Under Fill","\nTopsoil Replacement Under Fill","(+)\nSub-excavation","(+)\nAggregate Base","(+)\nRiprap","(+)\nSpecial Rock Embankment","(+)\nEmbankment For Roadway Obliteration","(+)\nTopping"]
["ORD Component Name",null,"Volumes_Cut: ","Total Excavation","--","Total Excavation for Pay","--","--","Subex_Exc2: ","Exist Pvmt Layer 1 (removed): ","Exist Topsoil (removed): ","Subex_Exc2: ",null,null,"Volumes_Fill: ",null,"--","Total Embankment for Pay","Wall Backfill:","--","MSE Wall Backfill 2: ","Rockery Wall Backfill: ","Rockery Wall Backfill 2: ","Wall Backfill 2: ","--","--","Exist Pvmt Layer 1 (removed and replaced): ","Exist Topsoil (removed and replaced):","Subex_Backfill1: "]
["Enter Start of Project",{"$f":"IFERROR(INDEX('manual inputs_secondary'!M:M,SMALL(IF('manual inputs_secondary'!M:M<>\"\",ROW('manual inputs_secondary'!M:M)),ROW(2:2))),\"\")","v":""}]
[null,{"$f":"IFERROR(INDEX('manual inputs_secondary'!M:M,SMALL(IF('manual inputs_secondary'!M:M<>\"\",ROW('manual inputs_secondary'!M:M)),ROW(3:3))),\"\")","v":""},{"$f":"IF(B8=\"\",\"\",IFERROR(INDEX('quantities report_secondary'!$D$2:$D$10003,SMALL(IF('quantities report_secondary'!$A$2:$A$10003=C$6,ROW('quantities report_secondary'!$A$2:$A$10003)-1,\"\"),ROWS($B$8:$B8))),\"0\"))","v":""},{"$f":"IF(B8=\"\",\"\",$C8+$J8+$K8)","v":""},null,{"$f":"IF(B8=\"\",\"\",$D8+$E8)","v":""},{"$f":"IF($B8=\"\",\"\",Structure_Ex_secondary!I8)","v":""},null,{"$f":"IF($B8=\"\",\"\",IFERROR(INDEX('quantities report_secondary'!$D$2:$D$10003,SMALL(IF('quantities report_secondary'!$A$2:$A$10003=I$6,ROW('quantities report_secondary'!$A$2:$A$10003)-1,\"\"),ROWS($B$8:$B8))),\"0\"))","v":""},{"$f":"IF($B8=\"\",\"\",Removals_secondary!$F5)","v":""},{"$f":"IF($B8=\"\",\"\",Removals_secondary!$K5)","v":""},{"$f":"IF($B8=\"\",\"\",IFERROR(INDEX('quantities report_secondary'!$D$2:$D$10003,SMALL(IF('quantities report_secondary'!$A$2:$A$10003=L$6,ROW('quantities report_secondary'!$A$2:$A$10003)-1,\"\"),ROWS($B$8:$B8))),\"0\"))","v":""},{"$f":"IF(B8=\"\",\"\",LOOKUP(B8,'manual inputs_secondary'!$B$4:$B$22,'manual inputs_secondary'!$D$4:$D$22))","v":""},{"$f":"IF(B8 =\"\",\"\",(($F8+$G8+$H8+$I8-$J8-$K8-$L8)*$M8))","v":""},{"$f":"IF($B8=\"\",\"\",IFERROR(INDEX('quantities report_secondary'!$D$2:$D$10003,SMALL(IF('quantities report_secondary'!$A$2:$A$10003=O$6,ROW('quantities report_secondary'!$A$2:$A$10003)-1,\"\"),ROWS($B$8:$B8))),\"0\"))","v":""},{"$f":"IF(B8=\"\",\"\",$O8-$AA8-$AB8)","v":""},null,{"$f":"IF(D8=\"\",\"\",$O8-$AA8-$AB8+$Q8)","v":""},{"$f":"IF($B8=\"\",\"\",IFERROR(INDEX('quantities report_secondary'!$D$2:$D$10003,SMALL(IF('quantities report_secondary'!$A$2:$A$10003=S$6,ROW('quantities report_secondary'!$A$2:$A$10003)-1,\"\"),ROWS($B$8:$B8))),\"0\"))","v":""},{"$f":"IF($B8=\"\",\"\",Backfill_secondary!H8)","v":""},{"$f":"IF($B8=\"\",\"\",IFERROR(INDEX('quantities report_secondary'!$D$2:$D$10003,SMALL(IF('quantities report_secondary'!$A$2:$A$10003=U$6,ROW('quantities report_secondary'!$A$2:$A$10003)-1,\"\"),ROWS($B$8:$B8))),\"0\"))","v":""},{"$f":"IF($B8=\"\",\"\",IFERROR(INDEX('quantities report_secondary'!$D$2:$D$10003,SMALL(IF('quantities report_secondary'!$A$2:$A$10003=V$6,ROW('quantities report_secondary'!$A$2:$A$10003)-1,\"\"),ROWS($B$8:$B8))),\"0\"))","v":""},{"$f":"IF($B8=\"\",\"\",IFERROR(INDEX('quantities report_secondary'!$D$2:$D$10003,SMALL(IF('quantities report_secondary'!$A$2:$A$10003=W$6,ROW('quantities report_secondary'!$A$2:$A$10003)-1,\"\"),ROWS($B$8:$B8))),\"0\"))","v":""},{"$f":"IF($B8=\"\",\"\",IFERROR(INDEX('quantities report_secondary'!$D$2:$D$10003,SMALL(IF('quantities report_secondary'!$A$2:$A$10003=X$6,ROW('quantities report_secondary'!$A$2:$A$10003)-1,\"\"),ROWS($B$8:$B8))),\"0\"))","v":""},{"$f":"IF($B8=\"\",\"\",Backfill_secondary!R8)","v":""},{"$f":"IF($B8=\"\",\"\",Backfill_secondary!U8)","v":""},{"$f":"IF($B8=\"\",\"\",Removals_secondary!$G5)","v":""},{"$f":"IF($B8=\"\",\"\",Removals_secondary!$L5)","v":""},{"$f":"IF($B8=\"\",\"\",IFERROR(INDEX('quantities report_secondary'!$D$2:$D$10003,SMALL(IF('quantities report_secondary'!$A$2:$A$10003=AC$6,ROW('quantities report_secondary'!$A$2:$A$10003)-1,\"\"),ROWS($B$8:$B8))),\"0\"))","v":""},{"$f":"IF($B8=\"\",\"\",IFERROR(INDEX('quantities report_secondary'!$D$2:$D$10003,SMALL(IF('quantities report_secondary'!$A$2:$A$10003=AD$6,ROW('quantities report_secondary'!$A$2:$A$10003)-1,\"\"),ROWS($B$8:$B8))),\"0\"))","v":""},{"$f":"IF($B8=\"\",\"\",IFERROR(INDEX('quantities report_secondary'!$D$2:$D$10003,SMALL(IF('quantities report_secondary'!$A$2:$A$10003=AE$6,ROW('quantities report_secondary'!$A$2:$A$10003)-1,\"\"),ROWS($B$8:$B8))),\"0\"))","v":""},{"$f":"IF($B8=\"\",\"\",IFERROR(INDEX('quantities report_secondary'!$D$2:$D$10003,SMALL(IF('quantities report_secondary'!$A$2:$A$10003=AF$6,ROW('quantities report_secondary'!$A$2:$A$10003)-1,\"\"),ROWS($B$8:$B8))),\"0\"))","v":""},{"$f":"IF($B8=\"\",\"\",IFERROR(INDEX('quantities report_secondary'!$D$2:$D$10003,SMALL(IF('quantities report_secondary'!$A$2:$A$10003=AG$6,ROW('quantities report_secondary'!$A$2:$A$10003)-1,\"\"),ROWS($B$8:$B8))),\"0\"))","v":""},{"$f":"IF($B8=\"\",\"\",IFERROR(INDEX('quantities report_secondary'!$D$2:$D$10003,SMALL(IF('quantities report_secondary'!$A$2:$A$10003=AH$6,ROW('quantities report_secondary'!$A$2:$A$10003)-1,\"\"),ROWS($B$8:$B8))),\"0\"))","v":""},{"$f":"IF(B8=\"\",\"\",$O8+$Q8+$S8+$T8+$U8+$V8+$W8+$X8+$Y8+$Z8+$AC8+$AD8+$AE8+$AF8+$AG8+$AH8)","v":""},{"$f":"IF(B8=\"\",\"\",$N8-$AI8)","v":""},{"$f":"IF(B8=\"\",\"\",$AJ8)","v":""},{"$f":"IF(B8=\"\",\"\",$O8+$Q8)","v":""},{"$f":"IF(B8=\"\",\"\",-$AJ8)","v":""},0.9,{"$f":"IF(B8=\"\",\"\",AM8/AN8)","v":""},{"$f":"IF(AJ8=\"\", \" \", ROUND($AJ8,0))","v":" "}]
[null,{"$f":"IFERROR(INDEX('manual inputs_secondary'!M:M,SMALL(IF('manual inputs_secondary'!M:M<>\"\",ROW('manual inputs_secondary'!M:M)),ROW(4:4))),\"\")","v":""},{"$f":"IF(B9=\"\",\"\",IFERROR(INDEX('quantities report_secondary'!$D$2:$D$10003,SMALL(IF('quantities report_secondary'!$A$2:$A$10003=C$6,ROW('quantities report_secondary'!$A$2:$A$10003)-1,\"\"),ROWS($B$8:$B9))),\"0\"))","v":""},{"$f":"IF(B9=\"\",\"\",$C9+$J9+$K9)","v":""},null,{"$f":"IF(B9=\"\",\"\",$D9+$E9)","v":""},{"$f":"IF($B9=\"\",\"\",Structure_Ex_secondary!I9)","v":""},null,{"$f":"IF($B9=\"\",\"\",IFERROR(INDEX('quantities report_secondary'!$D$2:$D$10003,SMALL(IF('quantities report_secondary'!$A$2:$A$10003=I$6,ROW('quantities report_secondary'!$A$2:$A$10003)-1,\"\"),ROWS($B$8:$B9))),\"0\"))","v":""},{"$f":"IF($B9=\"\",\"\",Removals_secondary!$F6)","v":""},{"$f":"IF($B9=\"\",\"\",Removals_secondary!$K6)","v":""},{"$f":"IF($B9=\"\",\"\",IFERROR(INDEX('quantities report_secondary'!$D$2:$D$10003,SMALL(IF('quantities report_secondary'!$A$2:$A$10003=L$6,ROW('quantities report_secondary'!$A$2:$A$10003)-1,\"\"),ROWS($B$8:$B9))),\"0\"))","v":""},{"$f":"IF(B9=\"\",\"\",LOOKUP(B9,'manual inputs_secondary'!$B$4:$B$22,'manual inputs_secondary'!$D$4:$D$22))","v":""},{"$f":"IF(B9 =\"\",\"\",(($F9+$G9+$H9+$I9-$J9-$K9-$L9)*$M9))","v":""},{"$f":"IF($B9=\"\",\"\",IFERROR(INDEX('quantities report_secondary'!$D$2:$D$10003,SMALL(IF('quantities report_secondary'!$A$2:$A$10003=O$6,ROW('quantities report_secondary'!$A$2:$A$10003)-1,\"\"),ROWS($B$8:$B9))),\"0\"))","v":""},{"$f":"IF(B9=\"\",\"\",$O9-$AA9-$AB9)","v":""},null,{"$f":"IF(D9=\"\",\"\",$O9-$AA9-$AB9+$Q9)","v":""},{"$f":"IF($B9=\"\",\"\",IFERROR(INDEX('quantities report_secondary'!$D$2:$D$10003,SMALL(IF('quantities report_secondary'!$A$2:$A$10003=S$6,ROW('quantities report_secondary'!$A$2:$A$10003)-1,\"\"),ROWS($B$8:$B9))),\"0\"))","v":""},{"$f":"IF($B9=\"\",\"\",Backfill_secondary!H9)","v":""},{"$f":"IF($B9=\"\",\"\",IFERROR(INDEX('quantities report_secondary'!$D$2:$D$10003,SMALL(IF('quantities report_secondary'!$A$2:$A$10003=U$6,ROW('quantities report_secondary'!$A$2:$A$10003)-1,\"\"),ROWS($B$8:$B9))),\"0\"))","v":""},{"$f":"IF($B9=\"\",\"\",IFERROR(INDEX('quantities report_secondary'!$D$2:$D$10003,SMALL(IF('quantities report_secondary'!$A$2:$A$10003=V$6,ROW('quantities report_secondary'!$A$2:$A$10003)-1,\"\"),ROWS($B$8:$B9))),\"0\"))","v":""},{"$f":"IF($B9=\"\",\"\",IFERROR(INDEX('quantities report_secondary'!$D$2:$D$10003,SMALL(IF('quantities report_secondary'!$A$2:$A$10003=W$6,ROW('quantities report_secondary'!$A$2:$A$10003)-1,\"\"),ROWS($B$8:$B9))),\"0\"))","v":""},{"$f":"IF($B9=\"\",\"\",IFERROR(INDEX('quantities report_secondary'!$D$2:$D$10003,SMALL(IF('quantities report_secondary'!$A$2:$A$10003=X$6,ROW('quantities report_secondary'!$A$2:$A$10003)-1,\"\"),ROWS($B$8:$B9))),\"0\"))","v":""},{"$f":"IF($B9=\"\",\"\",Backfill_secondary!R9)","v":""},{"$f":"IF($B9=\"\",\"\",Backfill_secondary!U9)","v":""},{"$f":"IF($B9=\"\",\"\",Removals_secondary!$G6)","v":""},{"$f":"IF($B9=\"\",\"\",Removals_secondary!$L6)","v":""},{"$f":"IF($B9=\"\",\"\",IFERROR(INDEX('quantities report_secondary'!$D$2:$D$10003,SMALL(IF('quantities report_secondary'!$A$2:$A$10003=AC$6,ROW('quantities report_secondary'!$A$2:$A$10003)-1,\"\"),ROWS($B$8:$B9))),\"0\"))","v":""},{"$f":"IF($B9=\"\",\"\",IFERROR(INDEX('quantities report_secondary'!$D$2:$D$10003,SMALL(IF('quantities report_secondary'!$A$2:$A$10003=AD$6,ROW('quantities report_secondary'!$A$2:$A$10003)-1,\"\"),ROWS($B$8:$B9))),\"0\"))","v":""},{"$f":"IF($B9=\"\",\"\",IFERROR(INDEX('quantities report_secondary'!$D$2:$D$10003,SMALL(IF('quantities report_secondary'!$A$2:$A$10003=AE$6,ROW('quantities report_secondary'!$A$2:$A$10003)-1,\"\"),ROWS($B$8:$B9))),\"0\"))","v":""},{"$f":"IF($B9=\"\",\"\",IFERROR(INDEX('quantities report_secondary'!$D$2:$D$10003,SMALL(IF('quantities report_secondary'!$A$2:$A$10003=AF$6,ROW('quantities report_secondary'!$A$2:$A$10003)-1,\"\"),ROWS($B$8:$B9))),\"0\"))","v":""},{"$f":"IF($B9=\"\",\"\",IFERROR(INDEX('quantities report_secondary'!$D$2:$D$10003,SMALL(IF('quantities report_secondary'!$A$2:$A$10003=AG$6,ROW('quantities report_secondary'!$A$2:$A$10003)-1,\"\"),ROWS($B$8:$B9))),\"0\"))","v":""},{"$f":"IF($B9=\"\",\"\",IFERROR(INDEX('quantities report_secondary'!$D$2:$D$10003,SMALL(IF('quantities report_secondary'!$A$2:$A$10003=AH$6,ROW('quantities report_secondary'!$A$2:$A$10003)-1,\"\"),ROWS($B$8:$B9))),\"0\"))","v":""},{"$f":"IF(B9=\"\",\"\",$O9+$Q9+$S9+$T9+$U9+$V9+$W9+$X9+$Y9+$Z9+$AC9+$AD9+$AE9+$AF9+$AG9+$AH9)","v":""},{"$f":"IF(B9=\"\",\"\",$N9-$AI9)","v":""},{"$f":"IF(B9=\"\",\"\",$AJ9)","v":""},{"$f":"IF(B9=\"\",\"\",$O9+$Q9)","v":""},{"$f":"IF(B9=\"\",\"\",-$AJ9)","v":""},0.9,{"$f":"IF(B9=\"\",\"\",AM9/AN9)","v":""},{"$f":"IF(AJ9=\"\", \" \", ROUND($AJ9,0))","v":" "}]
[null,{"$f":"IFERROR(INDEX('manual inputs_secondary'!M:M,SMALL(IF('manual inputs_secondary'!M:M<>\"\",ROW('manual inputs_secondary'!M:M)),ROW(5:5))),\"\")","v":""},{"$f":"IF(B10=\"\",\"\",IFERROR(INDEX('quantities report_secondary'!$D$2:$D$10003,SMALL(IF('quantities report_secondary'!$A$2:$A$10003=C$6,ROW('quantities report_secondary'!$A$2:$A$10003)-1,\"\"),ROWS($B$8:$B10))),\"0\"))","v":""},"",null,"",{"$f":"IF($B10=\"\",\"\",Structure_Ex_secondary!I10)","v":""},null,{"$f":"IF($B10=\"\",\"\",IFERROR(INDEX('quantities report_secondary'!$D$2:$D$10003,SMALL(IF('quantities report_secondary'!$A$2:$A$10003=I$6,ROW('quantities report_secondary'!$A$2:$A$10003)-1,\"\"),ROWS($B$8:$B10))),\"0\"))","v":""},{"$f":"IF($B10=\"\",\"\",Removals_secondary!$F7)","v":""},{"$f":"IF($B10=\"\",\"\",Removals_secondary!$K7)","v":""},{"$f":"IF($B10=\"\",\"\",IFERROR(INDEX('quantities report_secondary'!$D$2:$D$10003,SMALL(IF('quantities report_secondary'!$A$2:$A$10003=L$6,ROW('quantities report_secondary'!$A$2:$A$10003)-1,\"\"),ROWS($B$8:$B10))),\"0\"))","v":""},{"$f":"IF(B10=\"\",\"\",LOOKUP(B10,'manual inputs_secondary'!$B$4:$B$22,'manual inputs_secondary'!$D$4:$D$22))","v":""},"",{"$f":"IF($B10=\"\",\"\",IFERROR(INDEX('quantities report_secondary'!$D$2:$D$10003,SMALL(IF('quantities report_secondary'!$A$2:$A$10003=O$6,ROW('quantities report_secondary'!$A$2:$A$10003)-1,\"\"),ROWS($B$8:$B10))),\"0\"))","v":""},"",null,"",{"$f":"IF($B10=\"\",\"\",IFERROR(INDEX('quantities report_secondary'!$D$2:$D$10003,SMALL(IF('quantities report_secondary'!$A$2:$A$10003=S$6,ROW('quantities report_secondary'!$A$2:$A$10003)-1,\"\"),ROWS($B$8:$B10))),\"0\"))","v":""},{"$f":"IF($B10=\"\",\"\",Backfill_secondary!H10)","v":""},{"$f":"IF($B10=\"\",\"\",IFERROR(INDEX('quantities report_secondary'!$D$2:$D$10003,SMALL(IF('quantities report_secondary'!$A$2:$A$10003=U$6,ROW('quantities report_secondary'!$A$2:$A$10003)-1,\"\"),ROWS($B$8:$B10))),\"0\"))","v":""},{"$f":"IF($B10=\"\",\"\",IFERROR(INDEX('quantities report_secondary'!$D$2:$D$10003,SMALL(IF('quantities report_secondary'!$A$2:$A$10003=V$6,ROW('quantities report_secondary'!$A$2:$A$10003)-1,\"\"),ROWS($B$8:$B10))),\"0\"))","v":""},{"$f":"IF($B10=\"\",\"\",IFERROR(INDEX('quantities report_secondary'!$D$2:$D$10003,SMALL(IF('quantities report_secondary'!$A$2:$A$10003=W$6,ROW('quantities report_secondary'!$A$2:$A$10003)-1,\"\"),ROWS($B$8:$B10))),\"0\"))","v":""},{"$f":"IF($B10=\"\",\"\",IFERROR(INDEX('quantities report_secondary'!$D$2:$D$10003,SMALL(IF('quantities report_secondary'!$A$2:$A$10003=X$6,ROW('quantities report_secondary'!$A$2:$A$10003)-1,\"\"),ROWS($B$8:$B10))),\"0\"))","v":""},{"$f":"IF($B10=\"\",\"\",Backfill_secondary!R10)","v":""},{"$f":"IF($B10=\"\",\"\",Backfill_secondary!U10)","v":""},{"$f":"IF($B10=\"\",\"\",Removals_secondary!$G7)","v":""},{"$f":"IF($B10=\"\",\"\",Removals_secondary!$L7)","v":""},{"$f":"IF($B10=\"\",\"\",IFERROR(INDEX('quantities report_secondary'!$D$2:$D$10003,SMALL(IF('quantities report_secondary'!$A$2:$A$10003=AC$6,ROW('quantities report_secondary'!$A$2:$A$10003)-1,\"\"),ROWS($B$8:$B10))),\"0\"))","v":""},{"$f":"IF($B10=\"\",\"\",IFERROR(INDEX('quantities report_secondary'!$D$2:$D$10003,SMALL(IF('quantities report_secondary'!$A$2:$A$10003=AD$6,ROW('quantities report_secondary'!$A$2:$A$10003)-1,\"\"),ROWS($B$8:$B10))),\"0\"))","v":""},{"$f":"IF($B10=\"\",\"\",IFERROR(INDEX('quantities report_secondary'!$D$2:$D$10003,SMALL(IF('quantities report_secondary'!$A$2:$A$10003=AE$6,ROW('quantities report_secondary'!$A$2:$A$10003)-1,\"\"),ROWS($B$8:$B10))),\"0\"))","v":""},{"$f":"IF($B10=\"\",\"\",IFERROR(INDEX('quantities report_secondary'!$D$2:$D$10003,SMALL(IF('quantities report_secondary'!$A$2:$A$10003=AF$6,ROW('quantities report_secondary'!$A$2:$A$10003)-1,\"\"),ROWS($B$8:$B10))),\"0\"))","v":""},{"$f":"IF($B10=\"\",\"\",IFERROR(INDEX('quantities report_secondary'!$D$2:$D$10003,SMALL(IF('quantities report_secondary'!$A$2:$A$10003=AG$6,ROW('quantities report_secondary'!$A$2:$A$10003)-1,\"\"),ROWS($B$8:$B10))),\"0\"))","v":""},{"$f":"IF($B10=\"\",\"\",IFERROR(INDEX('quantities report_secondary'!$D$2:$D$10003,SMALL(IF('quantities report_secondary'!$A$2:$A$10003=AH$6,ROW('quantities report_secondary'!$A$2:$A$10003)-1,\"\"),ROWS($B$8:$B10))),\"0\"))","v":""},"","","","","",0.9,""," "]
[null,{"$f":"IFERROR(INDEX('manual inputs_secondary'!M:M,SMALL(IF('manual inputs_secondary'!M:M<>\"\",ROW('manual inputs_secondary'!M:M)),ROW(6:6))),\"\")","v":""},{"$f":"IF(B11=\"\",\"\",IFERROR(INDEX('quantities report_secondary'!$D$2:$D$10003,SMALL(IF('quantities report_secondary'!$A$2:$A$10003=C$6,ROW('quantities report_secondary'!$A$2:$A$10003)-1,\"\"),ROWS($B$8:$B11))),\"0\"))","v":""},"",null,"",{"$f":"IF($B11=\"\",\"\",Structure_Ex_secondary!I11)","v":""},null,{"$f":"IF($B11=\"\",\"\",IFERROR(INDEX('quantities report_secondary'!$D$2:$D$10003,SMALL(IF('quantities report_secondary'!$A$2:$A$10003=I$6,ROW('quantities report_secondary'!$A$2:$A$10003)-1,\"\"),ROWS($B$8:$B11))),\"0\"))","v":""},{"$f":"IF($B11=\"\",\"\",Removals_secondary!$F8)","v":""},{"$f":"IF($B11=\"\",\"\",Removals_secondary!$K8)","v":""},{"$f":"IF($B11=\"\",\"\",IFERROR(INDEX('quantities report_secondary'!$D$2:$D$10003,SMALL(IF('quantities report_secondary'!$A$2:$A$10003=L$6,ROW('quantities report_secondary'!$A$2:$A$10003)-1,\"\"),ROWS($B$8:$B11))),\"0\"))","v":""},{"$f":"IF(B11=\"\",\"\",LOOKUP(B11,'manual inputs_secondary'!$B$4:$B$22,'manual inputs_secondary'!$D$4:$D$22))","v":""},"",{"$f":"IF($B11=\"\",\"\",IFERROR(INDEX('quantities report_secondary'!$D$2:$D$10003,SMALL(IF('quantities report_secondary'!$A$2:$A$10003=O$6,ROW('quantities report_secondary'!$A$2:$A$10003)-1,\"\"),ROWS($B$8:$B11))),\"0\"))","v":""},"",null,"",{"$f":"IF($B11=\"\",\"\",IFERROR(INDEX('quantities report_secondary'!$D$2:$D$10003,SMALL(IF('quantities report_secondary'!$A$2:$A$10003=S$6,ROW('quantities report_secondary'!$A$2:$A$10003)-1,\"\"),ROWS($B$8:$B11))),\"0\"))","v":""},{"$f":"IF($B11=\"\",\"\",Backfill_secondary!H11)","v":""},{"$f":"IF($B11=\"\",\"\",IFERROR(INDEX('quantities report_secondary'!$D$2:$D$10003,SMALL(IF('quantities report_secondary'!$A$2:$A$10003=U$6,ROW('quantities report_secondary'!$A$2:$A$10003)-1,\"\"),ROWS($B$8:$B11))),\"0\"))","v":""},{"$f":"IF($B11=\"\",\"\",IFERROR(INDEX('quantities report_secondary'!$D$2:$D$10003,SMALL(IF('quantities report_secondary'!$A$2:$A$10003=V$6,ROW('quantities report_secondary'!$A$2:$A$10003)-1,\"\"),ROWS($B$8:$B11))),\"0\"))","v":""},{"$f":"IF($B11=\"\",\"\",IFERROR(INDEX('quantities report_secondary'!$D$2:$D$10003,SMALL(IF('quantities report_secondary'!$A$2:$A$10003=W$6,ROW('quantities report_secondary'!$A$2:$A$10003)-1,\"\"),ROWS($B$8:$B11))),\"0\"))","v":""},{"$f":"IF($B11=\"\",\"\",IFERROR(INDEX('quantities report_secondary'!$D$2:$D$10003,SMALL(IF('quantities report_secondary'!$A$2:$A$10003=X$6,ROW('quantities report_secondary'!$A$2:$A$10003)-1,\"\"),ROWS($B$8:$B11))),\"0\"))","v":""},{"$f":"IF($B11=\"\",\"\",Backfill_secondary!R11)","v":""},{"$f":"IF($B11=\"\",\"\",Backfill_secondary!U11)","v":""},{"$f":"IF($B11=\"\",\"\",Removals_secondary!$G8)","v":""},{"$f":"IF($B11=\"\",\"\",Removals_secondary!$L8)","v":""},{"$f":"IF($B11=\"\",\"\",IFERROR(INDEX('quantities report_secondary'!$D$2:$D$10003,SMALL(IF('quantities report_secondary'!$A$2:$A$10003=AC$6,ROW('quantities report_secondary'!$A$2:$A$10003)-1,\"\"),ROWS($B$8:$B11))),\"0\"))","v":""},{"$f":"IF($B11=\"\",\"\",IFERROR(INDEX('quantities report_secondary'!$D$2:$D$10003,SMALL(IF('quantities report_secondary'!$A$2:$A$10003=AD$6,ROW('quantities report_secondary'!$A$2:$A$10003)-1,\"\"),ROWS($B$8:$B11))),\"0\"))","v":""},{"$f":"IF($B11=\"\",\"\",IFERROR(INDEX('quantities report_secondary'!$D$2:$D$10003,SMALL(IF('quantities report_secondary'!$A$2:$A$10003=AE$6,ROW('quantities report_secondary'!$A$2:$A$10003)-1,\"\"),ROWS($B$8:$B11))),\"0\"))","v":""},{"$f":"IF($B11=\"\",\"\",IFERROR(INDEX('quantities report_secondary'!$D$2:$D$10003,SMALL(IF('quantities report_secondary'!$A$2:$A$10003=AF$6,ROW('quantities report_secondary'!$A$2:$A$10003)-1,\"\"),ROWS($B$8:$B11))),\"0\"))","v":""},{"$f":"IF($B11=\"\",\"\",IFERROR(INDEX('quantities report_secondary'!$D$2:$D$10003,SMALL(IF('quantities report_secondary'!$A$2:$A$10003=AG$6,ROW('quantities report_secondary'!$A$2:$A$10003)-1,\"\"),ROWS($B$8:$B11))),\"0\"))","v":""},{"$f":"IF($B11=\"\",\"\",IFERROR(INDEX('quantities report_secondary'!$D$2:$D$10003,SMALL(IF('quantities report_secondary'!$A$2:$A$10003=AH$6,ROW('quantities report_secondary'!$A$2:$A$10003)-1,\"\"),ROWS($B$8:$B11))),\"0\"))","v":""},"","","","","",0.9,""," "]
[null,{"$f":"IFERROR(INDEX('manual inputs_secondary'!M:M,SMALL(IF('manual inputs_secondary'!M:M<>\"\",ROW('manual inputs_secondary'!M:M)),ROW(7:7))),\"\")","v":""},{"$f":"IF(B12=\"\",\"\",IFERROR(INDEX('quantities report_secondary'!$D$2:$D$10003,SMALL(IF('quantities report_secondary'!$A$2:$A$10003=C$6,ROW('quantities report_secondary'!$A$2:$A$10003)-1,\"\"),ROWS($B$8:$B12))),\"0\"))","v":""},"",null,"",{"$f":"IF($B12=\"\",\"\",Structure_Ex_secondary!I12)","v":""},null,{"$f":"IF($B12=\"\",\"\",IFERROR(INDEX('quantities report_secondary'!$D$2:$D$10003,SMALL(IF('quantities report_secondary'!$A$2:$A$10003=I$6,ROW('quantities report_secondary'!$A$2:$A$10003)-1,\"\"),ROWS($B$8:$B12))),\"0\"))","v":""},{"$f":"IF($B12=\"\",\"\",Removals_secondary!$F9)","v":""},{"$f":"IF($B12=\"\",\"\",Removals_secondary!$K9)","v":""},{"$f":"IF($B12=\"\",\"\",IFERROR(INDEX('quantities report_secondary'!$D$2:$D$10003,SMALL(IF('quantities report_secondary'!$A$2:$A$10003=L$6,ROW('quantities report_secondary'!$A$2:$A$10003)-1,\"\"),ROWS($B$8:$B12))),\"0\"))","v":""},{"$f":"IF(B12=\"\",\"\",LOOKUP(B12,'manual inputs_secondary'!$B$4:$B$22,'manual inputs_secondary'!$D$4:$D$22))","v":""},"",{"$f":"IF($B12=\"\",\"\",IFERROR(INDEX('quantities report_secondary'!$D$2:$D$10003,SMALL(IF('quantities report_secondary'!$A$2:$A$10003=O$6,ROW('quantities report_secondary'!$A$2:$A$10003)-1,\"\"),ROWS($B$8:$B12))),\"0\"))","v":""},"",null,"",{"$f":"IF($B12=\"\",\"\",IFERROR(INDEX('quantities report_secondary'!$D$2:$D$10003,SMALL(IF('quantities report_secondary'!$A$2:$A$10003=S$6,ROW('quantities report_secondary'!$A$2:$A$10003)-1,\"\"),ROWS($B$8:$B12))),\"0\"))","v":""},{"$f":"IF($B12=\"\",\"\",Backfill_secondary!H12)","v":""},{"$f":"IF($B12=\"\",\"\",IFERROR(INDEX('quantities report_secondary'!$D$2:$D$10003,SMALL(IF('quantities report_secondary'!$A$2:$A$10003=U$6,ROW('quantities report_secondary'!$A$2:$A$10003)-1,\"\"),ROWS($B$8:$B12))),\"0\"))","v":""},{"$f":"IF($B12=\"\",\"\",IFERROR(INDEX('quantities report_secondary'!$D$2:$D$10003,SMALL(IF('quantities report_secondary'!$A$2:$A$10003=V$6,ROW('quantities report_secondary'!$A$2:$A$10003)-1,\"\"),ROWS($B$8:$B12))),\"0\"))","v":""},{"$f":"IF($B12=\"\",\"\",IFERROR(INDEX('quantities report_secondary'!$D$2:$D$10003,SMALL(IF('quantities report_secondary'!$A$2:$A$10003=W$6,ROW('quantities report_secondary'!$A$2:$A$10003)-1,\"\"),ROWS($B$8:$B12))),\"0\"))","v":""},{"$f":"IF($B12=\"\",\"\",IFERROR(INDEX('quantities report_secondary'!$D$2:$D$10003,SMALL(IF('quantities report_secondary'!$A$2:$A$10003=X$6,ROW('quantities report_secondary'!$A$2:$A$10003)-1,\"\"),ROWS($B$8:$B12))),\"0\"))","v":""},{"$f":"IF($B12=\"\",\"\",Backfill_secondary!R12)","v":""},{"$f":"IF($B12=\"\",\"\",Backfill_secondary!U12)","v":""},{"$f":"IF($B12=\"\",\"\",Removals_secondary!$G9)","v":""},{"$f":"IF($B12=\"\",\"\",Removals_secondary!$L9)","v":""},{"$f":"IF($B12=\"\",\"\",IFERROR(INDEX('quantities report_secondary'!$D$2:$D$10003,SMALL(IF('quantities report_secondary'!$A$2:$A$10003=AC$6,ROW('quantities report_secondary'!$A$2:$A$10003)-1,\"\"),ROWS($B$8:$B12))),\"0\"))","v":""},{"$f":"IF($B12=\"\",\"\",IFERROR(INDEX('quantities report_secondary'!$D$2:$D$10003,SMALL(IF('quantities report_secondary'!$A$2:$A$10003=AD$6,ROW('quantities report_secondary'!$A$2:$A$10003)-1,\"\"),ROWS($B$8:$B12))),\"0\"))","v":""},{"$f":"IF($B12=\"\",\"\",IFERROR(INDEX('quantities report_secondary'!$D$2:$D$10003,SMALL(IF('quantities report_secondary'!$A$2:$A$10003=AE$6,ROW('quantities report_secondary'!$A$2:$A$10003)-1,\"\"),ROWS($B$8:$B12))),\"0\"))","v":""},{"$f":"IF($B12=\"\",\"\",IFERROR(INDEX('quantities report_secondary'!$D$2:$D$10003,SMALL(IF('quantities report_secondary'!$A$2:$A$10003=AF$6,ROW('quantities report_secondary'!$A$2:$A$10003)-1,\"\"),ROWS($B$8:$B12))),\"0\"))","v":""},{"$f":"IF($B12=\"\",\"\",IFERROR(INDEX('quantities report_secondary'!$D$2:$D$10003,SMALL(IF('quantities report_secondary'!$A$2:$A$10003=AG$6,ROW('quantities report_secondary'!$A$2:$A$10003)-1,\"\"),ROWS($B$8:$B12))),\"0\"))","v":""},{"$f":"IF($B12=\"\",\"\",IFERROR(INDEX('quantities report_secondary'!$D$2:$D$10003,SMALL(IF('quantities report_secondary'!$A$2:$A$10003=AH$6,ROW('quantities report_secondary'!$A$2:$A$10003)-1,\"\"),ROWS($B$8:$B12))),\"0\"))","v":""},"","","","","",0.9,""," "]
[null,{"$f":"IFERROR(INDEX('manual inputs_secondary'!M:M,SMALL(IF('manual inputs_secondary'!M:M<>\"\",ROW('manual inputs_secondary'!M:M)),ROW(8:8))),\"\")","v":""},{"$f":"IF(B13=\"\",\"\",IFERROR(INDEX('quantities report_secondary'!$D$2:$D$10003,SMALL(IF('quantities report_secondary'!$A$2:$A$10003=C$6,ROW('quantities report_secondary'!$A$2:$A$10003)-1,\"\"),ROWS($B$8:$B13))),\"0\"))","v":""},"",null,"",{"$f":"IF($B13=\"\",\"\",Structure_Ex_secondary!I13)","v":""},null,{"$f":"IF($B13=\"\",\"\",IFERROR(INDEX('quantities report_secondary'!$D$2:$D$10003,SMALL(IF('quantities report_secondary'!$A$2:$A$10003=I$6,ROW('quantities report_secondary'!$A$2:$A$10003)-1,\"\"),ROWS($B$8:$B13))),\"0\"))","v":""},{"$f":"IF($B13=\"\",\"\",Removals_secondary!$F10)","v":""},{"$f":"IF($B13=\"\",\"\",Removals_secondary!$K10)","v":""},{"$f":"IF($B13=\"\",\"\",IFERROR(INDEX('quantities report_secondary'!$D$2:$D$10003,SMALL(IF('quantities report_secondary'!$A$2:$A$10003=L$6,ROW('quantities report_secondary'!$A$2:$A$10003)-1,\"\"),ROWS($B$8:$B13))),\"0\"))","v":""},{"$f":"IF(B13=\"\",\"\",LOOKUP(B13,'manual inputs_secondary'!$B$4:$B$22,'manual inputs_secondary'!$D$4:$D$22))","v":""},"",{"$f":"IF($B13=\"\",\"\",IFERROR(INDEX('quantities report_secondary'!$D$2:$D$10003,SMALL(IF('quantities report_secondary'!$A$2:$A$10003=O$6,ROW('quantities report_secondary'!$A$2:$A$10003)-1,\"\"),ROWS($B$8:$B13))),\"0\"))","v":""},"",null,"",{"$f":"IF($B13=\"\",\"\",IFERROR(INDEX('quantities report_secondary'!$D$2:$D$10003,SMALL(IF('quantities report_secondary'!$A$2:$A$10003=S$6,ROW('quantities report_secondary'!$A$2:$A$10003)-1,\"\"),ROWS($B$8:$B13))),\"0\"))","v":""},{"$f":"IF($B13=\"\",\"\",Backfill_secondary!H13)","v":""},{"$f":"IF($B13=\"\",\"\",IFERROR(INDEX('quantities report_secondary'!$D$2:$D$10003,SMALL(IF('quantities report_secondary'!$A$2:$A$10003=U$6,ROW('quantities report_secondary'!$A$2:$A$10003)-1,\"\"),ROWS($B$8:$B13))),\"0\"))","v":""},{"$f":"IF($B13=\"\",\"\",IFERROR(INDEX('quantities report_secondary'!$D$2:$D$10003,SMALL(IF('quantities report_secondary'!$A$2:$A$10003=V$6,ROW('quantities report_secondary'!$A$2:$A$10003)-1,\"\"),ROWS($B$8:$B13))),\"0\"))","v":""},{"$f":"IF($B13=\"\",\"\",IFERROR(INDEX('quantities report_secondary'!$D$2:$D$10003,SMALL(IF('quantities report_secondary'!$A$2:$A$10003=W$6,ROW('quantities report_secondary'!$A$2:$A$10003)-1,\"\"),ROWS($B$8:$B13))),\"0\"))","v":""},{"$f":"IF($B13=\"\",\"\",IFERROR(INDEX('quantities report_secondary'!$D$2:$D$10003,SMALL(IF('quantities report_secondary'!$A$2:$A$10003=X$6,ROW('quantities report_secondary'!$A$2:$A$10003)-1,\"\"),ROWS($B$8:$B13))),\"0\"))","v":""},{"$f":"IF($B13=\"\",\"\",Backfill_secondary!R13)","v":""},{"$f":"IF($B13=\"\",\"\",Backfill_secondary!U13)","v":""},{"$f":"IF($B13=\"\",\"\",Removals_secondary!$G10)","v":""},{"$f":"IF($B13=\"\",\"\",Removals_secondary!$L10)","v":""},{"$f":"IF($B13=\"\",\"\",IFERROR(INDEX('quantities report_secondary'!$D$2:$D$10003,SMALL(IF('quantities report_secondary'!$A$2:$A$10003=AC$6,ROW('quantities report_secondary'!$A$2:$A$10003)-1,\"\"),ROWS($B$8:$B13))),\"0\"))","v":""},{"$f":"IF($B13=\"\",\"\",IFERROR(INDEX('quantities report_secondary'!$D$2:$D$10003,SMALL(IF('quantities report_secondary'!$A$2:$A$10003=AD$6,ROW('quantities report_secondary'!$A$2:$A$10003)-1,\"\"),ROWS($B$8:$B13))),\"0\"))","v":""},{"$f":"IF($B13=\"\",\"\",IFERROR(INDEX('quantities report_secondary'!$D$2:$D$10003,SMALL(IF('quantities report_secondary'!$A$2:$A$10003=AE$6,ROW('quantities report_secondary'!$A$2:$A$10003)-1,\"\"),ROWS($B$8:$B13))),\"0\"))","v":""},{"$f":"IF($B13=\"\",\"\",IFERROR(INDEX('quantities report_secondary'!$D$2:$D$10003,SMALL(IF('quantities report_secondary'!$A$2:$A$10003=AF$6,ROW('quantities report_secondary'!$A$2:$A$10003)-1,\"\"),ROWS($B$8:$B13))),\"0\"))","v":""},{"$f":"IF($B13=\"\",\"\",IFERROR(INDEX('quantities report_secondary'!$D$2:$D$10003,SMALL(IF('quantities report_secondary'!$A$2:$A$10003=AG$6,ROW('quantities report_secondary'!$A$2:$A$10003)-1,\"\"),ROWS($B$8:$B13))),\"0\"))","v":""},{"$f":"IF($B13=\"\",\"\",IFERROR(INDEX('quantities report_secondary'!$D$2:$D$10003,SMALL(IF('quantities report_secondary'!$A$2:$A$10003=AH$6,ROW('quantities report_secondary'!$A$2:$A$10003)-1,\"\"),ROWS($B$8:$B13))),\"0\"))","v":""},"","","","","",0.9,""," "]
[null,{"$f":"IFERROR(INDEX('manual inputs_secondary'!M:M,SMALL(IF('manual inputs_secondary'!M:M<>\"\",ROW('manual inputs_secondary'!M:M)),ROW(9:9))),\"\")","v":""},{"$f":"IF(B14=\"\",\"\",IFERROR(INDEX('quantities report_secondary'!$D$2:$D$10003,SMALL(IF('quantities report_secondary'!$A$2:$A$10003=C$6,ROW('quantities report_secondary'!$A$2:$A$10003)-1,\"\"),ROWS($B$8:$B14))),\"0\"))","v":""},"",null,"",{"$f":"IF($B14=\"\",\"\",Structure_Ex_secondary!I14)","v":""},null,{"$f":"IF($B14=\"\",\"\",IFERROR(INDEX('quantities report_secondary'!$D$2:$D$10003,SMALL(IF('quantities report_secondary'!$A$2:$A$10003=I$6,ROW('quantities report_secondary'!$A$2:$A$10003)-1,\"\"),ROWS($B$8:$B14))),\"0\"))","v":""},{"$f":"IF($B14=\"\",\"\",Removals_secondary!$F11)","v":""},{"$f":"IF($B14=\"\",\"\",Removals_secondary!$K11)","v":""},{"$f":"IF($B14=\"\",\"\",IFERROR(INDEX('quantities report_secondary'!$D$2:$D$10003,SMALL(IF('quantities report_secondary'!$A$2:$A$10003=L$6,ROW('quantities report_secondary'!$A$2:$A$10003)-1,\"\"),ROWS($B$8:$B14))),\"0\"))","v":""},{"$f":"IF(B14=\"\",\"\",LOOKUP(B14,'manual inputs_secondary'!$B$4:$B$22,'manual inputs_secondary'!$D$4:$D$22))","v":""},"",{"$f":"IF($B14=\"\",\"\",IFERROR(INDEX('quantities report_secondary'!$D$2:$D$10003,SMALL(IF('quantities report_secondary'!$A$2:$A$10003=O$6,ROW('quantities report_secondary'!$A$2:$A$10003)-1,\"\"),ROWS($B$8:$B14))),\"0\"))","v":""},"",null,"",{"$f":"IF($B14=\"\",\"\",IFERROR(INDEX('quantities report_secondary'!$D$2:$D$10003,SMALL(IF('quantities report_secondary'!$A$2:$A$10003=S$6,ROW('quantities report_secondary'!$A$2:$A$10003)-1,\"\"),ROWS($B$8:$B14))),\"0\"))","v":""},{"$f":"IF($B14=\"\",\"\",Backfill_secondary!H14)","v":""},{"$f":"IF($B14=\"\",\"\",IFERROR(INDEX('quantities report_secondary'!$D$2:$D$10003,SMALL(IF('quantities report_secondary'!$A$2:$A$10003=U$6,ROW('quantities report_secondary'!$A$2:$A$10003)-1,\"\"),ROWS($B$8:$B14))),\"0\"))","v":""},{"$f":"IF($B14=\"\",\"\",IFERROR(INDEX('quantities report_secondary'!$D$2:$D$10003,SMALL(IF('quantities report_secondary'!$A$2:$A$10003=V$6,ROW('quantities report_secondary'!$A$2:$A$10003)-1,\"\"),ROWS($B$8:$B14))),\"0\"))","v":""},{"$f":"IF($B14=\"\",\"\",IFERROR(INDEX('quantities report_secondary'!$D$2:$D$10003,SMALL(IF('quantities report_secondary'!$A$2:$A$10003=W$6,ROW('quantities report_secondary'!$A$2:$A$10003)-1,\"\"),ROWS($B$8:$B14))),\"0\"))","v":""},{"$f":"IF($B14=\"\",\"\",IFERROR(INDEX('quantities report_secondary'!$D$2:$D$10003,SMALL(IF('quantities report_secondary'!$A$2:$A$10003=X$6,ROW('quantities report_secondary'!$A$2:$A$10003)-1,\"\"),ROWS($B$8:$B14))),\"0\"))","v":""},{"$f":"IF($B14=\"\",\"\",Backfill_secondary!R14)","v":""},{"$f":"IF($B14=\"\",\"\",Backfill_secondary!U14)","v":""},{"$f":"IF($B14=\"\",\"\",Removals_secondary!$G11)","v":""},{"$f":"IF($B14=\"\",\"\",Removals_secondary!$L11)","v":""},{"$f":"IF($B14=\"\",\"\",IFERROR(INDEX('quantities report_secondary'!$D$2:$D$10003,SMALL(IF('quantities report_secondary'!$A$2:$A$10003=AC$6,ROW('quantities report_secondary'!$A$2:$A$10003)-1,\"\"),ROWS($B$8:$B14))),\"0\"))","v":""},{"$f":"IF($B14=\"\",\"\",IFERROR(INDEX('quantities report_secondary'!$D$2:$D$10003,SMALL(IF('quantities report_secondary'!$A$2:$A$10003=AD$6,ROW('quantities report_secondary'!$A$2:$A$10003)-1,\"\"),ROWS($B$8:$B14))),\"0\"))","v":""},{"$f":"IF($B14=\"\",\"\",IFERROR(INDEX('quantities report_secondary'!$D$2:$D$10003,SMALL(IF('quantities report_secondary'!$A$2:$A$10003=AE$6,ROW('quantities report_secondary'!$A$2:$A$10003)-1,\"\"),ROWS($B$8:$B14))),\"0\"))","v":""},{"$f":"IF($B14=\"\",\"\",IFERROR(INDEX('quantities report_secondary'!$D$2:$D$10003,SMALL(IF('quantities report_secondary'!$A$2:$A$10003=AF$6,ROW('quantities report_secondary'!$A$2:$A$10003)-1,\"\"),ROWS($B$8:$B14))),\"0\"))","v":""},{"$f":"IF($B14=\"\",\"\",IFERROR(INDEX('quantities report_secondary'!$D$2:$D$10003,SMALL(IF('quantities report_secondary'!$A$2:$A$10003=AG$6,ROW('quantities report_secondary'!$A$2:$A$10003)-1,\"\"),ROWS($B$8:$B14))),\"0\"))","v":""},{"$f":"IF($B14=\"\",\"\",IFERROR(INDEX('quantities report_secondary'!$D$2:$D$10003,SMALL(IF('quantities report_secondary'!$A$2:$A$10003=AH$6,ROW('quantities report_secondary'!$A$2:$A$10003)-1,\"\"),ROWS($B$8:$B14))),\"0\"))","v":""},"","","","","",0.9,""," "]
[null,{"$f":"IFERROR(INDEX('manual inputs_secondary'!M:M,SMALL(IF('manual inputs_secondary'!M:M<>\"\",ROW('manual inputs_secondary'!M:M)),ROW(10:10))),\"\")","v":""},{"$f":"IF(B15=\"\",\"\",IFERROR(INDEX('quantities report_secondary'!$D$2:$D$10003,SMALL(IF('quantities report_secondary'!$A$2:$A$10003=C$6,ROW('quantities report_secondary'!$A$2:$A$10003)-1,\"\"),ROWS($B$8:$B15))),\"0\"))","v":""},"",null,"",{"$f":"IF($B15=\"\",\"\",Structure_Ex_secondary!I15)","v":""},null,{"$f":"IF($B15=\"\",\"\",IFERROR(INDEX('quantities report_secondary'!$D$2:$D$10003,SMALL(IF('quantities report_secondary'!$A$2:$A$10003=I$6,ROW('quantities report_secondary'!$A$2:$A$10003)-1,\"\"),ROWS($B$8:$B15))),\"0\"))","v":""},{"$f":"IF($B15=\"\",\"\",Removals_secondary!$F12)","v":""},{"$f":"IF($B15=\"\",\"\",Removals_secondary!$K12)","v":""},{"$f":"IF($B15=\"\",\"\",IFERROR(INDEX('quantities report_secondary'!$D$2:$D$10003,SMALL(IF('quantities report_secondary'!$A$2:$A$10003=L$6,ROW('quantities report_secondary'!$A$2:$A$10003)-1,\"\"),ROWS($B$8:$B15))),\"0\"))","v":""},{"$f":"IF(B15=\"\",\"\",LOOKUP(B15,'manual inputs_secondary'!$B$4:$B$22,'manual inputs_secondary'!$D$4:$D$22))","v":""},"",{"$f":"IF($B15=\"\",\"\",IFERROR(INDEX('quantities report_secondary'!$D$2:$D$10003,SMALL(IF('quantities report_secondary'!$A$2:$A$10003=O$6,ROW('quantities report_secondary'!$A$2:$A$10003)-1,\"\"),ROWS($B$8:$B15))),\"0\"))","v":""},"",null,"",{"$f":"IF($B15=\"\",\"\",IFERROR(INDEX('quantities report_secondary'!$D$2:$D$10003,SMALL(IF('quantities report_secondary'!$A$2:$A$10003=S$6,ROW('quantities report_secondary'!$A$2:$A$10003)-1,\"\"),ROWS($B$8:$B15))),\"0\"))","v":""},{"$f":"IF($B15=\"\",\"\",Backfill_secondary!H15)","v":""},{"$f":"IF($B15=\"\",\"\",IFERROR(INDEX('quantities report_secondary'!$D$2:$D$10003,SMALL(IF('quantities report_secondary'!$A$2:$A$10003=U$6,ROW('quantities report_secondary'!$A$2:$A$10003)-1,\"\"),ROWS($B$8:$B15))),\"0\"))","v":""},{"$f":"IF($B15=\"\",\"\",IFERROR(INDEX('quantities report_secondary'!$D$2:$D$10003,SMALL(IF('quantities report_secondary'!$A$2:$A$10003=V$6,ROW('quantities report_secondary'!$A$2:$A$10003)-1,\"\"),ROWS($B$8:$B15))),\"0\"))","v":""},{"$f":"IF($B15=\"\",\"\",IFERROR(INDEX('quantities report_secondary'!$D$2:$D$10003,SMALL(IF('quantities report_secondary'!$A$2:$A$10003=W$6,ROW('quantities report_secondary'!$A$2:$A$10003)-1,\"\"),ROWS($B$8:$B15))),\"0\"))","v":""},{"$f":"IF($B15=\"\",\"\",IFERROR(INDEX('quantities report_secondary'!$D$2:$D$10003,SMALL(IF('quantities report_secondary'!$A$2:$A$10003=X$6,ROW('quantities report_secondary'!$A$2:$A$10003)-1,\"\"),ROWS($B$8:$B15))),\"0\"))","v":""},{"$f":"IF($B15=\"\",\"\",Backfill_secondary!R15)","v":""},{"$f":"IF($B15=\"\",\"\",Backfill_secondary!U15)","v":""},{"$f":"IF($B15=\"\",\"\",Removals_secondary!$G12)","v":""},{"$f":"IF($B15=\"\",\"\",Removals_secondary!$L12)","v":""},{"$f":"IF($B15=\"\",\"\",IFERROR(INDEX('quantities report_secondary'!$D$2:$D$10003,SMALL(IF('quantities report_secondary'!$A$2:$A$10003=AC$6,ROW('quantities report_secondary'!$A$2:$A$10003)-1,\"\"),ROWS($B$8:$B15))),\"0\"))","v":""},{"$f":"IF($B15=\"\",\"\",IFERROR(INDEX('quantities report_secondary'!$D$2:$D$10003,SMALL(IF('quantities report_secondary'!$A$2:$A$10003=AD$6,ROW('quantities report_secondary'!$A$2:$A$10003)-1,\"\"),ROWS($B$8:$B15))),\"0\"))","v":""},{"$f":"IF($B15=\"\",\"\",IFERROR(INDEX('quantities report_secondary'!$D$2:$D$10003,SMALL(IF('quantities report_secondary'!$A$2:$A$10003=AE$6,ROW('quantities report_secondary'!$A$2:$A$10003)-1,\"\"),ROWS($B$8:$B15))),\"0\"))","v":""},{"$f":"IF($B15=\"\",\"\",IFERROR(INDEX('quantities report_secondary'!$D$2:$D$10003,SMALL(IF('quantities report_secondary'!$A$2:$A$10003=AF$6,ROW('quantities report_secondary'!$A$2:$A$10003)-1,\"\"),ROWS($B$8:$B15))),\"0\"))","v":""},{"$f":"IF($B15=\"\",\"\",IFERROR(INDEX('quantities report_secondary'!$D$2:$D$10003,SMALL(IF('quantities report_secondary'!$A$2:$A$10003=AG$6,ROW('quantities report_secondary'!$A$2:$A$10003)-1,\"\"),ROWS($B$8:$B15))),\"0\"))","v":""},{"$f":"IF($B15=\"\",\"\",IFERROR(INDEX('quantities report_secondary'!$D$2:$D$10003,SMALL(IF('quantities report_secondary'!$A$2:$A$10003=AH$6,ROW('quantities report_secondary'!$A$2:$A$10003)-1,\"\"),ROWS($B$8:$B15))),\"0\"))","v":""},"","","","","",0.9,""," "]
[null,{"$f":"IFERROR(INDEX('manual inputs_secondary'!M:M,SMALL(IF('manual inputs_secondary'!M:M<>\"\",ROW('manual inputs_secondary'!M:M)),ROW(11:11))),\"\")","v":""},{"$f":"IF(B16=\"\",\"\",IFERROR(INDEX('quantities report_secondary'!$D$2:$D$10003,SMALL(IF('quantities report_secondary'!$A$2:$A$10003=C$6,ROW('quantities report_secondary'!$A$2:$A$10003)-1,\"\"),ROWS($B$8:$B16))),\"0\"))","v":""},"",null,"",{"$f":"IF($B16=\"\",\"\",Structure_Ex_secondary!I16)","v":""},null,{"$f":"IF($B16=\"\",\"\",IFERROR(INDEX('quantities report_secondary'!$D$2:$D$10003,SMALL(IF('quantities report_secondary'!$A$2:$A$10003=I$6,ROW('quantities report_secondary'!$A$2:$A$10003)-1,\"\"),ROWS($B$8:$B16))),\"0\"))","v":""},{"$f":"IF($B16=\"\",\"\",Removals_secondary!$F13)","v":""},{"$f":"IF($B16=\"\",\"\",Removals_secondary!$K13)","v":""},{"$f":"IF($B16=\"\",\"\",IFERROR(INDEX('quantities report_secondary'!$D$2:$D$10003,SMALL(IF('quantities report_secondary'!$A$2:$A$10003=L$6,ROW('quantities report_secondary'!$A$2:$A$10003)-1,\"\"),ROWS($B$8:$B16))),\"0\"))","v":""},{"$f":"IF(B16=\"\",\"\",LOOKUP(B16,'manual inputs_secondary'!$B$4:$B$22,'manual inputs_secondary'!$D$4:$D$22))","v":""},"",{"$f":"IF($B16=\"\",\"\",IFERROR(INDEX('quantities report_secondary'!$D$2:$D$10003,SMALL(IF('quantities report_secondary'!$A$2:$A$10003=O$6,ROW('quantities report_secondary'!$A$2:$A$10003)-1,\"\"),ROWS($B$8:$B16))),\"0\"))","v":""},"",null,"",{"$f":"IF($B16=\"\",\"\",IFERROR(INDEX('quantities report_secondary'!$D$2:$D$10003,SMALL(IF('quantities report_secondary'!$A$2:$A$10003=S$6,ROW('quantities report_secondary'!$A$2:$A$10003)-1,\"\"),ROWS($B$8:$B16))),\"0\"))","v":""},{"$f":"IF($B16=\"\",\"\",Backfill_secondary!H16)","v":""},{"$f":"IF($B16=\"\",\"\",IFERROR(INDEX('quantities report_secondary'!$D$2:$D$10003,SMALL(IF('quantities report_secondary'!$A$2:$A$10003=U$6,ROW('quantities report_secondary'!$A$2:$A$10003)-1,\"\"),ROWS($B$8:$B16))),\"0\"))","v":""},{"$f":"IF($B16=\"\",\"\",IFERROR(INDEX('quantities report_secondary'!$D$2:$D$10003,SMALL(IF('quantities report_secondary'!$A$2:$A$10003=V$6,ROW('quantities report_secondary'!$A$2:$A$10003)-1,\"\"),ROWS($B$8:$B16))),\"0\"))","v":""},{"$f":"IF($B16=\"\",\"\",IFERROR(INDEX('quantities report_secondary'!$D$2:$D$10003,SMALL(IF('quantities report_secondary'!$A$2:$A$10003=W$6,ROW('quantities report_secondary'!$A$2:$A$10003)-1,\"\"),ROWS($B$8:$B16))),\"0\"))","v":""},{"$f":"IF($B16=\"\",\"\",IFERROR(INDEX('quantities report_secondary'!$D$2:$D$10003,SMALL(IF('quantities report_secondary'!$A$2:$A$10003=X$6,ROW('quantities report_secondary'!$A$2:$A$10003)-1,\"\"),ROWS($B$8:$B16))),\"0\"))","v":""},{"$f":"IF($B16=\"\",\"\",Backfill_secondary!R16)","v":""},{"$f":"IF($B16=\"\",\"\",Backfill_secondary!U16)","v":""},{"$f":"IF($B16=\"\",\"\",Removals_secondary!$G13)","v":""},{"$f":"IF($B16=\"\",\"\",Removals_secondary!$L13)","v":""},{"$f":"IF($B16=\"\",\"\",IFERROR(INDEX('quantities report_secondary'!$D$2:$D$10003,SMALL(IF('quantities report_secondary'!$A$2:$A$10003=AC$6,ROW('quantities report_secondary'!$A$2:$A$10003)-1,\"\"),ROWS($B$8:$B16))),\"0\"))","v":""},{"$f":"IF($B16=\"\",\"\",IFERROR(INDEX('quantities report_secondary'!$D$2:$D$10003,SMALL(IF('quantities report_secondary'!$A$2:$A$10003=AD$6,ROW('quantities report_secondary'!$A$2:$A$10003)-1,\"\"),ROWS($B$8:$B16))),\"0\"))","v":""},{"$f":"IF($B16=\"\",\"\",IFERROR(INDEX('quantities report_secondary'!$D$2:$D$10003,SMALL(IF('quantities report_secondary'!$A$2:$A$10003=AE$6,ROW('quantities report_secondary'!$A$2:$A$10003)-1,\"\"),ROWS($B$8:$B16))),\"0\"))","v":""},{"$f":"IF($B16=\"\",\"\",IFERROR(INDEX('quantities report_secondary'!$D$2:$D$10003,SMALL(IF('quantities report_secondary'!$A$2:$A$10003=AF$6,ROW('quantities report_secondary'!$A$2:$A$10003)-1,\"\"),ROWS($B$8:$B16))),\"0\"))","v":""},{"$f":"IF($B16=\"\",\"\",IFERROR(INDEX('quantities report_secondary'!$D$2:$D$10003,SMALL(IF('quantities report_secondary'!$A$2:$A$10003=AG$6,ROW('quantities report_secondary'!$A$2:$A$10003)-1,\"\"),ROWS($B$8:$B16))),\"0\"))","v":""},{"$f":"IF($B16=\"\",\"\",IFERROR(INDEX('quantities report_secondary'!$D$2:$D$10003,SMALL(IF('quantities report_secondary'!$A$2:$A$10003=AH$6,ROW('quantities report_secondary'!$A$2:$A$10003)-1,\"\"),ROWS($B$8:$B16))),\"0\"))","v":""},"","","","","",0.9,""," "]
[null,{"$f":"IFERROR(INDEX('manual inputs_secondary'!M:M,SMALL(IF('manual inputs_secondary'!M:M<>\"\",ROW('manual inputs_secondary'!M:M)),ROW(12:12))),\"\")","v":""},{"$f":"IF(B17=\"\",\"\",IFERROR(INDEX('quantities report_secondary'!$D$2:$D$10003,SMALL(IF('quantities report_secondary'!$A$2:$A$10003=C$6,ROW('quantities report_secondary'!$A$2:$A$10003)-1,\"\"),ROWS($B$8:$B17))),\"0\"))","v":""},"",null,"",{"$f":"IF($B17=\"\",\"\",Structure_Ex_secondary!I17)","v":""},null,{"$f":"IF($B17=\"\",\"\",IFERROR(INDEX('quantities report_secondary'!$D$2:$D$10003,SMALL(IF('quantities report_secondary'!$A$2:$A$10003=I$6,ROW('quantities report_secondary'!$A$2:$A$10003)-1,\"\"),ROWS($B$8:$B17))),\"0\"))","v":""},{"$f":"IF($B17=\"\",\"\",Removals_secondary!$F14)","v":""},{"$f":"IF($B17=\"\",\"\",Removals_secondary!$K14)","v":""},{"$f":"IF($B17=\"\",\"\",IFERROR(INDEX('quantities report_secondary'!$D$2:$D$10003,SMALL(IF('quantities report_secondary'!$A$2:$A$10003=L$6,ROW('quantities report_secondary'!$A$2:$A$10003)-1,\"\"),ROWS($B$8:$B17))),\"0\"))","v":""},{"$f":"IF(B17=\"\",\"\",LOOKUP(B17,'manual inputs_secondary'!$B$4:$B$22,'manual inputs_secondary'!$D$4:$D$22))","v":""},"",{"$f":"IF($B17=\"\",\"\",IFERROR(INDEX('quantities report_secondary'!$D$2:$D$10003,SMALL(IF('quantities report_secondary'!$A$2:$A$10003=O$6,ROW('quantities report_secondary'!$A$2:$A$10003)-1,\"\"),ROWS($B$8:$B17))),\"0\"))","v":""},"",null,"",{"$f":"IF($B17=\"\",\"\",IFERROR(INDEX('quantities report_secondary'!$D$2:$D$10003,SMALL(IF('quantities report_secondary'!$A$2:$A$10003=S$6,ROW('quantities report_secondary'!$A$2:$A$10003)-1,\"\"),ROWS($B$8:$B17))),\"0\"))","v":""},{"$f":"IF($B17=\"\",\"\",Backfill_secondary!H17)","v":""},{"$f":"IF($B17=\"\",\"\",IFERROR(INDEX('quantities report_secondary'!$D$2:$D$10003,SMALL(IF('quantities report_secondary'!$A$2:$A$10003=U$6,ROW('quantities report_secondary'!$A$2:$A$10003)-1,\"\"),ROWS($B$8:$B17))),\"0\"))","v":""},{"$f":"IF($B17=\"\",\"\",IFERROR(INDEX('quantities report_secondary'!$D$2:$D$10003,SMALL(IF('quantities report_secondary'!$A$2:$A$10003=V$6,ROW('quantities report_secondary'!$A$2:$A$10003)-1,\"\"),ROWS($B$8:$B17))),\"0\"))","v":""},{"$f":"IF($B17=\"\",\"\",IFERROR(INDEX('quantities report_secondary'!$D$2:$D$10003,SMALL(IF('quantities report_secondary'!$A$2:$A$10003=W$6,ROW('quantities report_secondary'!$A$2:$A$10003)-1,\"\"),ROWS($B$8:$B17))),\"0\"))","v":""},{"$f":"IF($B17=\"\",\"\",IFERROR(INDEX('quantities report_secondary'!$D$2:$D$10003,SMALL(IF('quantities report_secondary'!$A$2:$A$10003=X$6,ROW('quantities report_secondary'!$A$2:$A$10003)-1,\"\"),ROWS($B$8:$B17))),\"0\"))","v":""},{"$f":"IF($B17=\"\",\"\",Backfill_secondary!R17)","v":""},{"$f":"IF($B17=\"\",\"\",Backfill_secondary!U17)","v":""},{"$f":"IF($B17=\"\",\"\",Removals_secondary!$G14)","v":""},{"$f":"IF($B17=\"\",\"\",Removals_secondary!$L14)","v":""},{"$f":"IF($B17=\"\",\"\",IFERROR(INDEX('quantities report_secondary'!$D$2:$D$10003,SMALL(IF('quantities report_secondary'!$A$2:$A$10003=AC$6,ROW('quantities report_secondary'!$A$2:$A$10003)-1,\"\"),ROWS($B$8:$B17))),\"0\"))","v":""},{"$f":"IF($B17=\"\",\"\",IFERROR(INDEX('quantities report_secondary'!$D$2:$D$10003,SMALL(IF('quantities report_secondary'!$A$2:$A$10003=AD$6,ROW('quantities report_secondary'!$A$2:$A$10003)-1,\"\"),ROWS($B$8:$B17))),\"0\"))","v":""},{"$f":"IF($B17=\"\",\"\",IFERROR(INDEX('quantities report_secondary'!$D$2:$D$10003,SMALL(IF('quantities report_secondary'!$A$2:$A$10003=AE$6,ROW('quantities report_secondary'!$A$2:$A$10003)-1,\"\"),ROWS($B$8:$B17))),\"0\"))","v":""},{"$f":"IF($B17=\"\",\"\",IFERROR(INDEX('quantities report_secondary'!$D$2:$D$10003,SMALL(IF('quantities report_secondary'!$A$2:$A$10003=AF$6,ROW('quantities report_secondary'!$A$2:$A$10003)-1,\"\"),ROWS($B$8:$B17))),\"0\"))","v":""},{"$f":"IF($B17=\"\",\"\",IFERROR(INDEX('quantities report_secondary'!$D$2:$D$10003,SMALL(IF('quantities report_secondary'!$A$2:$A$10003=AG$6,ROW('quantities report_secondary'!$A$2:$A$10003)-1,\"\"),ROWS($B$8:$B17))),\"0\"))","v":""},{"$f":"IF($B17=\"\",\"\",IFERROR(INDEX('quantities report_secondary'!$D$2:$D$10003,SMALL(IF('quantities report_secondary'!$A$2:$A$10003=AH$6,ROW('quantities report_secondary'!$A$2:$A$10003)-1,\"\"),ROWS($B$8:$B17))),\"0\"))","v":""},"","","","","",0.9,""," "]
[null,{"$f":"IFERROR(INDEX('manual inputs_secondary'!M:M,SMALL(IF('manual inputs_secondary'!M:M<>\"\",ROW('manual inputs_secondary'!M:M)),ROW(13:13))),\"\")","v":""},{"$f":"IF(B18=\"\",\"\",IFERROR(INDEX('quantities report_secondary'!$D$2:$D$10003,SMALL(IF('quantities report_secondary'!$A$2:$A$10003=C$6,ROW('quantities report_secondary'!$A$2:$A$10003)-1,\"\"),ROWS($B$8:$B18))),\"0\"))","v":""},"",null,"",{"$f":"IF($B18=\"\",\"\",Structure_Ex_secondary!I18)","v":""},null,{"$f":"IF($B18=\"\",\"\",IFERROR(INDEX('quantities report_secondary'!$D$2:$D$10003,SMALL(IF('quantities report_secondary'!$A$2:$A$10003=I$6,ROW('quantities report_secondary'!$A$2:$A$10003)-1,\"\"),ROWS($B$8:$B18))),\"0\"))","v":""},{"$f":"IF($B18=\"\",\"\",Removals_secondary!$F15)","v":""},{"$f":"IF($B18=\"\",\"\",Removals_secondary!$K15)","v":""},{"$f":"IF($B18=\"\",\"\",IFERROR(INDEX('quantities report_secondary'!$D$2:$D$10003,SMALL(IF('quantities report_secondary'!$A$2:$A$10003=L$6,ROW('quantities report_secondary'!$A$2:$A$10003)-1,\"\"),ROWS($B$8:$B18))),\"0\"))","v":""},{"$f":"IF(B18=\"\",\"\",LOOKUP(B18,'manual inputs_secondary'!$B$4:$B$22,'manual inputs_secondary'!$D$4:$D$22))","v":""},"",{"$f":"IF($B18=\"\",\"\",IFERROR(INDEX('quantities report_secondary'!$D$2:$D$10003,SMALL(IF('quantities report_secondary'!$A$2:$A$10003=O$6,ROW('quantities report_secondary'!$A$2:$A$10003)-1,\"\"),ROWS($B$8:$B18))),\"0\"))","v":""},"",null,"",{"$f":"IF($B18=\"\",\"\",IFERROR(INDEX('quantities report_secondary'!$D$2:$D$10003,SMALL(IF('quantities report_secondary'!$A$2:$A$10003=S$6,ROW('quantities report_secondary'!$A$2:$A$10003)-1,\"\"),ROWS($B$8:$B18))),\"0\"))","v":""},{"$f":"IF($B18=\"\",\"\",Backfill_secondary!H18)","v":""},{"$f":"IF($B18=\"\",\"\",IFERROR(INDEX('quantities report_secondary'!$D$2:$D$10003,SMALL(IF('quantities report_secondary'!$A$2:$A$10003=U$6,ROW('quantities report_secondary'!$A$2:$A$10003)-1,\"\"),ROWS($B$8:$B18))),\"0\"))","v":""},{"$f":"IF($B18=\"\",\"\",IFERROR(INDEX('quantities report_secondary'!$D$2:$D$10003,SMALL(IF('quantities report_secondary'!$A$2:$A$10003=V$6,ROW('quantities report_secondary'!$A$2:$A$10003)-1,\"\"),ROWS($B$8:$B18))),\"0\"))","v":""},{"$f":"IF($B18=\"\",\"\",IFERROR(INDEX('quantities report_secondary'!$D$2:$D$10003,SMALL(IF('quantities report_secondary'!$A$2:$A$10003=W$6,ROW('quantities report_secondary'!$A$2:$A$10003)-1,\"\"),ROWS($B$8:$B18))),\"0\"))","v":""},{"$f":"IF($B18=\"\",\"\",IFERROR(INDEX('quantities report_secondary'!$D$2:$D$10003,SMALL(IF('quantities report_secondary'!$A$2:$A$10003=X$6,ROW('quantities report_secondary'!$A$2:$A$10003)-1,\"\"),ROWS($B$8:$B18))),\"0\"))","v":""},{"$f":"IF($B18=\"\",\"\",Backfill_secondary!R18)","v":""},{"$f":"IF($B18=\"\",\"\",Backfill_secondary!U18)","v":""},{"$f":"IF($B18=\"\",\"\",Removals_secondary!$G15)","v":""},{"$f":"IF($B18=\"\",\"\",Removals_secondary!$L15)","v":""},{"$f":"IF($B18=\"\",\"\",IFERROR(INDEX('quantities report_secondary'!$D$2:$D$10003,SMALL(IF('quantities report_secondary'!$A$2:$A$10003=AC$6,ROW('quantities report_secondary'!$A$2:$A$10003)-1,\"\"),ROWS($B$8:$B18))),\"0\"))","v":""},{"$f":"IF($B18=\"\",\"\",IFERROR(INDEX('quantities report_secondary'!$D$2:$D$10003,SMALL(IF('quantities report_secondary'!$A$2:$A$10003=AD$6,ROW('quantities report_secondary'!$A$2:$A$10003)-1,\"\"),ROWS($B$8:$B18))),\"0\"))","v":""},{"$f":"IF($B18=\"\",\"\",IFERROR(INDEX('quantities report_secondary'!$D$2:$D$10003,SMALL(IF('quantities report_secondary'!$A$2:$A$10003=AE$6,ROW('quantities report_secondary'!$A$2:$A$10003)-1,\"\"),ROWS($B$8:$B18))),\"0\"))","v":""},{"$f":"IF($B18=\"\",\"\",IFERROR(INDEX('quantities report_secondary'!$D$2:$D$10003,SMALL(IF('quantities report_secondary'!$A$2:$A$10003=AF$6,ROW('quantities report_secondary'!$A$2:$A$10003)-1,\"\"),ROWS($B$8:$B18))),\"0\"))","v":""},{"$f":"IF($B18=\"\",\"\",IFERROR(INDEX('quantities report_secondary'!$D$2:$D$10003,SMALL(IF('quantities report_secondary'!$A$2:$A$10003=AG$6,ROW('quantities report_secondary'!$A$2:$A$10003)-1,\"\"),ROWS($B$8:$B18))),\"0\"))","v":""},{"$f":"IF($B18=\"\",\"\",IFERROR(INDEX('quantities report_secondary'!$D$2:$D$10003,SMALL(IF('quantities report_secondary'!$A$2:$A$10003=AH$6,ROW('quantities report_secondary'!$A$2:$A$10003)-1,\"\"),ROWS($B$8:$B18))),\"0\"))","v":""},"","","","","",0.9,""," "]
[null,{"$f":"IFERROR(INDEX('manual inputs_secondary'!M:M,SMALL(IF('manual inputs_secondary'!M:M<>\"\",ROW('manual inputs_secondary'!M:M)),ROW(14:14))),\"\")","v":""},{"$f":"IF(B19=\"\",\"\",IFERROR(INDEX('quantities report_secondary'!$D$2:$D$10003,SMALL(IF('quantities report_secondary'!$A$2:$A$10003=C$6,ROW('quantities report_secondary'!$A$2:$A$10003)-1,\"\"),ROWS($B$8:$B19))),\"0\"))","v":""},"",null,"",{"$f":"IF($B19=\"\",\"\",Structure_Ex_secondary!I19)","v":""},null,{"$f":"IF($B19=\"\",\"\",IFERROR(INDEX('quantities report_secondary'!$D$2:$D$10003,SMALL(IF('quantities report_secondary'!$A$2:$A$10003=I$6,ROW('quantities report_secondary'!$A$2:$A$10003)-1,\"\"),ROWS($B$8:$B19))),\"0\"))","v":""},{"$f":"IF($B19=\"\",\"\",Removals_secondary!$F16)","v":""},{"$f":"IF($B19=\"\",\"\",Removals_secondary!$K16)","v":""},{"$f":"IF($B19=\"\",\"\",IFERROR(INDEX('quantities report_secondary'!$D$2:$D$10003,SMALL(IF('quantities report_secondary'!$A$2:$A$10003=L$6,ROW('quantities report_secondary'!$A$2:$A$10003)-1,\"\"),ROWS($B$8:$B19))),\"0\"))","v":""},{"$f":"IF(B19=\"\",\"\",LOOKUP(B19,'manual inputs_secondary'!$B$4:$B$22,'manual inputs_secondary'!$D$4:$D$22))","v":""},"",{"$f":"IF($B19=\"\",\"\",IFERROR(INDEX('quantities report_secondary'!$D$2:$D$10003,SMALL(IF('quantities report_secondary'!$A$2:$A$10003=O$6,ROW('quantities report_secondary'!$A$2:$A$10003)-1,\"\"),ROWS($B$8:$B19))),\"0\"))","v":""},"",null,"",{"$f":"IF($B19=\"\",\"\",IFERROR(INDEX('quantities report_secondary'!$D$2:$D$10003,SMALL(IF('quantities report_secondary'!$A$2:$A$10003=S$6,ROW('quantities report_secondary'!$A$2:$A$10003)-1,\"\"),ROWS($B$8:$B19))),\"0\"))","v":""},{"$f":"IF($B19=\"\",\"\",Backfill_secondary!H19)","v":""},{"$f":"IF($B19=\"\",\"\",IFERROR(INDEX('quantities report_secondary'!$D$2:$D$10003,SMALL(IF('quantities report_secondary'!$A$2:$A$10003=U$6,ROW('quantities report_secondary'!$A$2:$A$10003)-1,\"\"),ROWS($B$8:$B19))),\"0\"))","v":""},{"$f":"IF($B19=\"\",\"\",IFERROR(INDEX('quantities report_secondary'!$D$2:$D$10003,SMALL(IF('quantities report_secondary'!$A$2:$A$10003=V$6,ROW('quantities report_secondary'!$A$2:$A$10003)-1,\"\"),ROWS($B$8:$B19))),\"0\"))","v":""},{"$f":"IF($B19=\"\",\"\",IFERROR(INDEX('quantities report_secondary'!$D$2:$D$10003,SMALL(IF('quantities report_secondary'!$A$2:$A$10003=W$6,ROW('quantities report_secondary'!$A$2:$A$10003)-1,\"\"),ROWS($B$8:$B19))),\"0\"))","v":""},{"$f":"IF($B19=\"\",\"\",IFERROR(INDEX('quantities report_secondary'!$D$2:$D$10003,SMALL(IF('quantities report_secondary'!$A$2:$A$10003=X$6,ROW('quantities report_secondary'!$A$2:$A$10003)-1,\"\"),ROWS($B$8:$B19))),\"0\"))","v":""},{"$f":"IF($B19=\"\",\"\",Backfill_secondary!R19)","v":""},{"$f":"IF($B19=\"\",\"\",Backfill_secondary!U19)","v":""},{"$f":"IF($B19=\"\",\"\",Removals_secondary!$G16)","v":""},{"$f":"IF($B19=\"\",\"\",Removals_secondary!$L16)","v":""},{"$f":"IF($B19=\"\",\"\",IFERROR(INDEX('quantities report_secondary'!$D$2:$D$10003,SMALL(IF('quantities report_secondary'!$A$2:$A$10003=AC$6,ROW('quantities report_secondary'!$A$2:$A$10003)-1,\"\"),ROWS($B$8:$B19))),\"0\"))","v":""},{"$f":"IF($B19=\"\",\"\",IFERROR(INDEX('quantities report_secondary'!$D$2:$D$10003,SMALL(IF('quantities report_secondary'!$A$2:$A$10003=AD$6,ROW('quantities report_secondary'!$A$2:$A$10003)-1,\"\"),ROWS($B$8:$B19))),\"0\"))","v":""},{"$f":"IF($B19=\"\",\"\",IFERROR(INDEX('quantities report_secondary'!$D$2:$D$10003,SMALL(IF('quantities report_secondary'!$A$2:$A$10003=AE$6,ROW('quantities report_secondary'!$A$2:$A$10003)-1,\"\"),ROWS($B$8:$B19))),\"0\"))","v":""},{"$f":"IF($B19=\"\",\"\",IFERROR(INDEX('quantities report_secondary'!$D$2:$D$10003,SMALL(IF('quantities report_secondary'!$A$2:$A$10003=AF$6,ROW('quantities report_secondary'!$A$2:$A$10003)-1,\"\"),ROWS($B$8:$B19))),\"0\"))","v":""},{"$f":"IF($B19=\"\",\"\",IFERROR(INDEX('quantities report_secondary'!$D$2:$D$10003,SMALL(IF('quantities report_secondary'!$A$2:$A$10003=AG$6,ROW('quantities report_secondary'!$A$2:$A$10003)-1,\"\"),ROWS($B$8:$B19))),\"0\"))","v":""},{"$f":"IF($B19=\"\",\"\",IFERROR(INDEX('quantities report_secondary'!$D$2:$D$10003,SMALL(IF('quantities report_secondary'!$A$2:$A$10003=AH$6,ROW('quantities report_secondary'!$A$2:$A$10003)-1,\"\"),ROWS($B$8:$B19))),\"0\"))","v":""},"","","","","",0.9,""," "]
[null,{"$f":"IFERROR(INDEX('manual inputs_secondary'!M:M,SMALL(IF('manual inputs_secondary'!M:M<>\"\",ROW('manual inputs_secondary'!M:M)),ROW(15:15))),\"\")","v":""},{"$f":"IF(B20=\"\",\"\",IFERROR(INDEX('quantities report_secondary'!$D$2:$D$10003,SMALL(IF('quantities report_secondary'!$A$2:$A$10003=C$6,ROW('quantities report_secondary'!$A$2:$A$10003)-1,\"\"),ROWS($B$8:$B20))),\"0\"))","v":""},"",null,"",{"$f":"IF($B20=\"\",\"\",Structure_Ex_secondary!I20)","v":""},null,{"$f":"IF($B20=\"\",\"\",IFERROR(INDEX('quantities report_secondary'!$D$2:$D$10003,SMALL(IF('quantities report_secondary'!$A$2:$A$10003=I$6,ROW('quantities report_secondary'!$A$2:$A$10003)-1,\"\"),ROWS($B$8:$B20))),\"0\"))","v":""},{"$f":"IF($B20=\"\",\"\",Removals_secondary!$F17)","v":""},{"$f":"IF($B20=\"\",\"\",Removals_secondary!$K17)","v":""},{"$f":"IF($B20=\"\",\"\",IFERROR(INDEX('quantities report_secondary'!$D$2:$D$10003,SMALL(IF('quantities report_secondary'!$A$2:$A$10003=L$6,ROW('quantities report_secondary'!$A$2:$A$10003)-1,\"\"),ROWS($B$8:$B20))),\"0\"))","v":""},{"$f":"IF(B20=\"\",\"\",LOOKUP(B20,'manual inputs_secondary'!$B$4:$B$22,'manual inputs_secondary'!$D$4:$D$22))","v":""},"",{"$f":"IF($B20=\"\",\"\",IFERROR(INDEX('quantities report_secondary'!$D$2:$D$10003,SMALL(IF('quantities report_secondary'!$A$2:$A$10003=O$6,ROW('quantities report_secondary'!$A$2:$A$10003)-1,\"\"),ROWS($B$8:$B20))),\"0\"))","v":""},"",null,"",{"$f":"IF($B20=\"\",\"\",IFERROR(INDEX('quantities report_secondary'!$D$2:$D$10003,SMALL(IF('quantities report_secondary'!$A$2:$A$10003=S$6,ROW('quantities report_secondary'!$A$2:$A$10003)-1,\"\"),ROWS($B$8:$B20))),\"0\"))","v":""},{"$f":"IF($B20=\"\",\"\",Backfill_secondary!H20)","v":""},{"$f":"IF($B20=\"\",\"\",IFERROR(INDEX('quantities report_secondary'!$D$2:$D$10003,SMALL(IF('quantities report_secondary'!$A$2:$A$10003=U$6,ROW('quantities report_secondary'!$A$2:$A$10003)-1,\"\"),ROWS($B$8:$B20))),\"0\"))","v":""},{"$f":"IF($B20=\"\",\"\",IFERROR(INDEX('quantities report_secondary'!$D$2:$D$10003,SMALL(IF('quantities report_secondary'!$A$2:$A$10003=V$6,ROW('quantities report_secondary'!$A$2:$A$10003)-1,\"\"),ROWS($B$8:$B20))),\"0\"))","v":""},{"$f":"IF($B20=\"\",\"\",IFERROR(INDEX('quantities report_secondary'!$D$2:$D$10003,SMALL(IF('quantities report_secondary'!$A$2:$A$10003=W$6,ROW('quantities report_secondary'!$A$2:$A$10003)-1,\"\"),ROWS($B$8:$B20))),\"0\"))","v":""},{"$f":"IF($B20=\"\",\"\",IFERROR(INDEX('quantities report_secondary'!$D$2:$D$10003,SMALL(IF('quantities report_secondary'!$A$2:$A$10003=X$6,ROW('quantities report_secondary'!$A$2:$A$10003)-1,\"\"),ROWS($B$8:$B20))),\"0\"))","v":""},{"$f":"IF($B20=\"\",\"\",Backfill_secondary!R20)","v":""},{"$f":"IF($B20=\"\",\"\",Backfill_secondary!U20)","v":""},{"$f":"IF($B20=\"\",\"\",Removals_secondary!$G17)","v":""},{"$f":"IF($B20=\"\",\"\",Removals_secondary!$L17)","v":""},{"$f":"IF($B20=\"\",\"\",IFERROR(INDEX('quantities report_secondary'!$D$2:$D$10003,SMALL(IF('quantities report_secondary'!$A$2:$A$10003=AC$6,ROW('quantities report_secondary'!$A$2:$A$10003)-1,\"\"),ROWS($B$8:$B20))),\"0\"))","v":""},{"$f":"IF($B20=\"\",\"\",IFERROR(INDEX('quantities report_secondary'!$D$2:$D$10003,SMALL(IF('quantities report_secondary'!$A$2:$A$10003=AD$6,ROW('quantities report_secondary'!$A$2:$A$10003)-1,\"\"),ROWS($B$8:$B20))),\"0\"))","v":""},{"$f":"IF($B20=\"\",\"\",IFERROR(INDEX('quantities report_secondary'!$D$2:$D$10003,SMALL(IF('quantities report_secondary'!$A$2:$A$10003=AE$6,ROW('quantities report_secondary'!$A$2:$A$10003)-1,\"\"),ROWS($B$8:$B20))),\"0\"))","v":""},{"$f":"IF($B20=\"\",\"\",IFERROR(INDEX('quantities report_secondary'!$D$2:$D$10003,SMALL(IF('quantities report_secondary'!$A$2:$A$10003=AF$6,ROW('quantities report_secondary'!$A$2:$A$10003)-1,\"\"),ROWS($B$8:$B20))),\"0\"))","v":""},{"$f":"IF($B20=\"\",\"\",IFERROR(INDEX('quantities report_secondary'!$D$2:$D$10003,SMALL(IF('quantities report_secondary'!$A$2:$A$10003=AG$6,ROW('quantities report_secondary'!$A$2:$A$10003)-1,\"\"),ROWS($B$8:$B20))),\"0\"))","v":""},{"$f":"IF($B20=\"\",\"\",IFERROR(INDEX('quantities report_secondary'!$D$2:$D$10003,SMALL(IF('quantities report_secondary'!$A$2:$A$10003=AH$6,ROW('quantities report_secondary'!$A$2:$A$10003)-1,\"\"),ROWS($B$8:$B20))),\"0\"))","v":""},"","","","","",0.9,""," "]
[null,{"$f":"IFERROR(INDEX('manual inputs_secondary'!M:M,SMALL(IF('manual inputs_secondary'!M:M<>\"\",ROW('manual inputs_secondary'!M:M)),ROW(16:16))),\"\")","v":""},{"$f":"IF(B21=\"\",\"\",IFERROR(INDEX('quantities report_secondary'!$D$2:$D$10003,SMALL(IF('quantities report_secondary'!$A$2:$A$10003=C$6,ROW('quantities report_secondary'!$A$2:$A$10003)-1,\"\"),ROWS($B$8:$B21))),\"0\"))","v":""},"",null,"",{"$f":"IF($B21=\"\",\"\",Structure_Ex_secondary!I21)","v":""},null,{"$f":"IF($B21=\"\",\"\",IFERROR(INDEX('quantities report_secondary'!$D$2:$D$10003,SMALL(IF('quantities report_secondary'!$A$2:$A$10003=I$6,ROW('quantities report_secondary'!$A$2:$A$10003)-1,\"\"),ROWS($B$8:$B21))),\"0\"))","v":""},{"$f":"IF($B21=\"\",\"\",Removals_secondary!$F18)","v":""},{"$f":"IF($B21=\"\",\"\",Removals_secondary!$K18)","v":""},{"$f":"IF($B21=\"\",\"\",IFERROR(INDEX('quantities report_secondary'!$D$2:$D$10003,SMALL(IF('quantities report_secondary'!$A$2:$A$10003=L$6,ROW('quantities report_secondary'!$A$2:$A$10003)-1,\"\"),ROWS($B$8:$B21))),\"0\"))","v":""},{"$f":"IF(B21=\"\",\"\",LOOKUP(B21,'manual inputs_secondary'!$B$4:$B$22,'manual inputs_secondary'!$D$4:$D$22))","v":""},"",{"$f":"IF($B21=\"\",\"\",IFERROR(INDEX('quantities report_secondary'!$D$2:$D$10003,SMALL(IF('quantities report_secondary'!$A$2:$A$10003=O$6,ROW('quantities report_secondary'!$A$2:$A$10003)-1,\"\"),ROWS($B$8:$B21))),\"0\"))","v":""},"",null,"",{"$f":"IF($B21=\"\",\"\",IFERROR(INDEX('quantities report_secondary'!$D$2:$D$10003,SMALL(IF('quantities report_secondary'!$A$2:$A$10003=S$6,ROW('quantities report_secondary'!$A$2:$A$10003)-1,\"\"),ROWS($B$8:$B21))),\"0\"))","v":""},{"$f":"IF($B21=\"\",\"\",Backfill_secondary!H21)","v":""},{"$f":"IF($B21=\"\",\"\",IFERROR(INDEX('quantities report_secondary'!$D$2:$D$10003,SMALL(IF('quantities report_secondary'!$A$2:$A$10003=U$6,ROW('quantities report_secondary'!$A$2:$A$10003)-1,\"\"),ROWS($B$8:$B21))),\"0\"))","v":""},{"$f":"IF($B21=\"\",\"\",IFERROR(INDEX('quantities report_secondary'!$D$2:$D$10003,SMALL(IF('quantities report_secondary'!$A$2:$A$10003=V$6,ROW('quantities report_secondary'!$A$2:$A$10003)-1,\"\"),ROWS($B$8:$B21))),\"0\"))","v":""},{"$f":"IF($B21=\"\",\"\",IFERROR(INDEX('quantities report_secondary'!$D$2:$D$10003,SMALL(IF('quantities report_secondary'!$A$2:$A$10003=W$6,ROW('quantities report_secondary'!$A$2:$A$10003)-1,\"\"),ROWS($B$8:$B21))),\"0\"))","v":""},{"$f":"IF($B21=\"\",\"\",IFERROR(INDEX('quantities report_secondary'!$D$2:$D$10003,SMALL(IF('quantities report_secondary'!$A$2:$A$10003=X$6,ROW('quantities report_secondary'!$A$2:$A$10003)-1,\"\"),ROWS($B$8:$B21))),\"0\"))","v":""},{"$f":"IF($B21=\"\",\"\",Backfill_secondary!R21)","v":""},{"$f":"IF($B21=\"\",\"\",Backfill_secondary!U21)","v":""},{"$f":"IF($B21=\"\",\"\",Removals_secondary!$G18)","v":""},{"$f":"IF($B21=\"\",\"\",Removals_secondary!$L18)","v":""},{"$f":"IF($B21=\"\",\"\",IFERROR(INDEX('quantities report_secondary'!$D$2:$D$10003,SMALL(IF('quantities report_secondary'!$A$2:$A$10003=AC$6,ROW('quantities report_secondary'!$A$2:$A$10003)-1,\"\"),ROWS($B$8:$B21))),\"0\"))","v":""},{"$f":"IF($B21=\"\",\"\",IFERROR(INDEX('quantities report_secondary'!$D$2:$D$10003,SMALL(IF('quantities report_secondary'!$A$2:$A$10003=AD$6,ROW('quantities report_secondary'!$A$2:$A$10003)-1,\"\"),ROWS($B$8:$B21))),\"0\"))","v":""},{"$f":"IF($B21=\"\",\"\",IFERROR(INDEX('quantities report_secondary'!$D$2:$D$10003,SMALL(IF('quantities report_secondary'!$A$2:$A$10003=AE$6,ROW('quantities report_secondary'!$A$2:$A$10003)-1,\"\"),ROWS($B$8:$B21))),\"0\"))","v":""},{"$f":"IF($B21=\"\",\"\",IFERROR(INDEX('quantities report_secondary'!$D$2:$D$10003,SMALL(IF('quantities report_secondary'!$A$2:$A$10003=AF$6,ROW('quantities report_secondary'!$A$2:$A$10003)-1,\"\"),ROWS($B$8:$B21))),\"0\"))","v":""},{"$f":"IF($B21=\"\",\"\",IFERROR(INDEX('quantities report_secondary'!$D$2:$D$10003,SMALL(IF('quantities report_secondary'!$A$2:$A$10003=AG$6,ROW('quantities report_secondary'!$A$2:$A$10003)-1,\"\"),ROWS($B$8:$B21))),\"0\"))","v":""},{"$f":"IF($B21=\"\",\"\",IFERROR(INDEX('quantities report_secondary'!$D$2:$D$10003,SMALL(IF('quantities report_secondary'!$A$2:$A$10003=AH$6,ROW('quantities report_secondary'!$A$2:$A$10003)-1,\"\"),ROWS($B$8:$B21))),\"0\"))","v":""},"","","","","",0.9,""," "]
[null,{"$f":"IFERROR(INDEX('manual inputs_secondary'!M:M,SMALL(IF('manual inputs_secondary'!M:M<>\"\",ROW('manual inputs_secondary'!M:M)),ROW(17:17))),\"\")","v":""},{"$f":"IF(B22=\"\",\"\",IFERROR(INDEX('quantities report_secondary'!$D$2:$D$10003,SMALL(IF('quantities report_secondary'!$A$2:$A$10003=C$6,ROW('quantities report_secondary'!$A$2:$A$10003)-1,\"\"),ROWS($B$8:$B22))),\"0\"))","v":""},"",null,"",{"$f":"IF($B22=\"\",\"\",Structure_Ex_secondary!I22)","v":""},null,{"$f":"IF($B22=\"\",\"\",IFERROR(INDEX('quantities report_secondary'!$D$2:$D$10003,SMALL(IF('quantities report_secondary'!$A$2:$A$10003=I$6,ROW('quantities report_secondary'!$A$2:$A$10003)-1,\"\"),ROWS($B$8:$B22))),\"0\"))","v":""},{"$f":"IF($B22=\"\",\"\",Removals_secondary!$F19)","v":""},{"$f":"IF($B22=\"\",\"\",Removals_secondary!$K19)","v":""},{"$f":"IF($B22=\"\",\"\",IFERROR(INDEX('quantities report_secondary'!$D$2:$D$10003,SMALL(IF('quantities report_secondary'!$A$2:$A$10003=L$6,ROW('quantities report_secondary'!$A$2:$A$10003)-1,\"\"),ROWS($B$8:$B22))),\"0\"))","v":""},{"$f":"IF(B22=\"\",\"\",LOOKUP(B22,'manual inputs_secondary'!$B$4:$B$22,'manual inputs_secondary'!$D$4:$D$22))","v":""},"",{"$f":"IF($B22=\"\",\"\",IFERROR(INDEX('quantities report_secondary'!$D$2:$D$10003,SMALL(IF('quantities report_secondary'!$A$2:$A$10003=O$6,ROW('quantities report_secondary'!$A$2:$A$10003)-1,\"\"),ROWS($B$8:$B22))),\"0\"))","v":""},"",null,"",{"$f":"IF($B22=\"\",\"\",IFERROR(INDEX('quantities report_secondary'!$D$2:$D$10003,SMALL(IF('quantities report_secondary'!$A$2:$A$10003=S$6,ROW('quantities report_secondary'!$A$2:$A$10003)-1,\"\"),ROWS($B$8:$B22))),\"0\"))","v":""},{"$f":"IF($B22=\"\",\"\",Backfill_secondary!H22)","v":""},{"$f":"IF($B22=\"\",\"\",IFERROR(INDEX('quantities report_secondary'!$D$2:$D$10003,SMALL(IF('quantities report_secondary'!$A$2:$A$10003=U$6,ROW('quantities report_secondary'!$A$2:$A$10003)-1,\"\"),ROWS($B$8:$B22))),\"0\"))","v":""},{"$f":"IF($B22=\"\",\"\",IFERROR(INDEX('quantities report_secondary'!$D$2:$D$10003,SMALL(IF('quantities report_secondary'!$A$2:$A$10003=V$6,ROW('quantities report_secondary'!$A$2:$A$10003)-1,\"\"),ROWS($B$8:$B22))),\"0\"))","v":""},{"$f":"IF($B22=\"\",\"\",IFERROR(INDEX('quantities report_secondary'!$D$2:$D$10003,SMALL(IF('quantities report_secondary'!$A$2:$A$10003=W$6,ROW('quantities report_secondary'!$A$2:$A$10003)-1,\"\"),ROWS($B$8:$B22))),\"0\"))","v":""},{"$f":"IF($B22=\"\",\"\",IFERROR(INDEX('quantities report_secondary'!$D$2:$D$10003,SMALL(IF('quantities report_secondary'!$A$2:$A$10003=X$6,ROW('quantities report_secondary'!$A$2:$A$10003)-1,\"\"),ROWS($B$8:$B22))),\"0\"))","v":""},{"$f":"IF($B22=\"\",\"\",Backfill_secondary!R22)","v":""},{"$f":"IF($B22=\"\",\"\",Backfill_secondary!U22)","v":""},{"$f":"IF($B22=\"\",\"\",Removals_secondary!$G19)","v":""},{"$f":"IF($B22=\"\",\"\",Removals_secondary!$L19)","v":""},{"$f":"IF($B22=\"\",\"\",IFERROR(INDEX('quantities report_secondary'!$D$2:$D$10003,SMALL(IF('quantities report_secondary'!$A$2:$A$10003=AC$6,ROW('quantities report_secondary'!$A$2:$A$10003)-1,\"\"),ROWS($B$8:$B22))),\"0\"))","v":""},{"$f":"IF($B22=\"\",\"\",IFERROR(INDEX('quantities report_secondary'!$D$2:$D$10003,SMALL(IF('quantities report_secondary'!$A$2:$A$10003=AD$6,ROW('quantities report_secondary'!$A$2:$A$10003)-1,\"\"),ROWS($B$8:$B22))),\"0\"))","v":""},{"$f":"IF($B22=\"\",\"\",IFERROR(INDEX('quantities report_secondary'!$D$2:$D$10003,SMALL(IF('quantities report_secondary'!$A$2:$A$10003=AE$6,ROW('quantities report_secondary'!$A$2:$A$10003)-1,\"\"),ROWS($B$8:$B22))),\"0\"))","v":""},{"$f":"IF($B22=\"\",\"\",IFERROR(INDEX('quantities report_secondary'!$D$2:$D$10003,SMALL(IF('quantities report_secondary'!$A$2:$A$10003=AF$6,ROW('quantities report_secondary'!$A$2:$A$10003)-1,\"\"),ROWS($B$8:$B22))),\"0\"))","v":""},{"$f":"IF($B22=\"\",\"\",IFERROR(INDEX('quantities report_secondary'!$D$2:$D$10003,SMALL(IF('quantities report_secondary'!$A$2:$A$10003=AG$6,ROW('quantities report_secondary'!$A$2:$A$10003)-1,\"\"),ROWS($B$8:$B22))),\"0\"))","v":""},{"$f":"IF($B22=\"\",\"\",IFERROR(INDEX('quantities report_secondary'!$D$2:$D$10003,SMALL(IF('quantities report_secondary'!$A$2:$A$10003=AH$6,ROW('quantities report_secondary'!$A$2:$A$10003)-1,\"\"),ROWS($B$8:$B22))),\"0\"))","v":""},"","","","","",0.9,""," "]
[null,{"$f":"IFERROR(INDEX('manual inputs_secondary'!M:M,SMALL(IF('manual inputs_secondary'!M:M<>\"\",ROW('manual inputs_secondary'!M:M)),ROW(18:18))),\"\")","v":""},{"$f":"IF(B23=\"\",\"\",IFERROR(INDEX('quantities report_secondary'!$D$2:$D$10003,SMALL(IF('quantities report_secondary'!$A$2:$A$10003=C$6,ROW('quantities report_secondary'!$A$2:$A$10003)-1,\"\"),ROWS($B$8:$B23))),\"0\"))","v":""},"",null,"",{"$f":"IF($B23=\"\",\"\",Structure_Ex_secondary!I23)","v":""},null,{"$f":"IF($B23=\"\",\"\",IFERROR(INDEX('quantities report_secondary'!$D$2:$D$10003,SMALL(IF('quantities report_secondary'!$A$2:$A$10003=I$6,ROW('quantities report_secondary'!$A$2:$A$10003)-1,\"\"),ROWS($B$8:$B23))),\"0\"))","v":""},{"$f":"IF($B23=\"\",\"\",Removals_secondary!$F20)","v":""},{"$f":"IF($B23=\"\",\"\",Removals_secondary!$K20)","v":""},{"$f":"IF($B23=\"\",\"\",IFERROR(INDEX('quantities report_secondary'!$D$2:$D$10003,SMALL(IF('quantities report_secondary'!$A$2:$A$10003=L$6,ROW('quantities report_secondary'!$A$2:$A$10003)-1,\"\"),ROWS($B$8:$B23))),\"0\"))","v":""},{"$f":"IF(B23=\"\",\"\",LOOKUP(B23,'manual inputs_secondary'!$B$4:$B$22,'manual inputs_secondary'!$D$4:$D$22))","v":""},"",{"$f":"IF($B23=\"\",\"\",IFERROR(INDEX('quantities report_secondary'!$D$2:$D$10003,SMALL(IF('quantities report_secondary'!$A$2:$A$10003=O$6,ROW('quantities report_secondary'!$A$2:$A$10003)-1,\"\"),ROWS($B$8:$B23))),\"0\"))","v":""},"",null,"",{"$f":"IF($B23=\"\",\"\",IFERROR(INDEX('quantities report_secondary'!$D$2:$D$10003,SMALL(IF('quantities report_secondary'!$A$2:$A$10003=S$6,ROW('quantities report_secondary'!$A$2:$A$10003)-1,\"\"),ROWS($B$8:$B23))),\"0\"))","v":""},{"$f":"IF($B23=\"\",\"\",Backfill_secondary!H23)","v":""},{"$f":"IF($B23=\"\",\"\",IFERROR(INDEX('quantities report_secondary'!$D$2:$D$10003,SMALL(IF('quantities report_secondary'!$A$2:$A$10003=U$6,ROW('quantities report_secondary'!$A$2:$A$10003)-1,\"\"),ROWS($B$8:$B23))),\"0\"))","v":""},{"$f":"IF($B23=\"\",\"\",IFERROR(INDEX('quantities report_secondary'!$D$2:$D$10003,SMALL(IF('quantities report_secondary'!$A$2:$A$10003=V$6,ROW('quantities report_secondary'!$A$2:$A$10003)-1,\"\"),ROWS($B$8:$B23))),\"0\"))","v":""},{"$f":"IF($B23=\"\",\"\",IFERROR(INDEX('quantities report_secondary'!$D$2:$D$10003,SMALL(IF('quantities report_secondary'!$A$2:$A$10003=W$6,ROW('quantities report_secondary'!$A$2:$A$10003)-1,\"\"),ROWS($B$8:$B23))),\"0\"))","v":""},{"$f":"IF($B23=\"\",\"\",IFERROR(INDEX('quantities report_secondary'!$D$2:$D$10003,SMALL(IF('quantities report_secondary'!$A$2:$A$10003=X$6,ROW('quantities report_secondary'!$A$2:$A$10003)-1,\"\"),ROWS($B$8:$B23))),\"0\"))","v":""},{"$f":"IF($B23=\"\",\"\",Backfill_secondary!R23)","v":""},{"$f":"IF($B23=\"\",\"\",Backfill_secondary!U23)","v":""},{"$f":"IF($B23=\"\",\"\",Removals_secondary!$G20)","v":""},{"$f":"IF($B23=\"\",\"\",Removals_secondary!$L20)","v":""},{"$f":"IF($B23=\"\",\"\",IFERROR(INDEX('quantities report_secondary'!$D$2:$D$10003,SMALL(IF('quantities report_secondary'!$A$2:$A$10003=AC$6,ROW('quantities report_secondary'!$A$2:$A$10003)-1,\"\"),ROWS($B$8:$B23))),\"0\"))","v":""},{"$f":"IF($B23=\"\",\"\",IFERROR(INDEX('quantities report_secondary'!$D$2:$D$10003,SMALL(IF('quantities report_secondary'!$A$2:$A$10003=AD$6,ROW('quantities report_secondary'!$A$2:$A$10003)-1,\"\"),ROWS($B$8:$B23))),\"0\"))","v":""},{"$f":"IF($B23=\"\",\"\",IFERROR(INDEX('quantities report_secondary'!$D$2:$D$10003,SMALL(IF('quantities report_secondary'!$A$2:$A$10003=AE$6,ROW('quantities report_secondary'!$A$2:$A$10003)-1,\"\"),ROWS($B$8:$B23))),\"0\"))","v":""},{"$f":"IF($B23=\"\",\"\",IFERROR(INDEX('quantities report_secondary'!$D$2:$D$10003,SMALL(IF('quantities report_secondary'!$A$2:$A$10003=AF$6,ROW('quantities report_secondary'!$A$2:$A$10003)-1,\"\"),ROWS($B$8:$B23))),\"0\"))","v":""},{"$f":"IF($B23=\"\",\"\",IFERROR(INDEX('quantities report_secondary'!$D$2:$D$10003,SMALL(IF('quantities report_secondary'!$A$2:$A$10003=AG$6,ROW('quantities report_secondary'!$A$2:$A$10003)-1,\"\"),ROWS($B$8:$B23))),\"0\"))","v":""},{"$f":"IF($B23=\"\",\"\",IFERROR(INDEX('quantities report_secondary'!$D$2:$D$10003,SMALL(IF('quantities report_secondary'!$A$2:$A$10003=AH$6,ROW('quantities report_secondary'!$A$2:$A$10003)-1,\"\"),ROWS($B$8:$B23))),\"0\"))","v":""},"","","","","",0.9,""," "]
[null,{"$f":"IFERROR(INDEX('manual inputs_secondary'!M:M,SMALL(IF('manual inputs_secondary'!M:M<>\"\",ROW('manual inputs_secondary'!M:M)),ROW(19:19))),\"\")","v":""},{"$f":"IF(B24=\"\",\"\",IFERROR(INDEX('quantities report_secondary'!$D$2:$D$10003,SMALL(IF('quantities report_secondary'!$A$2:$A$10003=C$6,ROW('quantities report_secondary'!$A$2:$A$10003)-1,\"\"),ROWS($B$8:$B24))),\"0\"))","v":""},"",null,"",{"$f":"IF($B24=\"\",\"\",Structure_Ex_secondary!I24)","v":""},null,{"$f":"IF($B24=\"\",\"\",IFERROR(INDEX('quantities report_secondary'!$D$2:$D$10003,SMALL(IF('quantities report_secondary'!$A$2:$A$10003=I$6,ROW('quantities report_secondary'!$A$2:$A$10003)-1,\"\"),ROWS($B$8:$B24))),\"0\"))","v":""},{"$f":"IF($B24=\"\",\"\",Removals_secondary!$F21)","v":""},{"$f":"IF($B24=\"\",\"\",Removals_secondary!$K21)","v":""},{"$f":"IF($B24=\"\",\"\",IFERROR(INDEX('quantities report_secondary'!$D$2:$D$10003,SMALL(IF('quantities report_secondary'!$A$2:$A$10003=L$6,ROW('quantities report_secondary'!$A$2:$A$10003)-1,\"\"),ROWS($B$8:$B24))),\"0\"))","v":""},{"$f":"IF(B24=\"\",\"\",LOOKUP(B24,'manual inputs_secondary'!$B$4:$B$22,'manual inputs_secondary'!$D$4:$D$22))","v":""},"",{"$f":"IF($B24=\"\",\"\",IFERROR(INDEX('quantities report_secondary'!$D$2:$D$10003,SMALL(IF('quantities report_secondary'!$A$2:$A$10003=O$6,ROW('quantities report_secondary'!$A$2:$A$10003)-1,\"\"),ROWS($B$8:$B24))),\"0\"))","v":""},"",null,"",{"$f":"IF($B24=\"\",\"\",IFERROR(INDEX('quantities report_secondary'!$D$2:$D$10003,SMALL(IF('quantities report_secondary'!$A$2:$A$10003=S$6,ROW('quantities report_secondary'!$A$2:$A$10003)-1,\"\"),ROWS($B$8:$B24))),\"0\"))","v":""},{"$f":"IF($B24=\"\",\"\",Backfill_secondary!H24)","v":""},{"$f":"IF($B24=\"\",\"\",IFERROR(INDEX('quantities report_secondary'!$D$2:$D$10003,SMALL(IF('quantities report_secondary'!$A$2:$A$10003=U$6,ROW('quantities report_secondary'!$A$2:$A$10003)-1,\"\"),ROWS($B$8:$B24))),\"0\"))","v":""},{"$f":"IF($B24=\"\",\"\",IFERROR(INDEX('quantities report_secondary'!$D$2:$D$10003,SMALL(IF('quantities report_secondary'!$A$2:$A$10003=V$6,ROW('quantities report_secondary'!$A$2:$A$10003)-1,\"\"),ROWS($B$8:$B24))),\"0\"))","v":""},{"$f":"IF($B24=\"\",\"\",IFERROR(INDEX('quantities report_secondary'!$D$2:$D$10003,SMALL(IF('quantities report_secondary'!$A$2:$A$10003=W$6,ROW('quantities report_secondary'!$A$2:$A$10003)-1,\"\"),ROWS($B$8:$B24))),\"0\"))","v":""},{"$f":"IF($B24=\"\",\"\",IFERROR(INDEX('quantities report_secondary'!$D$2:$D$10003,SMALL(IF('quantities report_secondary'!$A$2:$A$10003=X$6,ROW('quantities report_secondary'!$A$2:$A$10003)-1,\"\"),ROWS($B$8:$B24))),\"0\"))","v":""},{"$f":"IF($B24=\"\",\"\",Backfill_secondary!R24)","v":""},{"$f":"IF($B24=\"\",\"\",Backfill_secondary!U24)","v":""},{"$f":"IF($B24=\"\",\"\",Removals_secondary!$G21)","v":""},{"$f":"IF($B24=\"\",\"\",Removals_secondary!$L21)","v":""},{"$f":"IF($B24=\"\",\"\",IFERROR(INDEX('quantities report_secondary'!$D$2:$D$10003,SMALL(IF('quantities report_secondary'!$A$2:$A$10003=AC$6,ROW('quantities report_secondary'!$A$2:$A$10003)-1,\"\"),ROWS($B$8:$B24))),\"0\"))","v":""},{"$f":"IF($B24=\"\",\"\",IFERROR(INDEX('quantities report_secondary'!$D$2:$D$10003,SMALL(IF('quantities report_secondary'!$A$2:$A$10003=AD$6,ROW('quantities report_secondary'!$A$2:$A$10003)-1,\"\"),ROWS($B$8:$B24))),\"0\"))","v":""},{"$f":"IF($B24=\"\",\"\",IFERROR(INDEX('quantities report_secondary'!$D$2:$D$10003,SMALL(IF('quantities report_secondary'!$A$2:$A$10003=AE$6,ROW('quantities report_secondary'!$A$2:$A$10003)-1,\"\"),ROWS($B$8:$B24))),\"0\"))","v":""},{"$f":"IF($B24=\"\",\"\",IFERROR(INDEX('quantities report_secondary'!$D$2:$D$10003,SMALL(IF('quantities report_secondary'!$A$2:$A$10003=AF$6,ROW('quantities report_secondary'!$A$2:$A$10003)-1,\"\"),ROWS($B$8:$B24))),\"0\"))","v":""},{"$f":"IF($B24=\"\",\"\",IFERROR(INDEX('quantities report_secondary'!$D$2:$D$10003,SMALL(IF('quantities report_secondary'!$A$2:$A$10003=AG$6,ROW('quantities report_secondary'!$A$2:$A$10003)-1,\"\"),ROWS($B$8:$B24))),\"0\"))","v":""},{"$f":"IF($B24=\"\",\"\",IFERROR(INDEX('quantities report_secondary'!$D$2:$D$10003,SMALL(IF('quantities report_secondary'!$A$2:$A$10003=AH$6,ROW('quantities report_secondary'!$A$2:$A$10003)-1,\"\"),ROWS($B$8:$B24))),\"0\"))","v":""},"","","","","",0.9,""," "]
[null,{"$f":"IFERROR(INDEX('manual inputs_secondary'!M:M,SMALL(IF('manual inputs_secondary'!M:M<>\"\",ROW('manual inputs_secondary'!M:M)),ROW(20:20))),\"\")","v":""},{"$f":"IF(B25=\"\",\"\",IFERROR(INDEX('quantities report_secondary'!$D$2:$D$10003,SMALL(IF('quantities report_secondary'!$A$2:$A$10003=C$6,ROW('quantities report_secondary'!$A$2:$A$10003)-1,\"\"),ROWS($B$8:$B25))),\"0\"))","v":""},"",null,"",{"$f":"IF($B25=\"\",\"\",Structure_Ex_secondary!I25)","v":""},null,{"$f":"IF($B25=\"\",\"\",IFERROR(INDEX('quantities report_secondary'!$D$2:$D$10003,SMALL(IF('quantities report_secondary'!$A$2:$A$10003=I$6,ROW('quantities report_secondary'!$A$2:$A$10003)-1,\"\"),ROWS($B$8:$B25))),\"0\"))","v":""},{"$f":"IF($B25=\"\",\"\",Removals_secondary!$F22)","v":""},{"$f":"IF($B25=\"\",\"\",Removals_secondary!$K22)","v":""},{"$f":"IF($B25=\"\",\"\",IFERROR(INDEX('quantities report_secondary'!$D$2:$D$10003,SMALL(IF('quantities report_secondary'!$A$2:$A$10003=L$6,ROW('quantities report_secondary'!$A$2:$A$10003)-1,\"\"),ROWS($B$8:$B25))),\"0\"))","v":""},{"$f":"IF(B25=\"\",\"\",LOOKUP(B25,'manual inputs_secondary'!$B$4:$B$22,'manual inputs_secondary'!$D$4:$D$22))","v":""},"",{"$f":"IF($B25=\"\",\"\",IFERROR(INDEX('quantities report_secondary'!$D$2:$D$10003,SMALL(IF('quantities report_secondary'!$A$2:$A$10003=O$6,ROW('quantities report_secondary'!$A$2:$A$10003)-1,\"\"),ROWS($B$8:$B25))),\"0\"))","v":""},"",null,"",{"$f":"IF($B25=\"\",\"\",IFERROR(INDEX('quantities report_secondary'!$D$2:$D$10003,SMALL(IF('quantities report_secondary'!$A$2:$A$10003=S$6,ROW('quantities report_secondary'!$A$2:$A$10003)-1,\"\"),ROWS($B$8:$B25))),\"0\"))","v":""},{"$f":"IF($B25=\"\",\"\",Backfill_secondary!H25)","v":""},{"$f":"IF($B25=\"\",\"\",IFERROR(INDEX('quantities report_secondary'!$D$2:$D$10003,SMALL(IF('quantities report_secondary'!$A$2:$A$10003=U$6,ROW('quantities report_secondary'!$A$2:$A$10003)-1,\"\"),ROWS($B$8:$B25))),\"0\"))","v":""},{"$f":"IF($B25=\"\",\"\",IFERROR(INDEX('quantities report_secondary'!$D$2:$D$10003,SMALL(IF('quantities report_secondary'!$A$2:$A$10003=V$6,ROW('quantities report_secondary'!$A$2:$A$10003)-1,\"\"),ROWS($B$8:$B25))),\"0\"))","v":""},{"$f":"IF($B25=\"\",\"\",IFERROR(INDEX('quantities report_secondary'!$D$2:$D$10003,SMALL(IF('quantities report_secondary'!$A$2:$A$10003=W$6,ROW('quantities report_secondary'!$A$2:$A$10003)-1,\"\"),ROWS($B$8:$B25))),\"0\"))","v":""},{"$f":"IF($B25=\"\",\"\",IFERROR(INDEX('quantities report_secondary'!$D$2:$D$10003,SMALL(IF('quantities report_secondary'!$A$2:$A$10003=X$6,ROW('quantities report_secondary'!$A$2:$A$10003)-1,\"\"),ROWS($B$8:$B25))),\"0\"))","v":""},{"$f":"IF($B25=\"\",\"\",Backfill_secondary!R25)","v":""},{"$f":"IF($B25=\"\",\"\",Backfill_secondary!U25)","v":""},{"$f":"IF($B25=\"\",\"\",Removals_secondary!$G22)","v":""},{"$f":"IF($B25=\"\",\"\",Removals_secondary!$L22)","v":""},{"$f":"IF($B25=\"\",\"\",IFERROR(INDEX('quantities report_secondary'!$D$2:$D$10003,SMALL(IF('quantities report_secondary'!$A$2:$A$10003=AC$6,ROW('quantities report_secondary'!$A$2:$A$10003)-1,\"\"),ROWS($B$8:$B25))),\"0\"))","v":""},{"$f":"IF($B25=\"\",\"\",IFERROR(INDEX('quantities report_secondary'!$D$2:$D$10003,SMALL(IF('quantities report_secondary'!$A$2:$A$10003=AD$6,ROW('quantities report_secondary'!$A$2:$A$10003)-1,\"\"),ROWS($B$8:$B25))),\"0\"))","v":""},{"$f":"IF($B25=\"\",\"\",IFERROR(INDEX('quantities report_secondary'!$D$2:$D$10003,SMALL(IF('quantities report_secondary'!$A$2:$A$10003=AE$6,ROW('quantities report_secondary'!$A$2:$A$10003)-1,\"\"),ROWS($B$8:$B25))),\"0\"))","v":""},{"$f":"IF($B25=\"\",\"\",IFERROR(INDEX('quantities report_secondary'!$D$2:$D$10003,SMALL(IF('quantities report_secondary'!$A$2:$A$10003=AF$6,ROW('quantities report_secondary'!$A$2:$A$10003)-1,\"\"),ROWS($B$8:$B25))),\"0\"))","v":""},{"$f":"IF($B25=\"\",\"\",IFERROR(INDEX('quantities report_secondary'!$D$2:$D$10003,SMALL(IF('quantities report_secondary'!$A$2:$A$10003=AG$6,ROW('quantities report_secondary'!$A$2:$A$10003)-1,\"\"),ROWS($B$8:$B25))),\"0\"))","v":""},{"$f":"IF($B25=\"\",\"\",IFERROR(INDEX('quantities report_secondary'!$D$2:$D$10003,SMALL(IF('quantities report_secondary'!$A$2:$A$10003=AH$6,ROW('quantities report_secondary'!$A$2:$A$10003)-1,\"\"),ROWS($B$8:$B25))),\"0\"))","v":""},"","","","","",0.9,""," "]
[null,{"$f":"IFERROR(INDEX('manual inputs_secondary'!M:M,SMALL(IF('manual inputs_secondary'!M:M<>\"\",ROW('manual inputs_secondary'!M:M)),ROW(21:21))),\"\")","v":""},{"$f":"IF(B26=\"\",\"\",IFERROR(INDEX('quantities report_secondary'!$D$2:$D$10003,SMALL(IF('quantities report_secondary'!$A$2:$A$10003=C$6,ROW('quantities report_secondary'!$A$2:$A$10003)-1,\"\"),ROWS($B$8:$B26))),\"0\"))","v":""},"",null,"",{"$f":"IF($B26=\"\",\"\",Structure_Ex_secondary!I26)","v":""},null,{"$f":"IF($B26=\"\",\"\",IFERROR(INDEX('quantities report_secondary'!$D$2:$D$10003,SMALL(IF('quantities report_secondary'!$A$2:$A$10003=I$6,ROW('quantities report_secondary'!$A$2:$A$10003)-1,\"\"),ROWS($B$8:$B26))),\"0\"))","v":""},{"$f":"IF($B26=\"\",\"\",Removals_secondary!$F23)","v":""},{"$f":"IF($B26=\"\",\"\",Removals_secondary!$K23)","v":""},{"$f":"IF($B26=\"\",\"\",IFERROR(INDEX('quantities report_secondary'!$D$2:$D$10003,SMALL(IF('quantities report_secondary'!$A$2:$A$10003=L$6,ROW('quantities report_secondary'!$A$2:$A$10003)-1,\"\"),ROWS($B$8:$B26))),\"0\"))","v":""},{"$f":"IF(B26=\"\",\"\",LOOKUP(B26,'manual inputs_secondary'!$B$4:$B$22,'manual inputs_secondary'!$D$4:$D$22))","v":""},"",{"$f":"IF($B26=\"\",\"\",IFERROR(INDEX('quantities report_secondary'!$D$2:$D$10003,SMALL(IF('quantities report_secondary'!$A$2:$A$10003=O$6,ROW('quantities report_secondary'!$A$2:$A$10003)-1,\"\"),ROWS($B$8:$B26))),\"0\"))","v":""},"",null,"",{"$f":"IF($B26=\"\",\"\",IFERROR(INDEX('quantities report_secondary'!$D$2:$D$10003,SMALL(IF('quantities report_secondary'!$A$2:$A$10003=S$6,ROW('quantities report_secondary'!$A$2:$A$10003)-1,\"\"),ROWS($B$8:$B26))),\"0\"))","v":""},{"$f":"IF($B26=\"\",\"\",Backfill_secondary!H26)","v":""},{"$f":"IF($B26=\"\",\"\",IFERROR(INDEX('quantities report_secondary'!$D$2:$D$10003,SMALL(IF('quantities report_secondary'!$A$2:$A$10003=U$6,ROW('quantities report_secondary'!$A$2:$A$10003)-1,\"\"),ROWS($B$8:$B26))),\"0\"))","v":""},{"$f":"IF($B26=\"\",\"\",IFERROR(INDEX('quantities report_secondary'!$D$2:$D$10003,SMALL(IF('quantities report_secondary'!$A$2:$A$10003=V$6,ROW('quantities report_secondary'!$A$2:$A$10003)-1,\"\"),ROWS($B$8:$B26))),\"0\"))","v":""},{"$f":"IF($B26=\"\",\"\",IFERROR(INDEX('quantities report_secondary'!$D$2:$D$10003,SMALL(IF('quantities report_secondary'!$A$2:$A$10003=W$6,ROW('quantities report_secondary'!$A$2:$A$10003)-1,\"\"),ROWS($B$8:$B26))),\"0\"))","v":""},{"$f":"IF($B26=\"\",\"\",IFERROR(INDEX('quantities report_secondary'!$D$2:$D$10003,SMALL(IF('quantities report_secondary'!$A$2:$A$10003=X$6,ROW('quantities report_secondary'!$A$2:$A$10003)-1,\"\"),ROWS($B$8:$B26))),\"0\"))","v":""},{"$f":"IF($B26=\"\",\"\",Backfill_secondary!R26)","v":""},{"$f":"IF($B26=\"\",\"\",Backfill_secondary!U26)","v":""},{"$f":"IF($B26=\"\",\"\",Removals_secondary!$G23)","v":""},{"$f":"IF($B26=\"\",\"\",Removals_secondary!$L23)","v":""},{"$f":"IF($B26=\"\",\"\",IFERROR(INDEX('quantities report_secondary'!$D$2:$D$10003,SMALL(IF('quantities report_secondary'!$A$2:$A$10003=AC$6,ROW('quantities report_secondary'!$A$2:$A$10003)-1,\"\"),ROWS($B$8:$B26))),\"0\"))","v":""},{"$f":"IF($B26=\"\",\"\",IFERROR(INDEX('quantities report_secondary'!$D$2:$D$10003,SMALL(IF('quantities report_secondary'!$A$2:$A$10003=AD$6,ROW('quantities report_secondary'!$A$2:$A$10003)-1,\"\"),ROWS($B$8:$B26))),\"0\"))","v":""},{"$f":"IF($B26=\"\",\"\",IFERROR(INDEX('quantities report_secondary'!$D$2:$D$10003,SMALL(IF('quantities report_secondary'!$A$2:$A$10003=AE$6,ROW('quantities report_secondary'!$A$2:$A$10003)-1,\"\"),ROWS($B$8:$B26))),\"0\"))","v":""},{"$f":"IF($B26=\"\",\"\",IFERROR(INDEX('quantities report_secondary'!$D$2:$D$10003,SMALL(IF('quantities report_secondary'!$A$2:$A$10003=AF$6,ROW('quantities report_secondary'!$A$2:$A$10003)-1,\"\"),ROWS($B$8:$B26))),\"0\"))","v":""},{"$f":"IF($B26=\"\",\"\",IFERROR(INDEX('quantities report_secondary'!$D$2:$D$10003,SMALL(IF('quantities report_secondary'!$A$2:$A$10003=AG$6,ROW('quantities report_secondary'!$A$2:$A$10003)-1,\"\"),ROWS($B$8:$B26))),\"0\"))","v":""},{"$f":"IF($B26=\"\",\"\",IFERROR(INDEX('quantities report_secondary'!$D$2:$D$10003,SMALL(IF('quantities report_secondary'!$A$2:$A$10003=AH$6,ROW('quantities report_secondary'!$A$2:$A$10003)-1,\"\"),ROWS($B$8:$B26))),\"0\"))","v":""},"","","","","",0.9,""," "]
[null,{"$f":"IFERROR(INDEX('manual inputs_secondary'!M:M,SMALL(IF('manual inputs_secondary'!M:M<>\"\",ROW('manual inputs_secondary'!M:M)),ROW(22:22))),\"\")","v":""},{"$f":"IF(B27=\"\",\"\",IFERROR(INDEX('quantities report_secondary'!$D$2:$D$10003,SMALL(IF('quantities report_secondary'!$A$2:$A$10003=C$6,ROW('quantities report_secondary'!$A$2:$A$10003)-1,\"\"),ROWS($B$8:$B27))),\"0\"))","v":""},"",null,"",{"$f":"IF($B27=\"\",\"\",Structure_Ex_secondary!I27)","v":""},null,{"$f":"IF($B27=\"\",\"\",IFERROR(INDEX('quantities report_secondary'!$D$2:$D$10003,SMALL(IF('quantities report_secondary'!$A$2:$A$10003=I$6,ROW('quantities report_secondary'!$A$2:$A$10003)-1,\"\"),ROWS($B$8:$B27))),\"0\"))","v":""},{"$f":"IF($B27=\"\",\"\",Removals_secondary!$F24)","v":""},{"$f":"IF($B27=\"\",\"\",Removals_secondary!$K24)","v":""},{"$f":"IF($B27=\"\",\"\",IFERROR(INDEX('quantities report_secondary'!$D$2:$D$10003,SMALL(IF('quantities report_secondary'!$A$2:$A$10003=L$6,ROW('quantities report_secondary'!$A$2:$A$10003)-1,\"\"),ROWS($B$8:$B27))),\"0\"))","v":""},{"$f":"IF(B27=\"\",\"\",LOOKUP(B27,'manual inputs_secondary'!$B$4:$B$22,'manual inputs_secondary'!$D$4:$D$22))","v":""},"",{"$f":"IF($B27=\"\",\"\",IFERROR(INDEX('quantities report_secondary'!$D$2:$D$10003,SMALL(IF('quantities report_secondary'!$A$2:$A$10003=O$6,ROW('quantities report_secondary'!$A$2:$A$10003)-1,\"\"),ROWS($B$8:$B27))),\"0\"))","v":""},"",null,"",{"$f":"IF($B27=\"\",\"\",IFERROR(INDEX('quantities report_secondary'!$D$2:$D$10003,SMALL(IF('quantities report_secondary'!$A$2:$A$10003=S$6,ROW('quantities report_secondary'!$A$2:$A$10003)-1,\"\"),ROWS($B$8:$B27))),\"0\"))","v":""},{"$f":"IF($B27=\"\",\"\",Backfill_secondary!H27)","v":""},{"$f":"IF($B27=\"\",\"\",IFERROR(INDEX('quantities report_secondary'!$D$2:$D$10003,SMALL(IF('quantities report_secondary'!$A$2:$A$10003=U$6,ROW('quantities report_secondary'!$A$2:$A$10003)-1,\"\"),ROWS($B$8:$B27))),\"0\"))","v":""},{"$f":"IF($B27=\"\",\"\",IFERROR(INDEX('quantities report_secondary'!$D$2:$D$10003,SMALL(IF('quantities report_secondary'!$A$2:$A$10003=V$6,ROW('quantities report_secondary'!$A$2:$A$10003)-1,\"\"),ROWS($B$8:$B27))),\"0\"))","v":""},{"$f":"IF($B27=\"\",\"\",IFERROR(INDEX('quantities report_secondary'!$D$2:$D$10003,SMALL(IF('quantities report_secondary'!$A$2:$A$10003=W$6,ROW('quantities report_secondary'!$A$2:$A$10003)-1,\"\"),ROWS($B$8:$B27))),\"0\"))","v":""},{"$f":"IF($B27=\"\",\"\",IFERROR(INDEX('quantities report_secondary'!$D$2:$D$10003,SMALL(IF('quantities report_secondary'!$A$2:$A$10003=X$6,ROW('quantities report_secondary'!$A$2:$A$10003)-1,\"\"),ROWS($B$8:$B27))),\"0\"))","v":""},{"$f":"IF($B27=\"\",\"\",Backfill_secondary!R27)","v":""},{"$f":"IF($B27=\"\",\"\",Backfill_secondary!U27)","v":""},{"$f":"IF($B27=\"\",\"\",Removals_secondary!$G24)","v":""},{"$f":"IF($B27=\"\",\"\",Removals_secondary!$L24)","v":""},{"$f":"IF($B27=\"\",\"\",IFERROR(INDEX('quantities report_secondary'!$D$2:$D$10003,SMALL(IF('quantities report_secondary'!$A$2:$A$10003=AC$6,ROW('quantities report_secondary'!$A$2:$A$10003)-1,\"\"),ROWS($B$8:$B27))),\"0\"))","v":""},{"$f":"IF($B27=\"\",\"\",IFERROR(INDEX('quantities report_secondary'!$D$2:$D$10003,SMALL(IF('quantities report_secondary'!$A$2:$A$10003=AD$6,ROW('quantities report_secondary'!$A$2:$A$10003)-1,\"\"),ROWS($B$8:$B27))),\"0\"))","v":""},{"$f":"IF($B27=\"\",\"\",IFERROR(INDEX('quantities report_secondary'!$D$2:$D$10003,SMALL(IF('quantities report_secondary'!$A$2:$A$10003=AE$6,ROW('quantities report_secondary'!$A$2:$A$10003)-1,\"\"),ROWS($B$8:$B27))),\"0\"))","v":""},{"$f":"IF($B27=\"\",\"\",IFERROR(INDEX('quantities report_secondary'!$D$2:$D$10003,SMALL(IF('quantities report_secondary'!$A$2:$A$10003=AF$6,ROW('quantities report_secondary'!$A$2:$A$10003)-1,\"\"),ROWS($B$8:$B27))),\"0\"))","v":""},{"$f":"IF($B27=\"\",\"\",IFERROR(INDEX('quantities report_secondary'!$D$2:$D$10003,SMALL(IF('quantities report_secondary'!$A$2:$A$10003=AG$6,ROW('quantities report_secondary'!$A$2:$A$10003)-1,\"\"),ROWS($B$8:$B27))),\"0\"))","v":""},{"$f":"IF($B27=\"\",\"\",IFERROR(INDEX('quantities report_secondary'!$D$2:$D$10003,SMALL(IF('quantities report_secondary'!$A$2:$A$10003=AH$6,ROW('quantities report_secondary'!$A$2:$A$10003)-1,\"\"),ROWS($B$8:$B27))),\"0\"))","v":""},"","","","","",0.9,""," "]
[null,{"$f":"IFERROR(INDEX('manual inputs_secondary'!M:M,SMALL(IF('manual inputs_secondary'!M:M<>\"\",ROW('manual inputs_secondary'!M:M)),ROW(23:23))),\"\")","v":""},{"$f":"IF(B28=\"\",\"\",IFERROR(INDEX('quantities report_secondary'!$D$2:$D$10003,SMALL(IF('quantities report_secondary'!$A$2:$A$10003=C$6,ROW('quantities report_secondary'!$A$2:$A$10003)-1,\"\"),ROWS($B$8:$B28))),\"0\"))","v":""},"",null,"",{"$f":"IF($B28=\"\",\"\",Structure_Ex_secondary!I28)","v":""},null,{"$f":"IF($B28=\"\",\"\",IFERROR(INDEX('quantities report_secondary'!$D$2:$D$10003,SMALL(IF('quantities report_secondary'!$A$2:$A$10003=I$6,ROW('quantities report_secondary'!$A$2:$A$10003)-1,\"\"),ROWS($B$8:$B28))),\"0\"))","v":""},{"$f":"IF($B28=\"\",\"\",Removals_secondary!$F25)","v":""},{"$f":"IF($B28=\"\",\"\",Removals_secondary!$K25)","v":""},{"$f":"IF($B28=\"\",\"\",IFERROR(INDEX('quantities report_secondary'!$D$2:$D$10003,SMALL(IF('quantities report_secondary'!$A$2:$A$10003=L$6,ROW('quantities report_secondary'!$A$2:$A$10003)-1,\"\"),ROWS($B$8:$B28))),\"0\"))","v":""},{"$f":"IF(B28=\"\",\"\",LOOKUP(B28,'manual inputs_secondary'!$B$4:$B$22,'manual inputs_secondary'!$D$4:$D$22))","v":""},"",{"$f":"IF($B28=\"\",\"\",IFERROR(INDEX('quantities report_secondary'!$D$2:$D$10003,SMALL(IF('quantities report_secondary'!$A$2:$A$10003=O$6,ROW('quantities report_secondary'!$A$2:$A$10003)-1,\"\"),ROWS($B$8:$B28))),\"0\"))","v":""},"",null,"",{"$f":"IF($B28=\"\",\"\",IFERROR(INDEX('quantities report_secondary'!$D$2:$D$10003,SMALL(IF('quantities report_secondary'!$A$2:$A$10003=S$6,ROW('quantities report_secondary'!$A$2:$A$10003)-1,\"\"),ROWS($B$8:$B28))),\"0\"))","v":""},{"$f":"IF($B28=\"\",\"\",Backfill_secondary!H28)","v":""},{"$f":"IF($B28=\"\",\"\",IFERROR(INDEX('quantities report_secondary'!$D$2:$D$10003,SMALL(IF('quantities report_secondary'!$A$2:$A$10003=U$6,ROW('quantities report_secondary'!$A$2:$A$10003)-1,\"\"),ROWS($B$8:$B28))),\"0\"))","v":""},{"$f":"IF($B28=\"\",\"\",IFERROR(INDEX('quantities report_secondary'!$D$2:$D$10003,SMALL(IF('quantities report_secondary'!$A$2:$A$10003=V$6,ROW('quantities report_secondary'!$A$2:$A$10003)-1,\"\"),ROWS($B$8:$B28))),\"0\"))","v":""},{"$f":"IF($B28=\"\",\"\",IFERROR(INDEX('quantities report_secondary'!$D$2:$D$10003,SMALL(IF('quantities report_secondary'!$A$2:$A$10003=W$6,ROW('quantities report_secondary'!$A$2:$A$10003)-1,\"\"),ROWS($B$8:$B28))),\"0\"))","v":""},{"$f":"IF($B28=\"\",\"\",IFERROR(INDEX('quantities report_secondary'!$D$2:$D$10003,SMALL(IF('quantities report_secondary'!$A$2:$A$10003=X$6,ROW('quantities report_secondary'!$A$2:$A$10003)-1,\"\"),ROWS($B$8:$B28))),\"0\"))","v":""},{"$f":"IF($B28=\"\",\"\",Backfill_secondary!R28)","v":""},{"$f":"IF($B28=\"\",\"\",Backfill_secondary!U28)","v":""},{"$f":"IF($B28=\"\",\"\",Removals_secondary!$G25)","v":""},{"$f":"IF($B28=\"\",\"\",Removals_secondary!$L25)","v":""},{"$f":"IF($B28=\"\",\"\",IFERROR(INDEX('quantities report_secondary'!$D$2:$D$10003,SMALL(IF('quantities report_secondary'!$A$2:$A$10003=AC$6,ROW('quantities report_secondary'!$A$2:$A$10003)-1,\"\"),ROWS($B$8:$B28))),\"0\"))","v":""},{"$f":"IF($B28=\"\",\"\",IFERROR(INDEX('quantities report_secondary'!$D$2:$D$10003,SMALL(IF('quantities report_secondary'!$A$2:$A$10003=AD$6,ROW('quantities report_secondary'!$A$2:$A$10003)-1,\"\"),ROWS($B$8:$B28))),\"0\"))","v":""},{"$f":"IF($B28=\"\",\"\",IFERROR(INDEX('quantities report_secondary'!$D$2:$D$10003,SMALL(IF('quantities report_secondary'!$A$2:$A$10003=AE$6,ROW('quantities report_secondary'!$A$2:$A$10003)-1,\"\"),ROWS($B$8:$B28))),\"0\"))","v":""},{"$f":"IF($B28=\"\",\"\",IFERROR(INDEX('quantities report_secondary'!$D$2:$D$10003,SMALL(IF('quantities report_secondary'!$A$2:$A$10003=AF$6,ROW('quantities report_secondary'!$A$2:$A$10003)-1,\"\"),ROWS($B$8:$B28))),\"0\"))","v":""},{"$f":"IF($B28=\"\",\"\",IFERROR(INDEX('quantities report_secondary'!$D$2:$D$10003,SMALL(IF('quantities report_secondary'!$A$2:$A$10003=AG$6,ROW('quantities report_secondary'!$A$2:$A$10003)-1,\"\"),ROWS($B$8:$B28))),\"0\"))","v":""},{"$f":"IF($B28=\"\",\"\",IFERROR(INDEX('quantities report_secondary'!$D$2:$D$10003,SMALL(IF('quantities report_secondary'!$A$2:$A$10003=AH$6,ROW('quantities report_secondary'!$A$2:$A$10003)-1,\"\"),ROWS($B$8:$B28))),\"0\"))","v":""},"","","","","",0.9,""," "]
[null,{"$f":"IFERROR(INDEX('manual inputs_secondary'!M:M,SMALL(IF('manual inputs_secondary'!M:M<>\"\",ROW('manual inputs_secondary'!M:M)),ROW(24:24))),\"\")","v":""},{"$f":"IF(B29=\"\",\"\",IFERROR(INDEX('quantities report_secondary'!$D$2:$D$10003,SMALL(IF('quantities report_secondary'!$A$2:$A$10003=C$6,ROW('quantities report_secondary'!$A$2:$A$10003)-1,\"\"),ROWS($B$8:$B29))),\"0\"))","v":""},"",null,"",{"$f":"IF($B29=\"\",\"\",Structure_Ex_secondary!I29)","v":""},null,{"$f":"IF($B29=\"\",\"\",IFERROR(INDEX('quantities report_secondary'!$D$2:$D$10003,SMALL(IF('quantities report_secondary'!$A$2:$A$10003=I$6,ROW('quantities report_secondary'!$A$2:$A$10003)-1,\"\"),ROWS($B$8:$B29))),\"0\"))","v":""},{"$f":"IF($B29=\"\",\"\",Removals_secondary!$F26)","v":""},{"$f":"IF($B29=\"\",\"\",Removals_secondary!$K26)","v":""},{"$f":"IF($B29=\"\",\"\",IFERROR(INDEX('quantities report_secondary'!$D$2:$D$10003,SMALL(IF('quantities report_secondary'!$A$2:$A$10003=L$6,ROW('quantities report_secondary'!$A$2:$A$10003)-1,\"\"),ROWS($B$8:$B29))),\"0\"))","v":""},{"$f":"IF(B29=\"\",\"\",LOOKUP(B29,'manual inputs_secondary'!$B$4:$B$22,'manual inputs_secondary'!$D$4:$D$22))","v":""},"",{"$f":"IF($B29=\"\",\"\",IFERROR(INDEX('quantities report_secondary'!$D$2:$D$10003,SMALL(IF('quantities report_secondary'!$A$2:$A$10003=O$6,ROW('quantities report_secondary'!$A$2:$A$10003)-1,\"\"),ROWS($B$8:$B29))),\"0\"))","v":""},"",null,"",{"$f":"IF($B29=\"\",\"\",IFERROR(INDEX('quantities report_secondary'!$D$2:$D$10003,SMALL(IF('quantities report_secondary'!$A$2:$A$10003=S$6,ROW('quantities report_secondary'!$A$2:$A$10003)-1,\"\"),ROWS($B$8:$B29))),\"0\"))","v":""},{"$f":"IF($B29=\"\",\"\",Backfill_secondary!H29)","v":""},{"$f":"IF($B29=\"\",\"\",IFERROR(INDEX('quantities report_secondary'!$D$2:$D$10003,SMALL(IF('quantities report_secondary'!$A$2:$A$10003=U$6,ROW('quantities report_secondary'!$A$2:$A$10003)-1,\"\"),ROWS($B$8:$B29))),\"0\"))","v":""},{"$f":"IF($B29=\"\",\"\",IFERROR(INDEX('quantities report_secondary'!$D$2:$D$10003,SMALL(IF('quantities report_secondary'!$A$2:$A$10003=V$6,ROW('quantities report_secondary'!$A$2:$A$10003)-1,\"\"),ROWS($B$8:$B29))),\"0\"))","v":""},{"$f":"IF($B29=\"\",\"\",IFERROR(INDEX('quantities report_secondary'!$D$2:$D$10003,SMALL(IF('quantities report_secondary'!$A$2:$A$10003=W$6,ROW('quantities report_secondary'!$A$2:$A$10003)-1,\"\"),ROWS($B$8:$B29))),\"0\"))","v":""},{"$f":"IF($B29=\"\",\"\",IFERROR(INDEX('quantities report_secondary'!$D$2:$D$10003,SMALL(IF('quantities report_secondary'!$A$2:$A$10003=X$6,ROW('quantities report_secondary'!$A$2:$A$10003)-1,\"\"),ROWS($B$8:$B29))),\"0\"))","v":""},{"$f":"IF($B29=\"\",\"\",Backfill_secondary!R29)","v":""},{"$f":"IF($B29=\"\",\"\",Backfill_secondary!U29)","v":""},{"$f":"IF($B29=\"\",\"\",Removals_secondary!$G26)","v":""},{"$f":"IF($B29=\"\",\"\",Removals_secondary!$L26)","v":""},{"$f":"IF($B29=\"\",\"\",IFERROR(INDEX('quantities report_secondary'!$D$2:$D$10003,SMALL(IF('quantities report_secondary'!$A$2:$A$10003=AC$6,ROW('quantities report_secondary'!$A$2:$A$10003)-1,\"\"),ROWS($B$8:$B29))),\"0\"))","v":""},{"$f":"IF($B29=\"\",\"\",IFERROR(INDEX('quantities report_secondary'!$D$2:$D$10003,SMALL(IF('quantities report_secondary'!$A$2:$A$10003=AD$6,ROW('quantities report_secondary'!$A$2:$A$10003)-1,\"\"),ROWS($B$8:$B29))),\"0\"))","v":""},{"$f":"IF($B29=\"\",\"\",IFERROR(INDEX('quantities report_secondary'!$D$2:$D$10003,SMALL(IF('quantities report_secondary'!$A$2:$A$10003=AE$6,ROW('quantities report_secondary'!$A$2:$A$10003)-1,\"\"),ROWS($B$8:$B29))),\"0\"))","v":""},{"$f":"IF($B29=\"\",\"\",IFERROR(INDEX('quantities report_secondary'!$D$2:$D$10003,SMALL(IF('quantities report_secondary'!$A$2:$A$10003=AF$6,ROW('quantities report_secondary'!$A$2:$A$10003)-1,\"\"),ROWS($B$8:$B29))),\"0\"))","v":""},{"$f":"IF($B29=\"\",\"\",IFERROR(INDEX('quantities report_secondary'!$D$2:$D$10003,SMALL(IF('quantities report_secondary'!$A$2:$A$10003=AG$6,ROW('quantities report_secondary'!$A$2:$A$10003)-1,\"\"),ROWS($B$8:$B29))),\"0\"))","v":""},{"$f":"IF($B29=\"\",\"\",IFERROR(INDEX('quantities report_secondary'!$D$2:$D$10003,SMALL(IF('quantities report_secondary'!$A$2:$A$10003=AH$6,ROW('quantities report_secondary'!$A$2:$A$10003)-1,\"\"),ROWS($B$8:$B29))),\"0\"))","v":""},"","","","","",0.9,""," "]
[null,{"$f":"IFERROR(INDEX('manual inputs_secondary'!M:M,SMALL(IF('manual inputs_secondary'!M:M<>\"\",ROW('manual inputs_secondary'!M:M)),ROW(25:25))),\"\")","v":""},{"$f":"IF(B30=\"\",\"\",IFERROR(INDEX('quantities report_secondary'!$D$2:$D$10003,SMALL(IF('quantities report_secondary'!$A$2:$A$10003=C$6,ROW('quantities report_secondary'!$A$2:$A$10003)-1,\"\"),ROWS($B$8:$B30))),\"0\"))","v":""},"",null,"",{"$f":"IF($B30=\"\",\"\",Structure_Ex_secondary!I30)","v":""},null,{"$f":"IF($B30=\"\",\"\",IFERROR(INDEX('quantities report_secondary'!$D$2:$D$10003,SMALL(IF('quantities report_secondary'!$A$2:$A$10003=I$6,ROW('quantities report_secondary'!$A$2:$A$10003)-1,\"\"),ROWS($B$8:$B30))),\"0\"))","v":""},{"$f":"IF($B30=\"\",\"\",Removals_secondary!$F27)","v":""},{"$f":"IF($B30=\"\",\"\",Removals_secondary!$K27)","v":""},{"$f":"IF($B30=\"\",\"\",IFERROR(INDEX('quantities report_secondary'!$D$2:$D$10003,SMALL(IF('quantities report_secondary'!$A$2:$A$10003=L$6,ROW('quantities report_secondary'!$A$2:$A$10003)-1,\"\"),ROWS($B$8:$B30))),\"0\"))","v":""},{"$f":"IF(B30=\"\",\"\",LOOKUP(B30,'manual inputs_secondary'!$B$4:$B$22,'manual inputs_secondary'!$D$4:$D$22))","v":""},"",{"$f":"IF($B30=\"\",\"\",IFERROR(INDEX('quantities report_secondary'!$D$2:$D$10003,SMALL(IF('quantities report_secondary'!$A$2:$A$10003=O$6,ROW('quantities report_secondary'!$A$2:$A$10003)-1,\"\"),ROWS($B$8:$B30))),\"0\"))","v":""},"",null,"",{"$f":"IF($B30=\"\",\"\",IFERROR(INDEX('quantities report_secondary'!$D$2:$D$10003,SMALL(IF('quantities report_secondary'!$A$2:$A$10003=S$6,ROW('quantities report_secondary'!$A$2:$A$10003)-1,\"\"),ROWS($B$8:$B30))),\"0\"))","v":""},{"$f":"IF($B30=\"\",\"\",Backfill_secondary!H30)","v":""},{"$f":"IF($B30=\"\",\"\",IFERROR(INDEX('quantities report_secondary'!$D$2:$D$10003,SMALL(IF('quantities report_secondary'!$A$2:$A$10003=U$6,ROW('quantities report_secondary'!$A$2:$A$10003)-1,\"\"),ROWS($B$8:$B30))),\"0\"))","v":""},{"$f":"IF($B30=\"\",\"\",IFERROR(INDEX('quantities report_secondary'!$D$2:$D$10003,SMALL(IF('quantities report_secondary'!$A$2:$A$10003=V$6,ROW('quantities report_secondary'!$A$2:$A$10003)-1,\"\"),ROWS($B$8:$B30))),\"0\"))","v":""},{"$f":"IF($B30=\"\",\"\",IFERROR(INDEX('quantities report_secondary'!$D$2:$D$10003,SMALL(IF('quantities report_secondary'!$A$2:$A$10003=W$6,ROW('quantities report_secondary'!$A$2:$A$10003)-1,\"\"),ROWS($B$8:$B30))),\"0\"))","v":""},{"$f":"IF($B30=\"\",\"\",IFERROR(INDEX('quantities report_secondary'!$D$2:$D$10003,SMALL(IF('quantities report_secondary'!$A$2:$A$10003=X$6,ROW('quantities report_secondary'!$A$2:$A$10003)-1,\"\"),ROWS($B$8:$B30))),\"0\"))","v":""},{"$f":"IF($B30=\"\",\"\",Backfill_secondary!R30)","v":""},{"$f":"IF($B30=\"\",\"\",Backfill_secondary!U30)","v":""},{"$f":"IF($B30=\"\",\"\",Removals_secondary!$G27)","v":""},{"$f":"IF($B30=\"\",\"\",Removals_secondary!$L27)","v":""},{"$f":"IF($B30=\"\",\"\",IFERROR(INDEX('quantities report_secondary'!$D$2:$D$10003,SMALL(IF('quantities report_secondary'!$A$2:$A$10003=AC$6,ROW('quantities report_secondary'!$A$2:$A$10003)-1,\"\"),ROWS($B$8:$B30))),\"0\"))","v":""},{"$f":"IF($B30=\"\",\"\",IFERROR(INDEX('quantities report_secondary'!$D$2:$D$10003,SMALL(IF('quantities report_secondary'!$A$2:$A$10003=AD$6,ROW('quantities report_secondary'!$A$2:$A$10003)-1,\"\"),ROWS($B$8:$B30))),\"0\"))","v":""},{"$f":"IF($B30=\"\",\"\",IFERROR(INDEX('quantities report_secondary'!$D$2:$D$10003,SMALL(IF('quantities report_secondary'!$A$2:$A$10003=AE$6,ROW('quantities report_secondary'!$A$2:$A$10003)-1,\"\"),ROWS($B$8:$B30))),\"0\"))","v":""},{"$f":"IF($B30=\"\",\"\",IFERROR(INDEX('quantities report_secondary'!$D$2:$D$10003,SMALL(IF('quantities report_secondary'!$A$2:$A$10003=AF$6,ROW('quantities report_secondary'!$A$2:$A$10003)-1,\"\"),ROWS($B$8:$B30))),\"0\"))","v":""},{"$f":"IF($B30=\"\",\"\",IFERROR(INDEX('quantities report_secondary'!$D$2:$D$10003,SMALL(IF('quantities report_secondary'!$A$2:$A$10003=AG$6,ROW('quantities report_secondary'!$A$2:$A$10003)-1,\"\"),ROWS($B$8:$B30))),\"0\"))","v":""},{"$f":"IF($B30=\"\",\"\",IFERROR(INDEX('quantities report_secondary'!$D$2:$D$10003,SMALL(IF('quantities report_secondary'!$A$2:$A$10003=AH$6,ROW('quantities report_secondary'!$A$2:$A$10003)-1,\"\"),ROWS($B$8:$B30))),\"0\"))","v":""},"","","","","",0.9,""," "]
[null,{"$f":"IFERROR(INDEX('manual inputs_secondary'!M:M,SMALL(IF('manual inputs_secondary'!M:M<>\"\",ROW('manual inputs_secondary'!M:M)),ROW(26:26))),\"\")","v":""},{"$f":"IF(B31=\"\",\"\",IFERROR(INDEX('quantities report_secondary'!$D$2:$D$10003,SMALL(IF('quantities report_secondary'!$A$2:$A$10003=C$6,ROW('quantities report_secondary'!$A$2:$A$10003)-1,\"\"),ROWS($B$8:$B31))),\"0\"))","v":""},"",null,"",{"$f":"IF($B31=\"\",\"\",Structure_Ex_secondary!I31)","v":""},null,{"$f":"IF($B31=\"\",\"\",IFERROR(INDEX('quantities report_secondary'!$D$2:$D$10003,SMALL(IF('quantities report_secondary'!$A$2:$A$10003=I$6,ROW('quantities report_secondary'!$A$2:$A$10003)-1,\"\"),ROWS($B$8:$B31))),\"0\"))","v":""},{"$f":"IF($B31=\"\",\"\",Removals_secondary!$F28)","v":""},{"$f":"IF($B31=\"\",\"\",Removals_secondary!$K28)","v":""},{"$f":"IF($B31=\"\",\"\",IFERROR(INDEX('quantities report_secondary'!$D$2:$D$10003,SMALL(IF('quantities report_secondary'!$A$2:$A$10003=L$6,ROW('quantities report_secondary'!$A$2:$A$10003)-1,\"\"),ROWS($B$8:$B31))),\"0\"))","v":""},{"$f":"IF(B31=\"\",\"\",LOOKUP(B31,'manual inputs_secondary'!$B$4:$B$22,'manual inputs_secondary'!$D$4:$D$22))","v":""},"",{"$f":"IF($B31=\"\",\"\",IFERROR(INDEX('quantities report_secondary'!$D$2:$D$10003,SMALL(IF('quantities report_secondary'!$A$2:$A$10003=O$6,ROW('quantities report_secondary'!$A$2:$A$10003)-1,\"\"),ROWS($B$8:$B31))),\"0\"))","v":""},"",null,"",{"$f":"IF($B31=\"\",\"\",IFERROR(INDEX('quantities report_secondary'!$D$2:$D$10003,SMALL(IF('quantities report_secondary'!$A$2:$A$10003=S$6,ROW('quantities report_secondary'!$A$2:$A$10003)-1,\"\"),ROWS($B$8:$B31))),\"0\"))","v":""},{"$f":"IF($B31=\"\",\"\",Backfill_secondary!H31)","v":""},{"$f":"IF($B31=\"\",\"\",IFERROR(INDEX('quantities report_secondary'!$D$2:$D$10003,SMALL(IF('quantities report_secondary'!$A$2:$A$10003=U$6,ROW('quantities report_secondary'!$A$2:$A$10003)-1,\"\"),ROWS($B$8:$B31))),\"0\"))","v":""},{"$f":"IF($B31=\"\",\"\",IFERROR(INDEX('quantities report_secondary'!$D$2:$D$10003,SMALL(IF('quantities report_secondary'!$A$2:$A$10003=V$6,ROW('quantities report_secondary'!$A$2:$A$10003)-1,\"\"),ROWS($B$8:$B31))),\"0\"))","v":""},{"$f":"IF($B31=\"\",\"\",IFERROR(INDEX('quantities report_secondary'!$D$2:$D$10003,SMALL(IF('quantities report_secondary'!$A$2:$A$10003=W$6,ROW('quantities report_secondary'!$A$2:$A$10003)-1,\"\"),ROWS($B$8:$B31))),\"0\"))","v":""},{"$f":"IF($B31=\"\",\"\",IFERROR(INDEX('quantities report_secondary'!$D$2:$D$10003,SMALL(IF('quantities report_secondary'!$A$2:$A$10003=X$6,ROW('quantities report_secondary'!$A$2:$A$10003)-1,\"\"),ROWS($B$8:$B31))),\"0\"))","v":""},{"$f":"IF($B31=\"\",\"\",Backfill_secondary!R31)","v":""},{"$f":"IF($B31=\"\",\"\",Backfill_secondary!U31)","v":""},{"$f":"IF($B31=\"\",\"\",Removals_secondary!$G28)","v":""},{"$f":"IF($B31=\"\",\"\",Removals_secondary!$L28)","v":""},{"$f":"IF($B31=\"\",\"\",IFERROR(INDEX('quantities report_secondary'!$D$2:$D$10003,SMALL(IF('quantities report_secondary'!$A$2:$A$10003=AC$6,ROW('quantities report_secondary'!$A$2:$A$10003)-1,\"\"),ROWS($B$8:$B31))),\"0\"))","v":""},{"$f":"IF($B31=\"\",\"\",IFERROR(INDEX('quantities report_secondary'!$D$2:$D$10003,SMALL(IF('quantities report_secondary'!$A$2:$A$10003=AD$6,ROW('quantities report_secondary'!$A$2:$A$10003)-1,\"\"),ROWS($B$8:$B31))),\"0\"))","v":""},{"$f":"IF($B31=\"\",\"\",IFERROR(INDEX('quantities report_secondary'!$D$2:$D$10003,SMALL(IF('quantities report_secondary'!$A$2:$A$10003=AE$6,ROW('quantities report_secondary'!$A$2:$A$10003)-1,\"\"),ROWS($B$8:$B31))),\"0\"))","v":""},{"$f":"IF($B31=\"\",\"\",IFERROR(INDEX('quantities report_secondary'!$D$2:$D$10003,SMALL(IF('quantities report_secondary'!$A$2:$A$10003=AF$6,ROW('quantities report_secondary'!$A$2:$A$10003)-1,\"\"),ROWS($B$8:$B31))),\"0\"))","v":""},{"$f":"IF($B31=\"\",\"\",IFERROR(INDEX('quantities report_secondary'!$D$2:$D$10003,SMALL(IF('quantities report_secondary'!$A$2:$A$10003=AG$6,ROW('quantities report_secondary'!$A$2:$A$10003)-1,\"\"),ROWS($B$8:$B31))),\"0\"))","v":""},{"$f":"IF($B31=\"\",\"\",IFERROR(INDEX('quantities report_secondary'!$D$2:$D$10003,SMALL(IF('quantities report_secondary'!$A$2:$A$10003=AH$6,ROW('quantities report_secondary'!$A$2:$A$10003)-1,\"\"),ROWS($B$8:$B31))),\"0\"))","v":""},"","","","","",0.9,""," "]
[null,{"$f":"IFERROR(INDEX(#REF!,SMALL(IF(#REF!<>\"\",ROW(#REF!)),ROW(27:27))),\"\")","v":""}]

{"sheet":"Removals_secondary","index":18,"n_rows":28,"n_cols":12,"rows_kept":28,"cut":false,"hidden":false,"merged":[]}
[]
[null,"TOTALS",{"$f":"SUM(C5:C28)","v":0},0,0,0,0,{"$f":"SUM(H5:H28)","v":0},{"$f":"SUM(I5:I28)","v":0},0,{"$f":"SUM(K5:K28)","v":0},0]
[null,"Station","Pavement Removed","Pavement Removed/Replaced","Total",null,null,"Topsoil Removed","Topsoil Removed/Replaced","Total"]
[null,null,"Exist Pvmt Layer 1 (removed): ","Exist Pvmt Layer 1 (removed and replaced): ","Total Exist Pvmt Layer 1: ","Pavement Removed","Pavement Removed/Replaced","Exist Topsoil (removed): ","Exist Topsoil (removed and replaced):","Total Exist Topsoil: ","Topsoil Removed","Topsoil Removed/Replaced"]
[null,{"$f":"IFERROR(INDEX('manual inputs_secondary'!M:M,SMALL(IF('manual inputs_secondary'!M:M<>\"\",ROW('manual inputs_secondary'!M:M)),ROW(3:3))),\"\")","v":""},{"$f":"IF($B5=\"\",\"\",VALUE(IFERROR(INDEX('quantities report_secondary'!$D$2:$D$10003,SMALL(IF('quantities report_secondary'!$A$2:$A$10003=C$4,ROW('quantities report_secondary'!$A$2:$A$10003)-1,\"\"),ROWS($B$5:$B5))),\"0\")))","v":""},{"$f":"IF($B5=\"\",\"\",VALUE(IFERROR(INDEX('quantities report_secondary'!$D$2:$D$10003,SMALL(IF('quantities report_secondary'!$A$2:$A$10003=D$4,ROW('quantities report_secondary'!$A$2:$A$10003)-1,\"\"),ROWS($B$5:$B5))),\"0\")))","v":""},{"$f":"IF($B5=\"\",\"\",VALUE(IFERROR(INDEX('quantities report_secondary'!$D$2:$D$10003,SMALL(IF('quantities report_secondary'!$A$2:$A$10003=E$4,ROW('quantities report_secondary'!$A$2:$A$10003)-1,\"\"),ROWS($B$5:$B5))),\"0\")))","v":""},{"$f":"IF(C5=0,(E5-D5),C5)","v":""},{"$f":"IF(D5=0,(E5-C5),D5)","v":""},{"$f":"IF($B5=\"\",\"\",IFERROR(INDEX('quantities report_secondary'!$D$2:$D$10003,SMALL(IF('quantities report_secondary'!$A$2:$A$10003=H$4,ROW('quantities report_secondary'!$A$2:$A$10003)-1,\"\"),ROWS($B$5:$B5))),\"0\"))","v":""},{"$f":"IF($B5=\"\",\"\",VALUE(IFERROR(INDEX('quantities report_secondary'!$D$2:$D$10003,SMALL(IF('quantities report_secondary'!$A$2:$A$10003=I$4,ROW('quantities report_secondary'!$A$2:$A$10003)-1,\"\"),ROWS($B$5:$B5))),\"0\")))","v":""},{"$f":"IF($B5=\"\",\"\",VALUE(IFERROR(INDEX('quantities report_secondary'!$D$2:$D$10003,SMALL(IF('quantities report_secondary'!$A$2:$A$10003=J$4,ROW('quantities report_secondary'!$A$2:$A$10003)-1,\"\"),ROWS($B$5:$B5))),\"0\")))","v":""},{"$f":"IF(H5=0,(J5-I5),H5)","v":""},{"$f":"IF(I5=0,(J5-H5),I5)","v":""}]
[null,{"$f":"IFERROR(INDEX('manual inputs_secondary'!M:M,SMALL(IF('manual inputs_secondary'!M:M<>\"\",ROW('manual inputs_secondary'!M:M)),ROW(4:4))),\"\")","v":""},{"$f":"IF($B6=\"\",\"\",VALUE(IFERROR(INDEX('quantities report_secondary'!$D$2:$D$10003,SMALL(IF('quantities report_secondary'!$A$2:$A$10003=C$4,ROW('quantities report_secondary'!$A$2:$A$10003)-1,\"\"),ROWS($B$5:$B6))),\"0\")))","v":""},{"$f":"IF($B6=\"\",\"\",VALUE(IFERROR(INDEX('quantities report_secondary'!$D$2:$D$10003,SMALL(IF('quantities report_secondary'!$A$2:$A$10003=D$4,ROW('quantities report_secondary'!$A$2:$A$10003)-1,\"\"),ROWS($B$5:$B6))),\"0\")))","v":""},{"$f":"IF($B6=\"\",\"\",VALUE(IFERROR(INDEX('quantities report_secondary'!$D$2:$D$10003,SMALL(IF('quantities report_secondary'!$A$2:$A$10003=E$4,ROW('quantities report_secondary'!$A$2:$A$10003)-1,\"\"),ROWS($B$5:$B6))),\"0\")))","v":""},{"$f":"IF(C6=0,(E6-D6),C6)","v":""},{"$f":"IF(D6=0,(E6-C6),D6)","v":""},{"$f":"IF($B6=\"\",\"\",IFERROR(INDEX('quantities report_secondary'!$D$2:$D$10003,SMALL(IF('quantities report_secondary'!$A$2:$A$10003=H$4,ROW('quantities report_secondary'!$A$2:$A$10003)-1,\"\"),ROWS($B$5:$B6))),\"0\"))","v":""},{"$f":"IF($B6=\"\",\"\",VALUE(IFERROR(INDEX('quantities report_secondary'!$D$2:$D$10003,SMALL(IF('quantities report_secondary'!$A$2:$A$10003=I$4,ROW('quantities report_secondary'!$A$2:$A$10003)-1,\"\"),ROWS($B$5:$B6))),\"0\")))","v":""},{"$f":"IF($B6=\"\",\"\",VALUE(IFERROR(INDEX('quantities report_secondary'!$D$2:$D$10003,SMALL(IF('quantities report_secondary'!$A$2:$A$10003=J$4,ROW('quantities report_secondary'!$A$2:$A$10003)-1,\"\"),ROWS($B$5:$B6))),\"0\")))","v":""},{"$f":"IF(H6=0,(J6-I6),H6)","v":""},{"$f":"IF(I6=0,(J6-H6),I6)","v":""}]
[null,{"$f":"IFERROR(INDEX('manual inputs_secondary'!M:M,SMALL(IF('manual inputs_secondary'!M:M<>\"\",ROW('manual inputs_secondary'!M:M)),ROW(5:5))),\"\")","v":""},{"$f":"IF($B7=\"\",\"\",VALUE(IFERROR(INDEX('quantities report_secondary'!$D$2:$D$10003,SMALL(IF('quantities report_secondary'!$A$2:$A$10003=C$4,ROW('quantities report_secondary'!$A$2:$A$10003)-1,\"\"),ROWS($B$5:$B7))),\"0\")))","v":""},{"$f":"IF($B7=\"\",\"\",VALUE(IFERROR(INDEX('quantities report_secondary'!$D$2:$D$10003,SMALL(IF('quantities report_secondary'!$A$2:$A$10003=D$4,ROW('quantities report_secondary'!$A$2:$A$10003)-1,\"\"),ROWS($B$5:$B7))),\"0\")))","v":""},{"$f":"IF($B7=\"\",\"\",VALUE(IFERROR(INDEX('quantities report_secondary'!$D$2:$D$10003,SMALL(IF('quantities report_secondary'!$A$2:$A$10003=E$4,ROW('quantities report_secondary'!$A$2:$A$10003)-1,\"\"),ROWS($B$5:$B7))),\"0\")))","v":""},"","",{"$f":"IF($B7=\"\",\"\",IFERROR(INDEX('quantities report_secondary'!$D$2:$D$10003,SMALL(IF('quantities report_secondary'!$A$2:$A$10003=H$4,ROW('quantities report_secondary'!$A$2:$A$10003)-1,\"\"),ROWS($B$5:$B7))),\"0\"))","v":""},{"$f":"IF($B7=\"\",\"\",VALUE(IFERROR(INDEX('quantities report_secondary'!$D$2:$D$10003,SMALL(IF('quantities report_secondary'!$A$2:$A$10003=I$4,ROW('quantities report_secondary'!$A$2:$A$10003)-1,\"\"),ROWS($B$5:$B7))),\"0\")))","v":""},{"$f":"IF($B7=\"\",\"\",VALUE(IFERROR(INDEX('quantities report_secondary'!$D$2:$D$10003,SMALL(IF('quantities report_secondary'!$A$2:$A$10003=J$4,ROW('quantities report_secondary'!$A$2:$A$10003)-1,\"\"),ROWS($B$5:$B7))),\"0\")))","v":""},"",""]
[null,{"$f":"IFERROR(INDEX('manual inputs_secondary'!M:M,SMALL(IF('manual inputs_secondary'!M:M<>\"\",ROW('manual inputs_secondary'!M:M)),ROW(6:6))),\"\")","v":""},{"$f":"IF($B8=\"\",\"\",VALUE(IFERROR(INDEX('quantities report_secondary'!$D$2:$D$10003,SMALL(IF('quantities report_secondary'!$A$2:$A$10003=C$4,ROW('quantities report_secondary'!$A$2:$A$10003)-1,\"\"),ROWS($B$5:$B8))),\"0\")))","v":""},{"$f":"IF($B8=\"\",\"\",VALUE(IFERROR(INDEX('quantities report_secondary'!$D$2:$D$10003,SMALL(IF('quantities report_secondary'!$A$2:$A$10003=D$4,ROW('quantities report_secondary'!$A$2:$A$10003)-1,\"\"),ROWS($B$5:$B8))),\"0\")))","v":""},{"$f":"IF($B8=\"\",\"\",VALUE(IFERROR(INDEX('quantities report_secondary'!$D$2:$D$10003,SMALL(IF('quantities report_secondary'!$A$2:$A$10003=E$4,ROW('quantities report_secondary'!$A$2:$A$10003)-1,\"\"),ROWS($B$5:$B8))),\"0\")))","v":""},"","",{"$f":"IF($B8=\"\",\"\",IFERROR(INDEX('quantities report_secondary'!$D$2:$D$10003,SMALL(IF('quantities report_secondary'!$A$2:$A$10003=H$4,ROW('quantities report_secondary'!$A$2:$A$10003)-1,\"\"),ROWS($B$5:$B8))),\"0\"))","v":""},{"$f":"IF($B8=\"\",\"\",VALUE(IFERROR(INDEX('quantities report_secondary'!$D$2:$D$10003,SMALL(IF('quantities report_secondary'!$A$2:$A$10003=I$4,ROW('quantities report_secondary'!$A$2:$A$10003)-1,\"\"),ROWS($B$5:$B8))),\"0\")))","v":""},{"$f":"IF($B8=\"\",\"\",VALUE(IFERROR(INDEX('quantities report_secondary'!$D$2:$D$10003,SMALL(IF('quantities report_secondary'!$A$2:$A$10003=J$4,ROW('quantities report_secondary'!$A$2:$A$10003)-1,\"\"),ROWS($B$5:$B8))),\"0\")))","v":""},"",""]
[null,{"$f":"IFERROR(INDEX('manual inputs_secondary'!M:M,SMALL(IF('manual inputs_secondary'!M:M<>\"\",ROW('manual inputs_secondary'!M:M)),ROW(7:7))),\"\")","v":""},{"$f":"IF($B9=\"\",\"\",VALUE(IFERROR(INDEX('quantities report_secondary'!$D$2:$D$10003,SMALL(IF('quantities report_secondary'!$A$2:$A$10003=C$4,ROW('quantities report_secondary'!$A$2:$A$10003)-1,\"\"),ROWS($B$5:$B9))),\"0\")))","v":""},{"$f":"IF($B9=\"\",\"\",VALUE(IFERROR(INDEX('quantities report_secondary'!$D$2:$D$10003,SMALL(IF('quantities report_secondary'!$A$2:$A$10003=D$4,ROW('quantities report_secondary'!$A$2:$A$10003)-1,\"\"),ROWS($B$5:$B9))),\"0\")))","v":""},{"$f":"IF($B9=\"\",\"\",VALUE(IFERROR(INDEX('quantities report_secondary'!$D$2:$D$10003,SMALL(IF('quantities report_secondary'!$A$2:$A$10003=E$4,ROW('quantities report_secondary'!$A$2:$A$10003)-1,\"\"),ROWS($B$5:$B9))),\"0\")))","v":""},"","",{"$f":"IF($B9=\"\",\"\",IFERROR(INDEX('quantities report_secondary'!$D$2:$D$10003,SMALL(IF('quantities report_secondary'!$A$2:$A$10003=H$4,ROW('quantities report_secondary'!$A$2:$A$10003)-1,\"\"),ROWS($B$5:$B9))),\"0\"))","v":""},{"$f":"IF($B9=\"\",\"\",VALUE(IFERROR(INDEX('quantities report_secondary'!$D$2:$D$10003,SMALL(IF('quantities report_secondary'!$A$2:$A$10003=I$4,ROW('quantities report_secondary'!$A$2:$A$10003)-1,\"\"),ROWS($B$5:$B9))),\"0\")))","v":""},{"$f":"IF($B9=\"\",\"\",VALUE(IFERROR(INDEX('quantities report_secondary'!$D$2:$D$10003,SMALL(IF('quantities report_secondary'!$A$2:$A$10003=J$4,ROW('quantities report_secondary'!$A$2:$A$10003)-1,\"\"),ROWS($B$5:$B9))),\"0\")))","v":""},"",""]
[null,{"$f":"IFERROR(INDEX('manual inputs_secondary'!M:M,SMALL(IF('manual inputs_secondary'!M:M<>\"\",ROW('manual inputs_secondary'!M:M)),ROW(8:8))),\"\")","v":""},{"$f":"IF($B10=\"\",\"\",VALUE(IFERROR(INDEX('quantities report_secondary'!$D$2:$D$10003,SMALL(IF('quantities report_secondary'!$A$2:$A$10003=C$4,ROW('quantities report_secondary'!$A$2:$A$10003)-1,\"\"),ROWS($B$5:$B10))),\"0\")))","v":""},{"$f":"IF($B10=\"\",\"\",VALUE(IFERROR(INDEX('quantities report_secondary'!$D$2:$D$10003,SMALL(IF('quantities report_secondary'!$A$2:$A$10003=D$4,ROW('quantities report_secondary'!$A$2:$A$10003)-1,\"\"),ROWS($B$5:$B10))),\"0\")))","v":""},{"$f":"IF($B10=\"\",\"\",VALUE(IFERROR(INDEX('quantities report_secondary'!$D$2:$D$10003,SMALL(IF('quantities report_secondary'!$A$2:$A$10003=E$4,ROW('quantities report_secondary'!$A$2:$A$10003)-1,\"\"),ROWS($B$5:$B10))),\"0\")))","v":""},"","",{"$f":"IF($B10=\"\",\"\",IFERROR(INDEX('quantities report_secondary'!$D$2:$D$10003,SMALL(IF('quantities report_secondary'!$A$2:$A$10003=H$4,ROW('quantities report_secondary'!$A$2:$A$10003)-1,\"\"),ROWS($B$5:$B10))),\"0\"))","v":""},{"$f":"IF($B10=\"\",\"\",VALUE(IFERROR(INDEX('quantities report_secondary'!$D$2:$D$10003,SMALL(IF('quantities report_secondary'!$A$2:$A$10003=I$4,ROW('quantities report_secondary'!$A$2:$A$10003)-1,\"\"),ROWS($B$5:$B10))),\"0\")))","v":""},{"$f":"IF($B10=\"\",\"\",VALUE(IFERROR(INDEX('quantities report_secondary'!$D$2:$D$10003,SMALL(IF('quantities report_secondary'!$A$2:$A$10003=J$4,ROW('quantities report_secondary'!$A$2:$A$10003)-1,\"\"),ROWS($B$5:$B10))),\"0\")))","v":""},"",""]
[null,{"$f":"IFERROR(INDEX('manual inputs_secondary'!M:M,SMALL(IF('manual inputs_secondary'!M:M<>\"\",ROW('manual inputs_secondary'!M:M)),ROW(9:9))),\"\")","v":""},{"$f":"IF($B11=\"\",\"\",VALUE(IFERROR(INDEX('quantities report_secondary'!$D$2:$D$10003,SMALL(IF('quantities report_secondary'!$A$2:$A$10003=C$4,ROW('quantities report_secondary'!$A$2:$A$10003)-1,\"\"),ROWS($B$5:$B11))),\"0\")))","v":""},{"$f":"IF($B11=\"\",\"\",VALUE(IFERROR(INDEX('quantities report_secondary'!$D$2:$D$10003,SMALL(IF('quantities report_secondary'!$A$2:$A$10003=D$4,ROW('quantities report_secondary'!$A$2:$A$10003)-1,\"\"),ROWS($B$5:$B11))),\"0\")))","v":""},{"$f":"IF($B11=\"\",\"\",VALUE(IFERROR(INDEX('quantities report_secondary'!$D$2:$D$10003,SMALL(IF('quantities report_secondary'!$A$2:$A$10003=E$4,ROW('quantities report_secondary'!$A$2:$A$10003)-1,\"\"),ROWS($B$5:$B11))),\"0\")))","v":""},"","",{"$f":"IF($B11=\"\",\"\",IFERROR(INDEX('quantities report_secondary'!$D$2:$D$10003,SMALL(IF('quantities report_secondary'!$A$2:$A$10003=H$4,ROW('quantities report_secondary'!$A$2:$A$10003)-1,\"\"),ROWS($B$5:$B11))),\"0\"))","v":""},{"$f":"IF($B11=\"\",\"\",VALUE(IFERROR(INDEX('quantities report_secondary'!$D$2:$D$10003,SMALL(IF('quantities report_secondary'!$A$2:$A$10003=I$4,ROW('quantities report_secondary'!$A$2:$A$10003)-1,\"\"),ROWS($B$5:$B11))),\"0\")))","v":""},{"$f":"IF($B11=\"\",\"\",VALUE(IFERROR(INDEX('quantities report_secondary'!$D$2:$D$10003,SMALL(IF('quantities report_secondary'!$A$2:$A$10003=J$4,ROW('quantities report_secondary'!$A$2:$A$10003)-1,\"\"),ROWS($B$5:$B11))),\"0\")))","v":""},"",""]
[null,{"$f":"IFERROR(INDEX('manual inputs_secondary'!M:M,SMALL(IF('manual inputs_secondary'!M:M<>\"\",ROW('manual inputs_secondary'!M:M)),ROW(10:10))),\"\")","v":""},{"$f":"IF($B12=\"\",\"\",VALUE(IFERROR(INDEX('quantities report_secondary'!$D$2:$D$10003,SMALL(IF('quantities report_secondary'!$A$2:$A$10003=C$4,ROW('quantities report_secondary'!$A$2:$A$10003)-1,\"\"),ROWS($B$5:$B12))),\"0\")))","v":""},{"$f":"IF($B12=\"\",\"\",VALUE(IFERROR(INDEX('quantities report_secondary'!$D$2:$D$10003,SMALL(IF('quantities report_secondary'!$A$2:$A$10003=D$4,ROW('quantities report_secondary'!$A$2:$A$10003)-1,\"\"),ROWS($B$5:$B12))),\"0\")))","v":""},{"$f":"IF($B12=\"\",\"\",VALUE(IFERROR(INDEX('quantities report_secondary'!$D$2:$D$10003,SMALL(IF('quantities report_secondary'!$A$2:$A$10003=E$4,ROW('quantities report_secondary'!$A$2:$A$10003)-1,\"\"),ROWS($B$5:$B12))),\"0\")))","v":""},"","",{"$f":"IF($B12=\"\",\"\",IFERROR(INDEX('quantities report_secondary'!$D$2:$D$10003,SMALL(IF('quantities report_secondary'!$A$2:$A$10003=H$4,ROW('quantities report_secondary'!$A$2:$A$10003)-1,\"\"),ROWS($B$5:$B12))),\"0\"))","v":""},{"$f":"IF($B12=\"\",\"\",VALUE(IFERROR(INDEX('quantities report_secondary'!$D$2:$D$10003,SMALL(IF('quantities report_secondary'!$A$2:$A$10003=I$4,ROW('quantities report_secondary'!$A$2:$A$10003)-1,\"\"),ROWS($B$5:$B12))),\"0\")))","v":""},{"$f":"IF($B12=\"\",\"\",VALUE(IFERROR(INDEX('quantities report_secondary'!$D$2:$D$10003,SMALL(IF('quantities report_secondary'!$A$2:$A$10003=J$4,ROW('quantities report_secondary'!$A$2:$A$10003)-1,\"\"),ROWS($B$5:$B12))),\"0\")))","v":""},"",""]
[null,{"$f":"IFERROR(INDEX('manual inputs_secondary'!M:M,SMALL(IF('manual inputs_secondary'!M:M<>\"\",ROW('manual inputs_secondary'!M:M)),ROW(11:11))),\"\")","v":""},{"$f":"IF($B13=\"\",\"\",VALUE(IFERROR(INDEX('quantities report_secondary'!$D$2:$D$10003,SMALL(IF('quantities report_secondary'!$A$2:$A$10003=C$4,ROW('quantities report_secondary'!$A$2:$A$10003)-1,\"\"),ROWS($B$5:$B13))),\"0\")))","v":""},{"$f":"IF($B13=\"\",\"\",VALUE(IFERROR(INDEX('quantities report_secondary'!$D$2:$D$10003,SMALL(IF('quantities report_secondary'!$A$2:$A$10003=D$4,ROW('quantities report_secondary'!$A$2:$A$10003)-1,\"\"),ROWS($B$5:$B13))),\"0\")))","v":""},{"$f":"IF($B13=\"\",\"\",VALUE(IFERROR(INDEX('quantities report_secondary'!$D$2:$D$10003,SMALL(IF('quantities report_secondary'!$A$2:$A$10003=E$4,ROW('quantities report_secondary'!$A$2:$A$10003)-1,\"\"),ROWS($B$5:$B13))),\"0\")))","v":""},"","",{"$f":"IF($B13=\"\",\"\",IFERROR(INDEX('quantities report_secondary'!$D$2:$D$10003,SMALL(IF('quantities report_secondary'!$A$2:$A$10003=H$4,ROW('quantities report_secondary'!$A$2:$A$10003)-1,\"\"),ROWS($B$5:$B13))),\"0\"))","v":""},{"$f":"IF($B13=\"\",\"\",VALUE(IFERROR(INDEX('quantities report_secondary'!$D$2:$D$10003,SMALL(IF('quantities report_secondary'!$A$2:$A$10003=I$4,ROW('quantities report_secondary'!$A$2:$A$10003)-1,\"\"),ROWS($B$5:$B13))),\"0\")))","v":""},{"$f":"IF($B13=\"\",\"\",VALUE(IFERROR(INDEX('quantities report_secondary'!$D$2:$D$10003,SMALL(IF('quantities report_secondary'!$A$2:$A$10003=J$4,ROW('quantities report_secondary'!$A$2:$A$10003)-1,\"\"),ROWS($B$5:$B13))),\"0\")))","v":""},"",""]
[null,{"$f":"IFERROR(INDEX('manual inputs_secondary'!M:M,SMALL(IF('manual inputs_secondary'!M:M<>\"\",ROW('manual inputs_secondary'!M:M)),ROW(12:12))),\"\")","v":""},{"$f":"IF($B14=\"\",\"\",VALUE(IFERROR(INDEX('quantities report_secondary'!$D$2:$D$10003,SMALL(IF('quantities report_secondary'!$A$2:$A$10003=C$4,ROW('quantities report_secondary'!$A$2:$A$10003)-1,\"\"),ROWS($B$5:$B14))),\"0\")))","v":""},{"$f":"IF($B14=\"\",\"\",VALUE(IFERROR(INDEX('quantities report_secondary'!$D$2:$D$10003,SMALL(IF('quantities report_secondary'!$A$2:$A$10003=D$4,ROW('quantities report_secondary'!$A$2:$A$10003)-1,\"\"),ROWS($B$5:$B14))),\"0\")))","v":""},{"$f":"IF($B14=\"\",\"\",VALUE(IFERROR(INDEX('quantities report_secondary'!$D$2:$D$10003,SMALL(IF('quantities report_secondary'!$A$2:$A$10003=E$4,ROW('quantities report_secondary'!$A$2:$A$10003)-1,\"\"),ROWS($B$5:$B14))),\"0\")))","v":""},"","",{"$f":"IF($B14=\"\",\"\",IFERROR(INDEX('quantities report_secondary'!$D$2:$D$10003,SMALL(IF('quantities report_secondary'!$A$2:$A$10003=H$4,ROW('quantities report_secondary'!$A$2:$A$10003)-1,\"\"),ROWS($B$5:$B14))),\"0\"))","v":""},{"$f":"IF($B14=\"\",\"\",VALUE(IFERROR(INDEX('quantities report_secondary'!$D$2:$D$10003,SMALL(IF('quantities report_secondary'!$A$2:$A$10003=I$4,ROW('quantities report_secondary'!$A$2:$A$10003)-1,\"\"),ROWS($B$5:$B14))),\"0\")))","v":""},{"$f":"IF($B14=\"\",\"\",VALUE(IFERROR(INDEX('quantities report_secondary'!$D$2:$D$10003,SMALL(IF('quantities report_secondary'!$A$2:$A$10003=J$4,ROW('quantities report_secondary'!$A$2:$A$10003)-1,\"\"),ROWS($B$5:$B14))),\"0\")))","v":""},"",""]
[null,{"$f":"IFERROR(INDEX('manual inputs_secondary'!M:M,SMALL(IF('manual inputs_secondary'!M:M<>\"\",ROW('manual inputs_secondary'!M:M)),ROW(13:13))),\"\")","v":""},{"$f":"IF($B15=\"\",\"\",VALUE(IFERROR(INDEX('quantities report_secondary'!$D$2:$D$10003,SMALL(IF('quantities report_secondary'!$A$2:$A$10003=C$4,ROW('quantities report_secondary'!$A$2:$A$10003)-1,\"\"),ROWS($B$5:$B15))),\"0\")))","v":""},{"$f":"IF($B15=\"\",\"\",VALUE(IFERROR(INDEX('quantities report_secondary'!$D$2:$D$10003,SMALL(IF('quantities report_secondary'!$A$2:$A$10003=D$4,ROW('quantities report_secondary'!$A$2:$A$10003)-1,\"\"),ROWS($B$5:$B15))),\"0\")))","v":""},{"$f":"IF($B15=\"\",\"\",VALUE(IFERROR(INDEX('quantities report_secondary'!$D$2:$D$10003,SMALL(IF('quantities report_secondary'!$A$2:$A$10003=E$4,ROW('quantities report_secondary'!$A$2:$A$10003)-1,\"\"),ROWS($B$5:$B15))),\"0\")))","v":""},"","",{"$f":"IF($B15=\"\",\"\",IFERROR(INDEX('quantities report_secondary'!$D$2:$D$10003,SMALL(IF('quantities report_secondary'!$A$2:$A$10003=H$4,ROW('quantities report_secondary'!$A$2:$A$10003)-1,\"\"),ROWS($B$5:$B15))),\"0\"))","v":""},{"$f":"IF($B15=\"\",\"\",VALUE(IFERROR(INDEX('quantities report_secondary'!$D$2:$D$10003,SMALL(IF('quantities report_secondary'!$A$2:$A$10003=I$4,ROW('quantities report_secondary'!$A$2:$A$10003)-1,\"\"),ROWS($B$5:$B15))),\"0\")))","v":""},{"$f":"IF($B15=\"\",\"\",VALUE(IFERROR(INDEX('quantities report_secondary'!$D$2:$D$10003,SMALL(IF('quantities report_secondary'!$A$2:$A$10003=J$4,ROW('quantities report_secondary'!$A$2:$A$10003)-1,\"\"),ROWS($B$5:$B15))),\"0\")))","v":""},"",""]
[null,{"$f":"IFERROR(INDEX('manual inputs_secondary'!M:M,SMALL(IF('manual inputs_secondary'!M:M<>\"\",ROW('manual inputs_secondary'!M:M)),ROW(14:14))),\"\")","v":""},{"$f":"IF($B16=\"\",\"\",VALUE(IFERROR(INDEX('quantities report_secondary'!$D$2:$D$10003,SMALL(IF('quantities report_secondary'!$A$2:$A$10003=C$4,ROW('quantities report_secondary'!$A$2:$A$10003)-1,\"\"),ROWS($B$5:$B16))),\"0\")))","v":""},{"$f":"IF($B16=\"\",\"\",VALUE(IFERROR(INDEX('quantities report_secondary'!$D$2:$D$10003,SMALL(IF('quantities report_secondary'!$A$2:$A$10003=D$4,ROW('quantities report_secondary'!$A$2:$A$10003)-1,\"\"),ROWS($B$5:$B16))),\"0\")))","v":""},{"$f":"IF($B16=\"\",\"\",VALUE(IFERROR(INDEX('quantities report_secondary'!$D$2:$D$10003,SMALL(IF('quantities report_secondary'!$A$2:$A$10003=E$4,ROW('quantities report_secondary'!$A$2:$A$10003)-1,\"\"),ROWS($B$5:$B16))),\"0\")))","v":""},"","",{"$f":"IF($B16=\"\",\"\",IFERROR(INDEX('quantities report_secondary'!$D$2:$D$10003,SMALL(IF('quantities report_secondary'!$A$2:$A$10003=H$4,ROW('quantities report_secondary'!$A$2:$A$10003)-1,\"\"),ROWS($B$5:$B16))),\"0\"))","v":""},{"$f":"IF($B16=\"\",\"\",VALUE(IFERROR(INDEX('quantities report_secondary'!$D$2:$D$10003,SMALL(IF('quantities report_secondary'!$A$2:$A$10003=I$4,ROW('quantities report_secondary'!$A$2:$A$10003)-1,\"\"),ROWS($B$5:$B16))),\"0\")))","v":""},{"$f":"IF($B16=\"\",\"\",VALUE(IFERROR(INDEX('quantities report_secondary'!$D$2:$D$10003,SMALL(IF('quantities report_secondary'!$A$2:$A$10003=J$4,ROW('quantities report_secondary'!$A$2:$A$10003)-1,\"\"),ROWS($B$5:$B16))),\"0\")))","v":""},"",""]
[null,{"$f":"IFERROR(INDEX('manual inputs_secondary'!M:M,SMALL(IF('manual inputs_secondary'!M:M<>\"\",ROW('manual inputs_secondary'!M:M)),ROW(15:15))),\"\")","v":""},{"$f":"IF($B17=\"\",\"\",VALUE(IFERROR(INDEX('quantities report_secondary'!$D$2:$D$10003,SMALL(IF('quantities report_secondary'!$A$2:$A$10003=C$4,ROW('quantities report_secondary'!$A$2:$A$10003)-1,\"\"),ROWS($B$5:$B17))),\"0\")))","v":""},{"$f":"IF($B17=\"\",\"\",VALUE(IFERROR(INDEX('quantities report_secondary'!$D$2:$D$10003,SMALL(IF('quantities report_secondary'!$A$2:$A$10003=D$4,ROW('quantities report_secondary'!$A$2:$A$10003)-1,\"\"),ROWS($B$5:$B17))),\"0\")))","v":""},{"$f":"IF($B17=\"\",\"\",VALUE(IFERROR(INDEX('quantities report_secondary'!$D$2:$D$10003,SMALL(IF('quantities report_secondary'!$A$2:$A$10003=E$4,ROW('quantities report_secondary'!$A$2:$A$10003)-1,\"\"),ROWS($B$5:$B17))),\"0\")))","v":""},"","",{"$f":"IF($B17=\"\",\"\",IFERROR(INDEX('quantities report_secondary'!$D$2:$D$10003,SMALL(IF('quantities report_secondary'!$A$2:$A$10003=H$4,ROW('quantities report_secondary'!$A$2:$A$10003)-1,\"\"),ROWS($B$5:$B17))),\"0\"))","v":""},{"$f":"IF($B17=\"\",\"\",VALUE(IFERROR(INDEX('quantities report_secondary'!$D$2:$D$10003,SMALL(IF('quantities report_secondary'!$A$2:$A$10003=I$4,ROW('quantities report_secondary'!$A$2:$A$10003)-1,\"\"),ROWS($B$5:$B17))),\"0\")))","v":""},{"$f":"IF($B17=\"\",\"\",VALUE(IFERROR(INDEX('quantities report_secondary'!$D$2:$D$10003,SMALL(IF('quantities report_secondary'!$A$2:$A$10003=J$4,ROW('quantities report_secondary'!$A$2:$A$10003)-1,\"\"),ROWS($B$5:$B17))),\"0\")))","v":""},"",""]
[null,{"$f":"IFERROR(INDEX('manual inputs_secondary'!M:M,SMALL(IF('manual inputs_secondary'!M:M<>\"\",ROW('manual inputs_secondary'!M:M)),ROW(16:16))),\"\")","v":""},{"$f":"IF($B18=\"\",\"\",VALUE(IFERROR(INDEX('quantities report_secondary'!$D$2:$D$10003,SMALL(IF('quantities report_secondary'!$A$2:$A$10003=C$4,ROW('quantities report_secondary'!$A$2:$A$10003)-1,\"\"),ROWS($B$5:$B18))),\"0\")))","v":""},{"$f":"IF($B18=\"\",\"\",VALUE(IFERROR(INDEX('quantities report_secondary'!$D$2:$D$10003,SMALL(IF('quantities report_secondary'!$A$2:$A$10003=D$4,ROW('quantities report_secondary'!$A$2:$A$10003)-1,\"\"),ROWS($B$5:$B18))),\"0\")))","v":""},{"$f":"IF($B18=\"\",\"\",VALUE(IFERROR(INDEX('quantities report_secondary'!$D$2:$D$10003,SMALL(IF('quantities report_secondary'!$A$2:$A$10003=E$4,ROW('quantities report_secondary'!$A$2:$A$10003)-1,\"\"),ROWS($B$5:$B18))),\"0\")))","v":""},"","",{"$f":"IF($B18=\"\",\"\",IFERROR(INDEX('quantities report_secondary'!$D$2:$D$10003,SMALL(IF('quantities report_secondary'!$A$2:$A$10003=H$4,ROW('quantities report_secondary'!$A$2:$A$10003)-1,\"\"),ROWS($B$5:$B18))),\"0\"))","v":""},{"$f":"IF($B18=\"\",\"\",VALUE(IFERROR(INDEX('quantities report_secondary'!$D$2:$D$10003,SMALL(IF('quantities report_secondary'!$A$2:$A$10003=I$4,ROW('quantities report_secondary'!$A$2:$A$10003)-1,\"\"),ROWS($B$5:$B18))),\"0\")))","v":""},{"$f":"IF($B18=\"\",\"\",VALUE(IFERROR(INDEX('quantities report_secondary'!$D$2:$D$10003,SMALL(IF('quantities report_secondary'!$A$2:$A$10003=J$4,ROW('quantities report_secondary'!$A$2:$A$10003)-1,\"\"),ROWS($B$5:$B18))),\"0\")))","v":""},"",""]
[null,{"$f":"IFERROR(INDEX('manual inputs_secondary'!M:M,SMALL(IF('manual inputs_secondary'!M:M<>\"\",ROW('manual inputs_secondary'!M:M)),ROW(17:17))),\"\")","v":""},{"$f":"IF($B19=\"\",\"\",VALUE(IFERROR(INDEX('quantities report_secondary'!$D$2:$D$10003,SMALL(IF('quantities report_secondary'!$A$2:$A$10003=C$4,ROW('quantities report_secondary'!$A$2:$A$10003)-1,\"\"),ROWS($B$5:$B19))),\"0\")))","v":""},{"$f":"IF($B19=\"\",\"\",VALUE(IFERROR(INDEX('quantities report_secondary'!$D$2:$D$10003,SMALL(IF('quantities report_secondary'!$A$2:$A$10003=D$4,ROW('quantities report_secondary'!$A$2:$A$10003)-1,\"\"),ROWS($B$5:$B19))),\"0\")))","v":""},{"$f":"IF($B19=\"\",\"\",VALUE(IFERROR(INDEX('quantities report_secondary'!$D$2:$D$10003,SMALL(IF('quantities report_secondary'!$A$2:$A$10003=E$4,ROW('quantities report_secondary'!$A$2:$A$10003)-1,\"\"),ROWS($B$5:$B19))),\"0\")))","v":""},"","",{"$f":"IF($B19=\"\",\"\",IFERROR(INDEX('quantities report_secondary'!$D$2:$D$10003,SMALL(IF('quantities report_secondary'!$A$2:$A$10003=H$4,ROW('quantities report_secondary'!$A$2:$A$10003)-1,\"\"),ROWS($B$5:$B19))),\"0\"))","v":""},{"$f":"IF($B19=\"\",\"\",VALUE(IFERROR(INDEX('quantities report_secondary'!$D$2:$D$10003,SMALL(IF('quantities report_secondary'!$A$2:$A$10003=I$4,ROW('quantities report_secondary'!$A$2:$A$10003)-1,\"\"),ROWS($B$5:$B19))),\"0\")))","v":""},{"$f":"IF($B19=\"\",\"\",VALUE(IFERROR(INDEX('quantities report_secondary'!$D$2:$D$10003,SMALL(IF('quantities report_secondary'!$A$2:$A$10003=J$4,ROW('quantities report_secondary'!$A$2:$A$10003)-1,\"\"),ROWS($B$5:$B19))),\"0\")))","v":""},"",""]
[null,{"$f":"IFERROR(INDEX('manual inputs_secondary'!M:M,SMALL(IF('manual inputs_secondary'!M:M<>\"\",ROW('manual inputs_secondary'!M:M)),ROW(18:18))),\"\")","v":""},{"$f":"IF($B20=\"\",\"\",VALUE(IFERROR(INDEX('quantities report_secondary'!$D$2:$D$10003,SMALL(IF('quantities report_secondary'!$A$2:$A$10003=C$4,ROW('quantities report_secondary'!$A$2:$A$10003)-1,\"\"),ROWS($B$5:$B20))),\"0\")))","v":""},{"$f":"IF($B20=\"\",\"\",VALUE(IFERROR(INDEX('quantities report_secondary'!$D$2:$D$10003,SMALL(IF('quantities report_secondary'!$A$2:$A$10003=D$4,ROW('quantities report_secondary'!$A$2:$A$10003)-1,\"\"),ROWS($B$5:$B20))),\"0\")))","v":""},{"$f":"IF($B20=\"\",\"\",VALUE(IFERROR(INDEX('quantities report_secondary'!$D$2:$D$10003,SMALL(IF('quantities report_secondary'!$A$2:$A$10003=E$4,ROW('quantities report_secondary'!$A$2:$A$10003)-1,\"\"),ROWS($B$5:$B20))),\"0\")))","v":""},"","",{"$f":"IF($B20=\"\",\"\",IFERROR(INDEX('quantities report_secondary'!$D$2:$D$10003,SMALL(IF('quantities report_secondary'!$A$2:$A$10003=H$4,ROW('quantities report_secondary'!$A$2:$A$10003)-1,\"\"),ROWS($B$5:$B20))),\"0\"))","v":""},{"$f":"IF($B20=\"\",\"\",VALUE(IFERROR(INDEX('quantities report_secondary'!$D$2:$D$10003,SMALL(IF('quantities report_secondary'!$A$2:$A$10003=I$4,ROW('quantities report_secondary'!$A$2:$A$10003)-1,\"\"),ROWS($B$5:$B20))),\"0\")))","v":""},{"$f":"IF($B20=\"\",\"\",VALUE(IFERROR(INDEX('quantities report_secondary'!$D$2:$D$10003,SMALL(IF('quantities report_secondary'!$A$2:$A$10003=J$4,ROW('quantities report_secondary'!$A$2:$A$10003)-1,\"\"),ROWS($B$5:$B20))),\"0\")))","v":""},"",""]
[null,{"$f":"IFERROR(INDEX('manual inputs_secondary'!M:M,SMALL(IF('manual inputs_secondary'!M:M<>\"\",ROW('manual inputs_secondary'!M:M)),ROW(19:19))),\"\")","v":""},{"$f":"IF($B21=\"\",\"\",VALUE(IFERROR(INDEX('quantities report_secondary'!$D$2:$D$10003,SMALL(IF('quantities report_secondary'!$A$2:$A$10003=C$4,ROW('quantities report_secondary'!$A$2:$A$10003)-1,\"\"),ROWS($B$5:$B21))),\"0\")))","v":""},{"$f":"IF($B21=\"\",\"\",VALUE(IFERROR(INDEX('quantities report_secondary'!$D$2:$D$10003,SMALL(IF('quantities report_secondary'!$A$2:$A$10003=D$4,ROW('quantities report_secondary'!$A$2:$A$10003)-1,\"\"),ROWS($B$5:$B21))),\"0\")))","v":""},{"$f":"IF($B21=\"\",\"\",VALUE(IFERROR(INDEX('quantities report_secondary'!$D$2:$D$10003,SMALL(IF('quantities report_secondary'!$A$2:$A$10003=E$4,ROW('quantities report_secondary'!$A$2:$A$10003)-1,\"\"),ROWS($B$5:$B21))),\"0\")))","v":""},"","",{"$f":"IF($B21=\"\",\"\",IFERROR(INDEX('quantities report_secondary'!$D$2:$D$10003,SMALL(IF('quantities report_secondary'!$A$2:$A$10003=H$4,ROW('quantities report_secondary'!$A$2:$A$10003)-1,\"\"),ROWS($B$5:$B21))),\"0\"))","v":""},{"$f":"IF($B21=\"\",\"\",VALUE(IFERROR(INDEX('quantities report_secondary'!$D$2:$D$10003,SMALL(IF('quantities report_secondary'!$A$2:$A$10003=I$4,ROW('quantities report_secondary'!$A$2:$A$10003)-1,\"\"),ROWS($B$5:$B21))),\"0\")))","v":""},{"$f":"IF($B21=\"\",\"\",VALUE(IFERROR(INDEX('quantities report_secondary'!$D$2:$D$10003,SMALL(IF('quantities report_secondary'!$A$2:$A$10003=J$4,ROW('quantities report_secondary'!$A$2:$A$10003)-1,\"\"),ROWS($B$5:$B21))),\"0\")))","v":""},"",""]
[null,{"$f":"IFERROR(INDEX('manual inputs_secondary'!M:M,SMALL(IF('manual inputs_secondary'!M:M<>\"\",ROW('manual inputs_secondary'!M:M)),ROW(20:20))),\"\")","v":""},{"$f":"IF($B22=\"\",\"\",VALUE(IFERROR(INDEX('quantities report_secondary'!$D$2:$D$10003,SMALL(IF('quantities report_secondary'!$A$2:$A$10003=C$4,ROW('quantities report_secondary'!$A$2:$A$10003)-1,\"\"),ROWS($B$5:$B22))),\"0\")))","v":""},{"$f":"IF($B22=\"\",\"\",VALUE(IFERROR(INDEX('quantities report_secondary'!$D$2:$D$10003,SMALL(IF('quantities report_secondary'!$A$2:$A$10003=D$4,ROW('quantities report_secondary'!$A$2:$A$10003)-1,\"\"),ROWS($B$5:$B22))),\"0\")))","v":""},{"$f":"IF($B22=\"\",\"\",VALUE(IFERROR(INDEX('quantities report_secondary'!$D$2:$D$10003,SMALL(IF('quantities report_secondary'!$A$2:$A$10003=E$4,ROW('quantities report_secondary'!$A$2:$A$10003)-1,\"\"),ROWS($B$5:$B22))),\"0\")))","v":""},"","",{"$f":"IF($B22=\"\",\"\",IFERROR(INDEX('quantities report_secondary'!$D$2:$D$10003,SMALL(IF('quantities report_secondary'!$A$2:$A$10003=H$4,ROW('quantities report_secondary'!$A$2:$A$10003)-1,\"\"),ROWS($B$5:$B22))),\"0\"))","v":""},{"$f":"IF($B22=\"\",\"\",VALUE(IFERROR(INDEX('quantities report_secondary'!$D$2:$D$10003,SMALL(IF('quantities report_secondary'!$A$2:$A$10003=I$4,ROW('quantities report_secondary'!$A$2:$A$10003)-1,\"\"),ROWS($B$5:$B22))),\"0\")))","v":""},{"$f":"IF($B22=\"\",\"\",VALUE(IFERROR(INDEX('quantities report_secondary'!$D$2:$D$10003,SMALL(IF('quantities report_secondary'!$A$2:$A$10003=J$4,ROW('quantities report_secondary'!$A$2:$A$10003)-1,\"\"),ROWS($B$5:$B22))),\"0\")))","v":""},"",""]
[null,{"$f":"IFERROR(INDEX('manual inputs_secondary'!M:M,SMALL(IF('manual inputs_secondary'!M:M<>\"\",ROW('manual inputs_secondary'!M:M)),ROW(21:21))),\"\")","v":""},{"$f":"IF($B23=\"\",\"\",VALUE(IFERROR(INDEX('quantities report_secondary'!$D$2:$D$10003,SMALL(IF('quantities report_secondary'!$A$2:$A$10003=C$4,ROW('quantities report_secondary'!$A$2:$A$10003)-1,\"\"),ROWS($B$5:$B23))),\"0\")))","v":""},{"$f":"IF($B23=\"\",\"\",VALUE(IFERROR(INDEX('quantities report_secondary'!$D$2:$D$10003,SMALL(IF('quantities report_secondary'!$A$2:$A$10003=D$4,ROW('quantities report_secondary'!$A$2:$A$10003)-1,\"\"),ROWS($B$5:$B23))),\"0\")))","v":""},{"$f":"IF($B23=\"\",\"\",VALUE(IFERROR(INDEX('quantities report_secondary'!$D$2:$D$10003,SMALL(IF('quantities report_secondary'!$A$2:$A$10003=E$4,ROW('quantities report_secondary'!$A$2:$A$10003)-1,\"\"),ROWS($B$5:$B23))),\"0\")))","v":""},"","",{"$f":"IF($B23=\"\",\"\",IFERROR(INDEX('quantities report_secondary'!$D$2:$D$10003,SMALL(IF('quantities report_secondary'!$A$2:$A$10003=H$4,ROW('quantities report_secondary'!$A$2:$A$10003)-1,\"\"),ROWS($B$5:$B23))),\"0\"))","v":""},{"$f":"IF($B23=\"\",\"\",VALUE(IFERROR(INDEX('quantities report_secondary'!$D$2:$D$10003,SMALL(IF('quantities report_secondary'!$A$2:$A$10003=I$4,ROW('quantities report_secondary'!$A$2:$A$10003)-1,\"\"),ROWS($B$5:$B23))),\"0\")))","v":""},{"$f":"IF($B23=\"\",\"\",VALUE(IFERROR(INDEX('quantities report_secondary'!$D$2:$D$10003,SMALL(IF('quantities report_secondary'!$A$2:$A$10003=J$4,ROW('quantities report_secondary'!$A$2:$A$10003)-1,\"\"),ROWS($B$5:$B23))),\"0\")))","v":""},"",""]
[null,{"$f":"IFERROR(INDEX('manual inputs_secondary'!M:M,SMALL(IF('manual inputs_secondary'!M:M<>\"\",ROW('manual inputs_secondary'!M:M)),ROW(22:22))),\"\")","v":""},{"$f":"IF($B24=\"\",\"\",VALUE(IFERROR(INDEX('quantities report_secondary'!$D$2:$D$10003,SMALL(IF('quantities report_secondary'!$A$2:$A$10003=C$4,ROW('quantities report_secondary'!$A$2:$A$10003)-1,\"\"),ROWS($B$5:$B24))),\"0\")))","v":""},{"$f":"IF($B24=\"\",\"\",VALUE(IFERROR(INDEX('quantities report_secondary'!$D$2:$D$10003,SMALL(IF('quantities report_secondary'!$A$2:$A$10003=D$4,ROW('quantities report_secondary'!$A$2:$A$10003)-1,\"\"),ROWS($B$5:$B24))),\"0\")))","v":""},{"$f":"IF($B24=\"\",\"\",VALUE(IFERROR(INDEX('quantities report_secondary'!$D$2:$D$10003,SMALL(IF('quantities report_secondary'!$A$2:$A$10003=E$4,ROW('quantities report_secondary'!$A$2:$A$10003)-1,\"\"),ROWS($B$5:$B24))),\"0\")))","v":""},"","",{"$f":"IF($B24=\"\",\"\",IFERROR(INDEX('quantities report_secondary'!$D$2:$D$10003,SMALL(IF('quantities report_secondary'!$A$2:$A$10003=H$4,ROW('quantities report_secondary'!$A$2:$A$10003)-1,\"\"),ROWS($B$5:$B24))),\"0\"))","v":""},{"$f":"IF($B24=\"\",\"\",VALUE(IFERROR(INDEX('quantities report_secondary'!$D$2:$D$10003,SMALL(IF('quantities report_secondary'!$A$2:$A$10003=I$4,ROW('quantities report_secondary'!$A$2:$A$10003)-1,\"\"),ROWS($B$5:$B24))),\"0\")))","v":""},{"$f":"IF($B24=\"\",\"\",VALUE(IFERROR(INDEX('quantities report_secondary'!$D$2:$D$10003,SMALL(IF('quantities report_secondary'!$A$2:$A$10003=J$4,ROW('quantities report_secondary'!$A$2:$A$10003)-1,\"\"),ROWS($B$5:$B24))),\"0\")))","v":""},"",""]
[null,{"$f":"IFERROR(INDEX('manual inputs_secondary'!M:M,SMALL(IF('manual inputs_secondary'!M:M<>\"\",ROW('manual inputs_secondary'!M:M)),ROW(23:23))),\"\")","v":""},{"$f":"IF($B25=\"\",\"\",VALUE(IFERROR(INDEX('quantities report_secondary'!$D$2:$D$10003,SMALL(IF('quantities report_secondary'!$A$2:$A$10003=C$4,ROW('quantities report_secondary'!$A$2:$A$10003)-1,\"\"),ROWS($B$5:$B25))),\"0\")))","v":""},{"$f":"IF($B25=\"\",\"\",VALUE(IFERROR(INDEX('quantities report_secondary'!$D$2:$D$10003,SMALL(IF('quantities report_secondary'!$A$2:$A$10003=D$4,ROW('quantities report_secondary'!$A$2:$A$10003)-1,\"\"),ROWS($B$5:$B25))),\"0\")))","v":""},{"$f":"IF($B25=\"\",\"\",VALUE(IFERROR(INDEX('quantities report_secondary'!$D$2:$D$10003,SMALL(IF('quantities report_secondary'!$A$2:$A$10003=E$4,ROW('quantities report_secondary'!$A$2:$A$10003)-1,\"\"),ROWS($B$5:$B25))),\"0\")))","v":""},"","",{"$f":"IF($B25=\"\",\"\",IFERROR(INDEX('quantities report_secondary'!$D$2:$D$10003,SMALL(IF('quantities report_secondary'!$A$2:$A$10003=H$4,ROW('quantities report_secondary'!$A$2:$A$10003)-1,\"\"),ROWS($B$5:$B25))),\"0\"))","v":""},{"$f":"IF($B25=\"\",\"\",VALUE(IFERROR(INDEX('quantities report_secondary'!$D$2:$D$10003,SMALL(IF('quantities report_secondary'!$A$2:$A$10003=I$4,ROW('quantities report_secondary'!$A$2:$A$10003)-1,\"\"),ROWS($B$5:$B25))),\"0\")))","v":""},{"$f":"IF($B25=\"\",\"\",VALUE(IFERROR(INDEX('quantities report_secondary'!$D$2:$D$10003,SMALL(IF('quantities report_secondary'!$A$2:$A$10003=J$4,ROW('quantities report_secondary'!$A$2:$A$10003)-1,\"\"),ROWS($B$5:$B25))),\"0\")))","v":""},"",""]
[null,{"$f":"IFERROR(INDEX('manual inputs_secondary'!M:M,SMALL(IF('manual inputs_secondary'!M:M<>\"\",ROW('manual inputs_secondary'!M:M)),ROW(24:24))),\"\")","v":""},{"$f":"IF($B26=\"\",\"\",VALUE(IFERROR(INDEX('quantities report_secondary'!$D$2:$D$10003,SMALL(IF('quantities report_secondary'!$A$2:$A$10003=C$4,ROW('quantities report_secondary'!$A$2:$A$10003)-1,\"\"),ROWS($B$5:$B26))),\"0\")))","v":""},{"$f":"IF($B26=\"\",\"\",VALUE(IFERROR(INDEX('quantities report_secondary'!$D$2:$D$10003,SMALL(IF('quantities report_secondary'!$A$2:$A$10003=D$4,ROW('quantities report_secondary'!$A$2:$A$10003)-1,\"\"),ROWS($B$5:$B26))),\"0\")))","v":""},{"$f":"IF($B26=\"\",\"\",VALUE(IFERROR(INDEX('quantities report_secondary'!$D$2:$D$10003,SMALL(IF('quantities report_secondary'!$A$2:$A$10003=E$4,ROW('quantities report_secondary'!$A$2:$A$10003)-1,\"\"),ROWS($B$5:$B26))),\"0\")))","v":""},"","",{"$f":"IF($B26=\"\",\"\",IFERROR(INDEX('quantities report_secondary'!$D$2:$D$10003,SMALL(IF('quantities report_secondary'!$A$2:$A$10003=H$4,ROW('quantities report_secondary'!$A$2:$A$10003)-1,\"\"),ROWS($B$5:$B26))),\"0\"))","v":""},{"$f":"IF($B26=\"\",\"\",VALUE(IFERROR(INDEX('quantities report_secondary'!$D$2:$D$10003,SMALL(IF('quantities report_secondary'!$A$2:$A$10003=I$4,ROW('quantities report_secondary'!$A$2:$A$10003)-1,\"\"),ROWS($B$5:$B26))),\"0\")))","v":""},{"$f":"IF($B26=\"\",\"\",VALUE(IFERROR(INDEX('quantities report_secondary'!$D$2:$D$10003,SMALL(IF('quantities report_secondary'!$A$2:$A$10003=J$4,ROW('quantities report_secondary'!$A$2:$A$10003)-1,\"\"),ROWS($B$5:$B26))),\"0\")))","v":""},"",""]
[null,{"$f":"IFERROR(INDEX('manual inputs_secondary'!M:M,SMALL(IF('manual inputs_secondary'!M:M<>\"\",ROW('manual inputs_secondary'!M:M)),ROW(25:25))),\"\")","v":""},{"$f":"IF($B27=\"\",\"\",VALUE(IFERROR(INDEX('quantities report_secondary'!$D$2:$D$10003,SMALL(IF('quantities report_secondary'!$A$2:$A$10003=C$4,ROW('quantities report_secondary'!$A$2:$A$10003)-1,\"\"),ROWS($B$5:$B27))),\"0\")))","v":""},{"$f":"IF($B27=\"\",\"\",VALUE(IFERROR(INDEX('quantities report_secondary'!$D$2:$D$10003,SMALL(IF('quantities report_secondary'!$A$2:$A$10003=D$4,ROW('quantities report_secondary'!$A$2:$A$10003)-1,\"\"),ROWS($B$5:$B27))),\"0\")))","v":""},{"$f":"IF($B27=\"\",\"\",VALUE(IFERROR(INDEX('quantities report_secondary'!$D$2:$D$10003,SMALL(IF('quantities report_secondary'!$A$2:$A$10003=E$4,ROW('quantities report_secondary'!$A$2:$A$10003)-1,\"\"),ROWS($B$5:$B27))),\"0\")))","v":""},"","",{"$f":"IF($B27=\"\",\"\",IFERROR(INDEX('quantities report_secondary'!$D$2:$D$10003,SMALL(IF('quantities report_secondary'!$A$2:$A$10003=H$4,ROW('quantities report_secondary'!$A$2:$A$10003)-1,\"\"),ROWS($B$5:$B27))),\"0\"))","v":""},{"$f":"IF($B27=\"\",\"\",VALUE(IFERROR(INDEX('quantities report_secondary'!$D$2:$D$10003,SMALL(IF('quantities report_secondary'!$A$2:$A$10003=I$4,ROW('quantities report_secondary'!$A$2:$A$10003)-1,\"\"),ROWS($B$5:$B27))),\"0\")))","v":""},{"$f":"IF($B27=\"\",\"\",VALUE(IFERROR(INDEX('quantities report_secondary'!$D$2:$D$10003,SMALL(IF('quantities report_secondary'!$A$2:$A$10003=J$4,ROW('quantities report_secondary'!$A$2:$A$10003)-1,\"\"),ROWS($B$5:$B27))),\"0\")))","v":""},"",""]
[null,{"$f":"IFERROR(INDEX('manual inputs_secondary'!M:M,SMALL(IF('manual inputs_secondary'!M:M<>\"\",ROW('manual inputs_secondary'!M:M)),ROW(26:26))),\"\")","v":""},{"$f":"IF($B28=\"\",\"\",VALUE(IFERROR(INDEX('quantities report_secondary'!$D$2:$D$10003,SMALL(IF('quantities report_secondary'!$A$2:$A$10003=C$4,ROW('quantities report_secondary'!$A$2:$A$10003)-1,\"\"),ROWS($B$5:$B28))),\"0\")))","v":""},{"$f":"IF($B28=\"\",\"\",VALUE(IFERROR(INDEX('quantities report_secondary'!$D$2:$D$10003,SMALL(IF('quantities report_secondary'!$A$2:$A$10003=D$4,ROW('quantities report_secondary'!$A$2:$A$10003)-1,\"\"),ROWS($B$5:$B28))),\"0\")))","v":""},{"$f":"IF($B28=\"\",\"\",VALUE(IFERROR(INDEX('quantities report_secondary'!$D$2:$D$10003,SMALL(IF('quantities report_secondary'!$A$2:$A$10003=E$4,ROW('quantities report_secondary'!$A$2:$A$10003)-1,\"\"),ROWS($B$5:$B28))),\"0\")))","v":""},"","",{"$f":"IF($B28=\"\",\"\",IFERROR(INDEX('quantities report_secondary'!$D$2:$D$10003,SMALL(IF('quantities report_secondary'!$A$2:$A$10003=H$4,ROW('quantities report_secondary'!$A$2:$A$10003)-1,\"\"),ROWS($B$5:$B28))),\"0\"))","v":""},{"$f":"IF($B28=\"\",\"\",VALUE(IFERROR(INDEX('quantities report_secondary'!$D$2:$D$10003,SMALL(IF('quantities report_secondary'!$A$2:$A$10003=I$4,ROW('quantities report_secondary'!$A$2:$A$10003)-1,\"\"),ROWS($B$5:$B28))),\"0\")))","v":""},{"$f":"IF($B28=\"\",\"\",VALUE(IFERROR(INDEX('quantities report_secondary'!$D$2:$D$10003,SMALL(IF('quantities report_secondary'!$A$2:$A$10003=J$4,ROW('quantities report_secondary'!$A$2:$A$10003)-1,\"\"),ROWS($B$5:$B28))),\"0\")))","v":""},"",""]

{"sheet":"Structure_Ex_secondary","index":19,"n_rows":32,"n_cols":9,"rows_kept":32,"cut":false,"hidden":false,"merged":[[3,2,3,7],[3,8,5,8]]}
[]
[]
["TOTALS",null,{"$f":"SUM(C8:C32)","v":0},0,0,0,0,0,0]
[null,null,"Structure Excavation",null,null,null,null,null,"Total"]
[null,null,"Soil Nail","MSE Wall","GFMSE Wall","Rockery Wall","Concrete Walls","Guardwall"]
["ORD Component Name",null,"Soil Nail Wall Excavation: ","MSE Wall Excavation: ","GFMSE Wall Excavation: ","Rockery Wall Excavation: ","Wall Excavation: ","Guard Wall Excavation:"]
["Enter Start of Project",{"$f":"IFERROR(INDEX('manual inputs_secondary'!M:M,SMALL(IF('manual inputs_secondary'!M:M<>\"\",ROW('manual inputs_secondary'!M:M)),ROW(2:2))),\"\")","v":""}]
[null,{"$f":"IFERROR(INDEX('manual inputs_secondary'!M:M,SMALL(IF('manual inputs_secondary'!M:M<>\"\",ROW('manual inputs_secondary'!M:M)),ROW(3:3))),\"\")","v":""},{"$f":"IF($B8=\"\",\"\",IFERROR(INDEX('quantities report_secondary'!$D$2:$D$10003,SMALL(IF('quantities report_secondary'!$A$2:$A$10003=C$6,ROW('quantities report_secondary'!$A$2:$A$10003)-1,\"\"),ROWS($B$8:$B8))),\"0\"))","v":""},{"$f":"IF($B8=\"\",\"\",IFERROR(INDEX('quantities report_secondary'!$D$2:$D$10003,SMALL(IF('quantities report_secondary'!$A$2:$A$10003=D$6,ROW('quantities report_secondary'!$A$2:$A$10003)-1,\"\"),ROWS($B$8:$B8))),\"0\"))","v":""},{"$f":"IF($B8=\"\",\"\",IFERROR(INDEX('quantities report_secondary'!$D$2:$D$10003,SMALL(IF('quantities report_secondary'!$A$2:$A$10003=E$6,ROW('quantities report_secondary'!$A$2:$A$10003)-1,\"\"),ROWS($B$8:$B8))),\"0\"))","v":""},{"$f":"IF($B8=\"\",\"\",IFERROR(INDEX('quantities report_secondary'!$D$2:$D$10003,SMALL(IF('quantities report_secondary'!$A$2:$A$10003=F$6,ROW('quantities report_secondary'!$A$2:$A$10003)-1,\"\"),ROWS($B$8:$B8))),\"0\"))","v":""},{"$f":"IF($B8=\"\",\"\",IFERROR(INDEX('quantities report_secondary'!$D$2:$D$10003,SMALL(IF('quantities report_secondary'!$A$2:$A$10003=G$6,ROW('quantities report_secondary'!$A$2:$A$10003)-1,\"\"),ROWS($B$8:$B8))),\"0\"))","v":""},{"$f":"IF($B8=\"\",\"\",IFERROR(INDEX('quantities report_secondary'!$D$2:$D$10003,SMALL(IF('quantities report_secondary'!$A$2:$A$10003=H$6,ROW('quantities report_secondary'!$A$2:$A$10003)-1,\"\"),ROWS($B$8:$B8))),\"0\"))","v":""},{"$f":"IF(B8=\"\",\"\",SUM(C8:H8))","v":""}]
[null,{"$f":"IFERROR(INDEX('manual inputs_secondary'!M:M,SMALL(IF('manual inputs_secondary'!M:M<>\"\",ROW('manual inputs_secondary'!M:M)),ROW(4:4))),\"\")","v":""},{"$f":"IF($B9=\"\",\"\",IFERROR(INDEX('quantities report_secondary'!$D$2:$D$10003,SMALL(IF('quantities report_secondary'!$A$2:$A$10003=C$6,ROW('quantities report_secondary'!$A$2:$A$10003)-1,\"\"),ROWS($B$8:$B9))),\"0\"))","v":""},{"$f":"IF($B9=\"\",\"\",IFERROR(INDEX('quantities report_secondary'!$D$2:$D$10003,SMALL(IF('quantities report_secondary'!$A$2:$A$10003=D$6,ROW('quantities report_secondary'!$A$2:$A$10003)-1,\"\"),ROWS($B$8:$B9))),\"0\"))","v":""},{"$f":"IF($B9=\"\",\"\",IFERROR(INDEX('quantities report_secondary'!$D$2:$D$10003,SMALL(IF('quantities report_secondary'!$A$2:$A$10003=E$6,ROW('quantities report_secondary'!$A$2:$A$10003)-1,\"\"),ROWS($B$8:$B9))),\"0\"))","v":""},{"$f":"IF($B9=\"\",\"\",IFERROR(INDEX('quantities report_secondary'!$D$2:$D$10003,SMALL(IF('quantities report_secondary'!$A$2:$A$10003=F$6,ROW('quantities report_secondary'!$A$2:$A$10003)-1,\"\"),ROWS($B$8:$B9))),\"0\"))","v":""},{"$f":"IF($B9=\"\",\"\",IFERROR(INDEX('quantities report_secondary'!$D$2:$D$10003,SMALL(IF('quantities report_secondary'!$A$2:$A$10003=G$6,ROW('quantities report_secondary'!$A$2:$A$10003)-1,\"\"),ROWS($B$8:$B9))),\"0\"))","v":""},{"$f":"IF($B9=\"\",\"\",IFERROR(INDEX('quantities report_secondary'!$D$2:$D$10003,SMALL(IF('quantities report_secondary'!$A$2:$A$10003=H$6,ROW('quantities report_secondary'!$A$2:$A$10003)-1,\"\"),ROWS($B$8:$B9))),\"0\"))","v":""},{"$f":"IF(B9=\"\",\"\",SUM(C9:H9))","v":""}]
[null,{"$f":"IFERROR(INDEX('manual inputs_secondary'!M:M,SMALL(IF('manual inputs_secondary'!M:M<>\"\",ROW('manual inputs_secondary'!M:M)),ROW(5:5))),\"\")","v":""},{"$f":"IF($B10=\"\",\"\",IFERROR(INDEX('quantities report_secondary'!$D$2:$D$10003,SMALL(IF('quantities report_secondary'!$A$2:$A$10003=C$6,ROW('quantities report_secondary'!$A$2:$A$10003)-1,\"\"),ROWS($B$8:$B10))),\"0\"))","v":""},{"$f":"IF($B10=\"\",\"\",IFERROR(INDEX('quantities report_secondary'!$D$2:$D$10003,SMALL(IF('quantities report_secondary'!$A$2:$A$10003=D$6,ROW('quantities report_secondary'!$A$2:$A$10003)-1,\"\"),ROWS($B$8:$B10))),\"0\"))","v":""},{"$f":"IF($B10=\"\",\"\",IFERROR(INDEX('quantities report_secondary'!$D$2:$D$10003,SMALL(IF('quantities report_secondary'!$A$2:$A$10003=E$6,ROW('quantities report_secondary'!$A$2:$A$10003)-1,\"\"),ROWS($B$8:$B10))),\"0\"))","v":""},{"$f":"IF($B10=\"\",\"\",IFERROR(INDEX('quantities report_secondary'!$D$2:$D$10003,SMALL(IF('quantities report_secondary'!$A$2:$A$10003=F$6,ROW('quantities report_secondary'!$A$2:$A$10003)-1,\"\"),ROWS($B$8:$B10))),\"0\"))","v":""},{"$f":"IF($B10=\"\",\"\",IFERROR(INDEX('quantities report_secondary'!$D$2:$D$10003,SMALL(IF('quantities report_secondary'!$A$2:$A$10003=G$6,ROW('quantities report_secondary'!$A$2:$A$10003)-1,\"\"),ROWS($B$8:$B10))),\"0\"))","v":""},{"$f":"IF($B10=\"\",\"\",IFERROR(INDEX('quantities report_secondary'!$D$2:$D$10003,SMALL(IF('quantities report_secondary'!$A$2:$A$10003=H$6,ROW('quantities report_secondary'!$A$2:$A$10003)-1,\"\"),ROWS($B$8:$B10))),\"0\"))","v":""},{"$f":"IF(B10=\"\",\"\",SUM(C10:H10))","v":""}]
[null,{"$f":"IFERROR(INDEX('manual inputs_secondary'!M:M,SMALL(IF('manual inputs_secondary'!M:M<>\"\",ROW('manual inputs_secondary'!M:M)),ROW(6:6))),\"\")","v":""},{"$f":"IF($B11=\"\",\"\",IFERROR(INDEX('quantities report_secondary'!$D$2:$D$10003,SMALL(IF('quantities report_secondary'!$A$2:$A$10003=C$6,ROW('quantities report_secondary'!$A$2:$A$10003)-1,\"\"),ROWS($B$8:$B11))),\"0\"))","v":""},{"$f":"IF($B11=\"\",\"\",IFERROR(INDEX('quantities report_secondary'!$D$2:$D$10003,SMALL(IF('quantities report_secondary'!$A$2:$A$10003=D$6,ROW('quantities report_secondary'!$A$2:$A$10003)-1,\"\"),ROWS($B$8:$B11))),\"0\"))","v":""},{"$f":"IF($B11=\"\",\"\",IFERROR(INDEX('quantities report_secondary'!$D$2:$D$10003,SMALL(IF('quantities report_secondary'!$A$2:$A$10003=E$6,ROW('quantities report_secondary'!$A$2:$A$10003)-1,\"\"),ROWS($B$8:$B11))),\"0\"))","v":""},{"$f":"IF($B11=\"\",\"\",IFERROR(INDEX('quantities report_secondary'!$D$2:$D$10003,SMALL(IF('quantities report_secondary'!$A$2:$A$10003=F$6,ROW('quantities report_secondary'!$A$2:$A$10003)-1,\"\"),ROWS($B$8:$B11))),\"0\"))","v":""},{"$f":"IF($B11=\"\",\"\",IFERROR(INDEX('quantities report_secondary'!$D$2:$D$10003,SMALL(IF('quantities report_secondary'!$A$2:$A$10003=G$6,ROW('quantities report_secondary'!$A$2:$A$10003)-1,\"\"),ROWS($B$8:$B11))),\"0\"))","v":""},{"$f":"IF($B11=\"\",\"\",IFERROR(INDEX('quantities report_secondary'!$D$2:$D$10003,SMALL(IF('quantities report_secondary'!$A$2:$A$10003=H$6,ROW('quantities report_secondary'!$A$2:$A$10003)-1,\"\"),ROWS($B$8:$B11))),\"0\"))","v":""},{"$f":"IF(B11=\"\",\"\",SUM(C11:H11))","v":""}]
[null,{"$f":"IFERROR(INDEX('manual inputs_secondary'!M:M,SMALL(IF('manual inputs_secondary'!M:M<>\"\",ROW('manual inputs_secondary'!M:M)),ROW(7:7))),\"\")","v":""},{"$f":"IF($B12=\"\",\"\",IFERROR(INDEX('quantities report_secondary'!$D$2:$D$10003,SMALL(IF('quantities report_secondary'!$A$2:$A$10003=C$6,ROW('quantities report_secondary'!$A$2:$A$10003)-1,\"\"),ROWS($B$8:$B12))),\"0\"))","v":""},{"$f":"IF($B12=\"\",\"\",IFERROR(INDEX('quantities report_secondary'!$D$2:$D$10003,SMALL(IF('quantities report_secondary'!$A$2:$A$10003=D$6,ROW('quantities report_secondary'!$A$2:$A$10003)-1,\"\"),ROWS($B$8:$B12))),\"0\"))","v":""},{"$f":"IF($B12=\"\",\"\",IFERROR(INDEX('quantities report_secondary'!$D$2:$D$10003,SMALL(IF('quantities report_secondary'!$A$2:$A$10003=E$6,ROW('quantities report_secondary'!$A$2:$A$10003)-1,\"\"),ROWS($B$8:$B12))),\"0\"))","v":""},{"$f":"IF($B12=\"\",\"\",IFERROR(INDEX('quantities report_secondary'!$D$2:$D$10003,SMALL(IF('quantities report_secondary'!$A$2:$A$10003=F$6,ROW('quantities report_secondary'!$A$2:$A$10003)-1,\"\"),ROWS($B$8:$B12))),\"0\"))","v":""},{"$f":"IF($B12=\"\",\"\",IFERROR(INDEX('quantities report_secondary'!$D$2:$D$10003,SMALL(IF('quantities report_secondary'!$A$2:$A$10003=G$6,ROW('quantities report_secondary'!$A$2:$A$10003)-1,\"\"),ROWS($B$8:$B12))),\"0\"))","v":""},{"$f":"IF($B12=\"\",\"\",IFERROR(INDEX('quantities report_secondary'!$D$2:$D$10003,SMALL(IF('quantities report_secondary'!$A$2:$A$10003=H$6,ROW('quantities report_secondary'!$A$2:$A$10003)-1,\"\"),ROWS($B$8:$B12))),\"0\"))","v":""},{"$f":"IF(B12=\"\",\"\",SUM(C12:H12))","v":""}]
[null,{"$f":"IFERROR(INDEX('manual inputs_secondary'!M:M,SMALL(IF('manual inputs_secondary'!M:M<>\"\",ROW('manual inputs_secondary'!M:M)),ROW(8:8))),\"\")","v":""},{"$f":"IF($B13=\"\",\"\",IFERROR(INDEX('quantities report_secondary'!$D$2:$D$10003,SMALL(IF('quantities report_secondary'!$A$2:$A$10003=C$6,ROW('quantities report_secondary'!$A$2:$A$10003)-1,\"\"),ROWS($B$8:$B13))),\"0\"))","v":""},{"$f":"IF($B13=\"\",\"\",IFERROR(INDEX('quantities report_secondary'!$D$2:$D$10003,SMALL(IF('quantities report_secondary'!$A$2:$A$10003=D$6,ROW('quantities report_secondary'!$A$2:$A$10003)-1,\"\"),ROWS($B$8:$B13))),\"0\"))","v":""},{"$f":"IF($B13=\"\",\"\",IFERROR(INDEX('quantities report_secondary'!$D$2:$D$10003,SMALL(IF('quantities report_secondary'!$A$2:$A$10003=E$6,ROW('quantities report_secondary'!$A$2:$A$10003)-1,\"\"),ROWS($B$8:$B13))),\"0\"))","v":""},{"$f":"IF($B13=\"\",\"\",IFERROR(INDEX('quantities report_secondary'!$D$2:$D$10003,SMALL(IF('quantities report_secondary'!$A$2:$A$10003=F$6,ROW('quantities report_secondary'!$A$2:$A$10003)-1,\"\"),ROWS($B$8:$B13))),\"0\"))","v":""},{"$f":"IF($B13=\"\",\"\",IFERROR(INDEX('quantities report_secondary'!$D$2:$D$10003,SMALL(IF('quantities report_secondary'!$A$2:$A$10003=G$6,ROW('quantities report_secondary'!$A$2:$A$10003)-1,\"\"),ROWS($B$8:$B13))),\"0\"))","v":""},{"$f":"IF($B13=\"\",\"\",IFERROR(INDEX('quantities report_secondary'!$D$2:$D$10003,SMALL(IF('quantities report_secondary'!$A$2:$A$10003=H$6,ROW('quantities report_secondary'!$A$2:$A$10003)-1,\"\"),ROWS($B$8:$B13))),\"0\"))","v":""},{"$f":"IF(B13=\"\",\"\",SUM(C13:H13))","v":""}]
[null,{"$f":"IFERROR(INDEX('manual inputs_secondary'!M:M,SMALL(IF('manual inputs_secondary'!M:M<>\"\",ROW('manual inputs_secondary'!M:M)),ROW(9:9))),\"\")","v":""},{"$f":"IF($B14=\"\",\"\",IFERROR(INDEX('quantities report_secondary'!$D$2:$D$10003,SMALL(IF('quantities report_secondary'!$A$2:$A$10003=C$6,ROW('quantities report_secondary'!$A$2:$A$10003)-1,\"\"),ROWS($B$8:$B14))),\"0\"))","v":""},{"$f":"IF($B14=\"\",\"\",IFERROR(INDEX('quantities report_secondary'!$D$2:$D$10003,SMALL(IF('quantities report_secondary'!$A$2:$A$10003=D$6,ROW('quantities report_secondary'!$A$2:$A$10003)-1,\"\"),ROWS($B$8:$B14))),\"0\"))","v":""},{"$f":"IF($B14=\"\",\"\",IFERROR(INDEX('quantities report_secondary'!$D$2:$D$10003,SMALL(IF('quantities report_secondary'!$A$2:$A$10003=E$6,ROW('quantities report_secondary'!$A$2:$A$10003)-1,\"\"),ROWS($B$8:$B14))),\"0\"))","v":""},{"$f":"IF($B14=\"\",\"\",IFERROR(INDEX('quantities report_secondary'!$D$2:$D$10003,SMALL(IF('quantities report_secondary'!$A$2:$A$10003=F$6,ROW('quantities report_secondary'!$A$2:$A$10003)-1,\"\"),ROWS($B$8:$B14))),\"0\"))","v":""},{"$f":"IF($B14=\"\",\"\",IFERROR(INDEX('quantities report_secondary'!$D$2:$D$10003,SMALL(IF('quantities report_secondary'!$A$2:$A$10003=G$6,ROW('quantities report_secondary'!$A$2:$A$10003)-1,\"\"),ROWS($B$8:$B14))),\"0\"))","v":""},{"$f":"IF($B14=\"\",\"\",IFERROR(INDEX('quantities report_secondary'!$D$2:$D$10003,SMALL(IF('quantities report_secondary'!$A$2:$A$10003=H$6,ROW('quantities report_secondary'!$A$2:$A$10003)-1,\"\"),ROWS($B$8:$B14))),\"0\"))","v":""},{"$f":"IF(B14=\"\",\"\",SUM(C14:H14))","v":""}]
[null,{"$f":"IFERROR(INDEX('manual inputs_secondary'!M:M,SMALL(IF('manual inputs_secondary'!M:M<>\"\",ROW('manual inputs_secondary'!M:M)),ROW(10:10))),\"\")","v":""},{"$f":"IF($B15=\"\",\"\",IFERROR(INDEX('quantities report_secondary'!$D$2:$D$10003,SMALL(IF('quantities report_secondary'!$A$2:$A$10003=C$6,ROW('quantities report_secondary'!$A$2:$A$10003)-1,\"\"),ROWS($B$8:$B15))),\"0\"))","v":""},{"$f":"IF($B15=\"\",\"\",IFERROR(INDEX('quantities report_secondary'!$D$2:$D$10003,SMALL(IF('quantities report_secondary'!$A$2:$A$10003=D$6,ROW('quantities report_secondary'!$A$2:$A$10003)-1,\"\"),ROWS($B$8:$B15))),\"0\"))","v":""},{"$f":"IF($B15=\"\",\"\",IFERROR(INDEX('quantities report_secondary'!$D$2:$D$10003,SMALL(IF('quantities report_secondary'!$A$2:$A$10003=E$6,ROW('quantities report_secondary'!$A$2:$A$10003)-1,\"\"),ROWS($B$8:$B15))),\"0\"))","v":""},{"$f":"IF($B15=\"\",\"\",IFERROR(INDEX('quantities report_secondary'!$D$2:$D$10003,SMALL(IF('quantities report_secondary'!$A$2:$A$10003=F$6,ROW('quantities report_secondary'!$A$2:$A$10003)-1,\"\"),ROWS($B$8:$B15))),\"0\"))","v":""},{"$f":"IF($B15=\"\",\"\",IFERROR(INDEX('quantities report_secondary'!$D$2:$D$10003,SMALL(IF('quantities report_secondary'!$A$2:$A$10003=G$6,ROW('quantities report_secondary'!$A$2:$A$10003)-1,\"\"),ROWS($B$8:$B15))),\"0\"))","v":""},{"$f":"IF($B15=\"\",\"\",IFERROR(INDEX('quantities report_secondary'!$D$2:$D$10003,SMALL(IF('quantities report_secondary'!$A$2:$A$10003=H$6,ROW('quantities report_secondary'!$A$2:$A$10003)-1,\"\"),ROWS($B$8:$B15))),\"0\"))","v":""},{"$f":"IF(B15=\"\",\"\",SUM(C15:H15))","v":""}]
[null,{"$f":"IFERROR(INDEX('manual inputs_secondary'!M:M,SMALL(IF('manual inputs_secondary'!M:M<>\"\",ROW('manual inputs_secondary'!M:M)),ROW(11:11))),\"\")","v":""},{"$f":"IF($B16=\"\",\"\",IFERROR(INDEX('quantities report_secondary'!$D$2:$D$10003,SMALL(IF('quantities report_secondary'!$A$2:$A$10003=C$6,ROW('quantities report_secondary'!$A$2:$A$10003)-1,\"\"),ROWS($B$8:$B16))),\"0\"))","v":""},{"$f":"IF($B16=\"\",\"\",IFERROR(INDEX('quantities report_secondary'!$D$2:$D$10003,SMALL(IF('quantities report_secondary'!$A$2:$A$10003=D$6,ROW('quantities report_secondary'!$A$2:$A$10003)-1,\"\"),ROWS($B$8:$B16))),\"0\"))","v":""},{"$f":"IF($B16=\"\",\"\",IFERROR(INDEX('quantities report_secondary'!$D$2:$D$10003,SMALL(IF('quantities report_secondary'!$A$2:$A$10003=E$6,ROW('quantities report_secondary'!$A$2:$A$10003)-1,\"\"),ROWS($B$8:$B16))),\"0\"))","v":""},{"$f":"IF($B16=\"\",\"\",IFERROR(INDEX('quantities report_secondary'!$D$2:$D$10003,SMALL(IF('quantities report_secondary'!$A$2:$A$10003=F$6,ROW('quantities report_secondary'!$A$2:$A$10003)-1,\"\"),ROWS($B$8:$B16))),\"0\"))","v":""},{"$f":"IF($B16=\"\",\"\",IFERROR(INDEX('quantities report_secondary'!$D$2:$D$10003,SMALL(IF('quantities report_secondary'!$A$2:$A$10003=G$6,ROW('quantities report_secondary'!$A$2:$A$10003)-1,\"\"),ROWS($B$8:$B16))),\"0\"))","v":""},{"$f":"IF($B16=\"\",\"\",IFERROR(INDEX('quantities report_secondary'!$D$2:$D$10003,SMALL(IF('quantities report_secondary'!$A$2:$A$10003=H$6,ROW('quantities report_secondary'!$A$2:$A$10003)-1,\"\"),ROWS($B$8:$B16))),\"0\"))","v":""},{"$f":"IF(B16=\"\",\"\",SUM(C16:H16))","v":""}]
[null,{"$f":"IFERROR(INDEX('manual inputs_secondary'!M:M,SMALL(IF('manual inputs_secondary'!M:M<>\"\",ROW('manual inputs_secondary'!M:M)),ROW(12:12))),\"\")","v":""},{"$f":"IF($B17=\"\",\"\",IFERROR(INDEX('quantities report_secondary'!$D$2:$D$10003,SMALL(IF('quantities report_secondary'!$A$2:$A$10003=C$6,ROW('quantities report_secondary'!$A$2:$A$10003)-1,\"\"),ROWS($B$8:$B17))),\"0\"))","v":""},{"$f":"IF($B17=\"\",\"\",IFERROR(INDEX('quantities report_secondary'!$D$2:$D$10003,SMALL(IF('quantities report_secondary'!$A$2:$A$10003=D$6,ROW('quantities report_secondary'!$A$2:$A$10003)-1,\"\"),ROWS($B$8:$B17))),\"0\"))","v":""},{"$f":"IF($B17=\"\",\"\",IFERROR(INDEX('quantities report_secondary'!$D$2:$D$10003,SMALL(IF('quantities report_secondary'!$A$2:$A$10003=E$6,ROW('quantities report_secondary'!$A$2:$A$10003)-1,\"\"),ROWS($B$8:$B17))),\"0\"))","v":""},{"$f":"IF($B17=\"\",\"\",IFERROR(INDEX('quantities report_secondary'!$D$2:$D$10003,SMALL(IF('quantities report_secondary'!$A$2:$A$10003=F$6,ROW('quantities report_secondary'!$A$2:$A$10003)-1,\"\"),ROWS($B$8:$B17))),\"0\"))","v":""},{"$f":"IF($B17=\"\",\"\",IFERROR(INDEX('quantities report_secondary'!$D$2:$D$10003,SMALL(IF('quantities report_secondary'!$A$2:$A$10003=G$6,ROW('quantities report_secondary'!$A$2:$A$10003)-1,\"\"),ROWS($B$8:$B17))),\"0\"))","v":""},{"$f":"IF($B17=\"\",\"\",IFERROR(INDEX('quantities report_secondary'!$D$2:$D$10003,SMALL(IF('quantities report_secondary'!$A$2:$A$10003=H$6,ROW('quantities report_secondary'!$A$2:$A$10003)-1,\"\"),ROWS($B$8:$B17))),\"0\"))","v":""},{"$f":"IF(B17=\"\",\"\",SUM(C17:H17))","v":""}]
[null,{"$f":"IFERROR(INDEX('manual inputs_secondary'!M:M,SMALL(IF('manual inputs_secondary'!M:M<>\"\",ROW('manual inputs_secondary'!M:M)),ROW(13:13))),\"\")","v":""},{"$f":"IF($B18=\"\",\"\",IFERROR(INDEX('quantities report_secondary'!$D$2:$D$10003,SMALL(IF('quantities report_secondary'!$A$2:$A$10003=C$6,ROW('quantities report_secondary'!$A$2:$A$10003)-1,\"\"),ROWS($B$8:$B18))),\"0\"))","v":""},{"$f":"IF($B18=\"\",\"\",IFERROR(INDEX('quantities report_secondary'!$D$2:$D$10003,SMALL(IF('quantities report_secondary'!$A$2:$A$10003=D$6,ROW('quantities report_secondary'!$A$2:$A$10003)-1,\"\"),ROWS($B$8:$B18))),\"0\"))","v":""},{"$f":"IF($B18=\"\",\"\",IFERROR(INDEX('quantities report_secondary'!$D$2:$D$10003,SMALL(IF('quantities report_secondary'!$A$2:$A$10003=E$6,ROW('quantities report_secondary'!$A$2:$A$10003)-1,\"\"),ROWS($B$8:$B18))),\"0\"))","v":""},{"$f":"IF($B18=\"\",\"\",IFERROR(INDEX('quantities report_secondary'!$D$2:$D$10003,SMALL(IF('quantities report_secondary'!$A$2:$A$10003=F$6,ROW('quantities report_secondary'!$A$2:$A$10003)-1,\"\"),ROWS($B$8:$B18))),\"0\"))","v":""},{"$f":"IF($B18=\"\",\"\",IFERROR(INDEX('quantities report_secondary'!$D$2:$D$10003,SMALL(IF('quantities report_secondary'!$A$2:$A$10003=G$6,ROW('quantities report_secondary'!$A$2:$A$10003)-1,\"\"),ROWS($B$8:$B18))),\"0\"))","v":""},{"$f":"IF($B18=\"\",\"\",IFERROR(INDEX('quantities report_secondary'!$D$2:$D$10003,SMALL(IF('quantities report_secondary'!$A$2:$A$10003=H$6,ROW('quantities report_secondary'!$A$2:$A$10003)-1,\"\"),ROWS($B$8:$B18))),\"0\"))","v":""},{"$f":"IF(B18=\"\",\"\",SUM(C18:H18))","v":""}]
[null,{"$f":"IFERROR(INDEX('manual inputs_secondary'!M:M,SMALL(IF('manual inputs_secondary'!M:M<>\"\",ROW('manual inputs_secondary'!M:M)),ROW(14:14))),\"\")","v":""},{"$f":"IF($B19=\"\",\"\",IFERROR(INDEX('quantities report_secondary'!$D$2:$D$10003,SMALL(IF('quantities report_secondary'!$A$2:$A$10003=C$6,ROW('quantities report_secondary'!$A$2:$A$10003)-1,\"\"),ROWS($B$8:$B19))),\"0\"))","v":""},{"$f":"IF($B19=\"\",\"\",IFERROR(INDEX('quantities report_secondary'!$D$2:$D$10003,SMALL(IF('quantities report_secondary'!$A$2:$A$10003=D$6,ROW('quantities report_secondary'!$A$2:$A$10003)-1,\"\"),ROWS($B$8:$B19))),\"0\"))","v":""},{"$f":"IF($B19=\"\",\"\",IFERROR(INDEX('quantities report_secondary'!$D$2:$D$10003,SMALL(IF('quantities report_secondary'!$A$2:$A$10003=E$6,ROW('quantities report_secondary'!$A$2:$A$10003)-1,\"\"),ROWS($B$8:$B19))),\"0\"))","v":""},{"$f":"IF($B19=\"\",\"\",IFERROR(INDEX('quantities report_secondary'!$D$2:$D$10003,SMALL(IF('quantities report_secondary'!$A$2:$A$10003=F$6,ROW('quantities report_secondary'!$A$2:$A$10003)-1,\"\"),ROWS($B$8:$B19))),\"0\"))","v":""},{"$f":"IF($B19=\"\",\"\",IFERROR(INDEX('quantities report_secondary'!$D$2:$D$10003,SMALL(IF('quantities report_secondary'!$A$2:$A$10003=G$6,ROW('quantities report_secondary'!$A$2:$A$10003)-1,\"\"),ROWS($B$8:$B19))),\"0\"))","v":""},{"$f":"IF($B19=\"\",\"\",IFERROR(INDEX('quantities report_secondary'!$D$2:$D$10003,SMALL(IF('quantities report_secondary'!$A$2:$A$10003=H$6,ROW('quantities report_secondary'!$A$2:$A$10003)-1,\"\"),ROWS($B$8:$B19))),\"0\"))","v":""},{"$f":"IF(B19=\"\",\"\",SUM(C19:H19))","v":""}]
[null,{"$f":"IFERROR(INDEX('manual inputs_secondary'!M:M,SMALL(IF('manual inputs_secondary'!M:M<>\"\",ROW('manual inputs_secondary'!M:M)),ROW(15:15))),\"\")","v":""},{"$f":"IF($B20=\"\",\"\",IFERROR(INDEX('quantities report_secondary'!$D$2:$D$10003,SMALL(IF('quantities report_secondary'!$A$2:$A$10003=C$6,ROW('quantities report_secondary'!$A$2:$A$10003)-1,\"\"),ROWS($B$8:$B20))),\"0\"))","v":""},{"$f":"IF($B20=\"\",\"\",IFERROR(INDEX('quantities report_secondary'!$D$2:$D$10003,SMALL(IF('quantities report_secondary'!$A$2:$A$10003=D$6,ROW('quantities report_secondary'!$A$2:$A$10003)-1,\"\"),ROWS($B$8:$B20))),\"0\"))","v":""},{"$f":"IF($B20=\"\",\"\",IFERROR(INDEX('quantities report_secondary'!$D$2:$D$10003,SMALL(IF('quantities report_secondary'!$A$2:$A$10003=E$6,ROW('quantities report_secondary'!$A$2:$A$10003)-1,\"\"),ROWS($B$8:$B20))),\"0\"))","v":""},{"$f":"IF($B20=\"\",\"\",IFERROR(INDEX('quantities report_secondary'!$D$2:$D$10003,SMALL(IF('quantities report_secondary'!$A$2:$A$10003=F$6,ROW('quantities report_secondary'!$A$2:$A$10003)-1,\"\"),ROWS($B$8:$B20))),\"0\"))","v":""},{"$f":"IF($B20=\"\",\"\",IFERROR(INDEX('quantities report_secondary'!$D$2:$D$10003,SMALL(IF('quantities report_secondary'!$A$2:$A$10003=G$6,ROW('quantities report_secondary'!$A$2:$A$10003)-1,\"\"),ROWS($B$8:$B20))),\"0\"))","v":""},{"$f":"IF($B20=\"\",\"\",IFERROR(INDEX('quantities report_secondary'!$D$2:$D$10003,SMALL(IF('quantities report_secondary'!$A$2:$A$10003=H$6,ROW('quantities report_secondary'!$A$2:$A$10003)-1,\"\"),ROWS($B$8:$B20))),\"0\"))","v":""},{"$f":"IF(B20=\"\",\"\",SUM(C20:H20))","v":""}]
[null,{"$f":"IFERROR(INDEX('manual inputs_secondary'!M:M,SMALL(IF('manual inputs_secondary'!M:M<>\"\",ROW('manual inputs_secondary'!M:M)),ROW(16:16))),\"\")","v":""},{"$f":"IF($B21=\"\",\"\",IFERROR(INDEX('quantities report_secondary'!$D$2:$D$10003,SMALL(IF('quantities report_secondary'!$A$2:$A$10003=C$6,ROW('quantities report_secondary'!$A$2:$A$10003)-1,\"\"),ROWS($B$8:$B21))),\"0\"))","v":""},{"$f":"IF($B21=\"\",\"\",IFERROR(INDEX('quantities report_secondary'!$D$2:$D$10003,SMALL(IF('quantities report_secondary'!$A$2:$A$10003=D$6,ROW('quantities report_secondary'!$A$2:$A$10003)-1,\"\"),ROWS($B$8:$B21))),\"0\"))","v":""},{"$f":"IF($B21=\"\",\"\",IFERROR(INDEX('quantities report_secondary'!$D$2:$D$10003,SMALL(IF('quantities report_secondary'!$A$2:$A$10003=E$6,ROW('quantities report_secondary'!$A$2:$A$10003)-1,\"\"),ROWS($B$8:$B21))),\"0\"))","v":""},{"$f":"IF($B21=\"\",\"\",IFERROR(INDEX('quantities report_secondary'!$D$2:$D$10003,SMALL(IF('quantities report_secondary'!$A$2:$A$10003=F$6,ROW('quantities report_secondary'!$A$2:$A$10003)-1,\"\"),ROWS($B$8:$B21))),\"0\"))","v":""},{"$f":"IF($B21=\"\",\"\",IFERROR(INDEX('quantities report_secondary'!$D$2:$D$10003,SMALL(IF('quantities report_secondary'!$A$2:$A$10003=G$6,ROW('quantities report_secondary'!$A$2:$A$10003)-1,\"\"),ROWS($B$8:$B21))),\"0\"))","v":""},{"$f":"IF($B21=\"\",\"\",IFERROR(INDEX('quantities report_secondary'!$D$2:$D$10003,SMALL(IF('quantities report_secondary'!$A$2:$A$10003=H$6,ROW('quantities report_secondary'!$A$2:$A$10003)-1,\"\"),ROWS($B$8:$B21))),\"0\"))","v":""},{"$f":"IF(B21=\"\",\"\",SUM(C21:H21))","v":""}]
[null,{"$f":"IFERROR(INDEX('manual inputs_secondary'!M:M,SMALL(IF('manual inputs_secondary'!M:M<>\"\",ROW('manual inputs_secondary'!M:M)),ROW(17:17))),\"\")","v":""},{"$f":"IF($B22=\"\",\"\",IFERROR(INDEX('quantities report_secondary'!$D$2:$D$10003,SMALL(IF('quantities report_secondary'!$A$2:$A$10003=C$6,ROW('quantities report_secondary'!$A$2:$A$10003)-1,\"\"),ROWS($B$8:$B22))),\"0\"))","v":""},{"$f":"IF($B22=\"\",\"\",IFERROR(INDEX('quantities report_secondary'!$D$2:$D$10003,SMALL(IF('quantities report_secondary'!$A$2:$A$10003=D$6,ROW('quantities report_secondary'!$A$2:$A$10003)-1,\"\"),ROWS($B$8:$B22))),\"0\"))","v":""},{"$f":"IF($B22=\"\",\"\",IFERROR(INDEX('quantities report_secondary'!$D$2:$D$10003,SMALL(IF('quantities report_secondary'!$A$2:$A$10003=E$6,ROW('quantities report_secondary'!$A$2:$A$10003)-1,\"\"),ROWS($B$8:$B22))),\"0\"))","v":""},{"$f":"IF($B22=\"\",\"\",IFERROR(INDEX('quantities report_secondary'!$D$2:$D$10003,SMALL(IF('quantities report_secondary'!$A$2:$A$10003=F$6,ROW('quantities report_secondary'!$A$2:$A$10003)-1,\"\"),ROWS($B$8:$B22))),\"0\"))","v":""},{"$f":"IF($B22=\"\",\"\",IFERROR(INDEX('quantities report_secondary'!$D$2:$D$10003,SMALL(IF('quantities report_secondary'!$A$2:$A$10003=G$6,ROW('quantities report_secondary'!$A$2:$A$10003)-1,\"\"),ROWS($B$8:$B22))),\"0\"))","v":""},{"$f":"IF($B22=\"\",\"\",IFERROR(INDEX('quantities report_secondary'!$D$2:$D$10003,SMALL(IF('quantities report_secondary'!$A$2:$A$10003=H$6,ROW('quantities report_secondary'!$A$2:$A$10003)-1,\"\"),ROWS($B$8:$B22))),\"0\"))","v":""},{"$f":"IF(B22=\"\",\"\",SUM(C22:H22))","v":""}]
[null,{"$f":"IFERROR(INDEX('manual inputs_secondary'!M:M,SMALL(IF('manual inputs_secondary'!M:M<>\"\",ROW('manual inputs_secondary'!M:M)),ROW(18:18))),\"\")","v":""},{"$f":"IF($B23=\"\",\"\",IFERROR(INDEX('quantities report_secondary'!$D$2:$D$10003,SMALL(IF('quantities report_secondary'!$A$2:$A$10003=C$6,ROW('quantities report_secondary'!$A$2:$A$10003)-1,\"\"),ROWS($B$8:$B23))),\"0\"))","v":""},{"$f":"IF($B23=\"\",\"\",IFERROR(INDEX('quantities report_secondary'!$D$2:$D$10003,SMALL(IF('quantities report_secondary'!$A$2:$A$10003=D$6,ROW('quantities report_secondary'!$A$2:$A$10003)-1,\"\"),ROWS($B$8:$B23))),\"0\"))","v":""},{"$f":"IF($B23=\"\",\"\",IFERROR(INDEX('quantities report_secondary'!$D$2:$D$10003,SMALL(IF('quantities report_secondary'!$A$2:$A$10003=E$6,ROW('quantities report_secondary'!$A$2:$A$10003)-1,\"\"),ROWS($B$8:$B23))),\"0\"))","v":""},{"$f":"IF($B23=\"\",\"\",IFERROR(INDEX('quantities report_secondary'!$D$2:$D$10003,SMALL(IF('quantities report_secondary'!$A$2:$A$10003=F$6,ROW('quantities report_secondary'!$A$2:$A$10003)-1,\"\"),ROWS($B$8:$B23))),\"0\"))","v":""},{"$f":"IF($B23=\"\",\"\",IFERROR(INDEX('quantities report_secondary'!$D$2:$D$10003,SMALL(IF('quantities report_secondary'!$A$2:$A$10003=G$6,ROW('quantities report_secondary'!$A$2:$A$10003)-1,\"\"),ROWS($B$8:$B23))),\"0\"))","v":""},{"$f":"IF($B23=\"\",\"\",IFERROR(INDEX('quantities report_secondary'!$D$2:$D$10003,SMALL(IF('quantities report_secondary'!$A$2:$A$10003=H$6,ROW('quantities report_secondary'!$A$2:$A$10003)-1,\"\"),ROWS($B$8:$B23))),\"0\"))","v":""},{"$f":"IF(B23=\"\",\"\",SUM(C23:H23))","v":""}]
[null,{"$f":"IFERROR(INDEX('manual inputs_secondary'!M:M,SMALL(IF('manual inputs_secondary'!M:M<>\"\",ROW('manual inputs_secondary'!M:M)),ROW(19:19))),\"\")","v":""},{"$f":"IF($B24=\"\",\"\",IFERROR(INDEX('quantities report_secondary'!$D$2:$D$10003,SMALL(IF('quantities report_secondary'!$A$2:$A$10003=C$6,ROW('quantities report_secondary'!$A$2:$A$10003)-1,\"\"),ROWS($B$8:$B24))),\"0\"))","v":""},{"$f":"IF($B24=\"\",\"\",IFERROR(INDEX('quantities report_secondary'!$D$2:$D$10003,SMALL(IF('quantities report_secondary'!$A$2:$A$10003=D$6,ROW('quantities report_secondary'!$A$2:$A$10003)-1,\"\"),ROWS($B$8:$B24))),\"0\"))","v":""},{"$f":"IF($B24=\"\",\"\",IFERROR(INDEX('quantities report_secondary'!$D$2:$D$10003,SMALL(IF('quantities report_secondary'!$A$2:$A$10003=E$6,ROW('quantities report_secondary'!$A$2:$A$10003)-1,\"\"),ROWS($B$8:$B24))),\"0\"))","v":""},{"$f":"IF($B24=\"\",\"\",IFERROR(INDEX('quantities report_secondary'!$D$2:$D$10003,SMALL(IF('quantities report_secondary'!$A$2:$A$10003=F$6,ROW('quantities report_secondary'!$A$2:$A$10003)-1,\"\"),ROWS($B$8:$B24))),\"0\"))","v":""},{"$f":"IF($B24=\"\",\"\",IFERROR(INDEX('quantities report_secondary'!$D$2:$D$10003,SMALL(IF('quantities report_secondary'!$A$2:$A$10003=G$6,ROW('quantities report_secondary'!$A$2:$A$10003)-1,\"\"),ROWS($B$8:$B24))),\"0\"))","v":""},{"$f":"IF($B24=\"\",\"\",IFERROR(INDEX('quantities report_secondary'!$D$2:$D$10003,SMALL(IF('quantities report_secondary'!$A$2:$A$10003=H$6,ROW('quantities report_secondary'!$A$2:$A$10003)-1,\"\"),ROWS($B$8:$B24))),\"0\"))","v":""},{"$f":"IF(B24=\"\",\"\",SUM(C24:H24))","v":""}]
[null,{"$f":"IFERROR(INDEX('manual inputs_secondary'!M:M,SMALL(IF('manual inputs_secondary'!M:M<>\"\",ROW('manual inputs_secondary'!M:M)),ROW(20:20))),\"\")","v":""},{"$f":"IF($B25=\"\",\"\",IFERROR(INDEX('quantities report_secondary'!$D$2:$D$10003,SMALL(IF('quantities report_secondary'!$A$2:$A$10003=C$6,ROW('quantities report_secondary'!$A$2:$A$10003)-1,\"\"),ROWS($B$8:$B25))),\"0\"))","v":""},{"$f":"IF($B25=\"\",\"\",IFERROR(INDEX('quantities report_secondary'!$D$2:$D$10003,SMALL(IF('quantities report_secondary'!$A$2:$A$10003=D$6,ROW('quantities report_secondary'!$A$2:$A$10003)-1,\"\"),ROWS($B$8:$B25))),\"0\"))","v":""},{"$f":"IF($B25=\"\",\"\",IFERROR(INDEX('quantities report_secondary'!$D$2:$D$10003,SMALL(IF('quantities report_secondary'!$A$2:$A$10003=E$6,ROW('quantities report_secondary'!$A$2:$A$10003)-1,\"\"),ROWS($B$8:$B25))),\"0\"))","v":""},{"$f":"IF($B25=\"\",\"\",IFERROR(INDEX('quantities report_secondary'!$D$2:$D$10003,SMALL(IF('quantities report_secondary'!$A$2:$A$10003=F$6,ROW('quantities report_secondary'!$A$2:$A$10003)-1,\"\"),ROWS($B$8:$B25))),\"0\"))","v":""},{"$f":"IF($B25=\"\",\"\",IFERROR(INDEX('quantities report_secondary'!$D$2:$D$10003,SMALL(IF('quantities report_secondary'!$A$2:$A$10003=G$6,ROW('quantities report_secondary'!$A$2:$A$10003)-1,\"\"),ROWS($B$8:$B25))),\"0\"))","v":""},{"$f":"IF($B25=\"\",\"\",IFERROR(INDEX('quantities report_secondary'!$D$2:$D$10003,SMALL(IF('quantities report_secondary'!$A$2:$A$10003=H$6,ROW('quantities report_secondary'!$A$2:$A$10003)-1,\"\"),ROWS($B$8:$B25))),\"0\"))","v":""},{"$f":"IF(B25=\"\",\"\",SUM(C25:H25))","v":""}]
[null,{"$f":"IFERROR(INDEX('manual inputs_secondary'!M:M,SMALL(IF('manual inputs_secondary'!M:M<>\"\",ROW('manual inputs_secondary'!M:M)),ROW(21:21))),\"\")","v":""},{"$f":"IF($B26=\"\",\"\",IFERROR(INDEX('quantities report_secondary'!$D$2:$D$10003,SMALL(IF('quantities report_secondary'!$A$2:$A$10003=C$6,ROW('quantities report_secondary'!$A$2:$A$10003)-1,\"\"),ROWS($B$8:$B26))),\"0\"))","v":""},{"$f":"IF($B26=\"\",\"\",IFERROR(INDEX('quantities report_secondary'!$D$2:$D$10003,SMALL(IF('quantities report_secondary'!$A$2:$A$10003=D$6,ROW('quantities report_secondary'!$A$2:$A$10003)-1,\"\"),ROWS($B$8:$B26))),\"0\"))","v":""},{"$f":"IF($B26=\"\",\"\",IFERROR(INDEX('quantities report_secondary'!$D$2:$D$10003,SMALL(IF('quantities report_secondary'!$A$2:$A$10003=E$6,ROW('quantities report_secondary'!$A$2:$A$10003)-1,\"\"),ROWS($B$8:$B26))),\"0\"))","v":""},{"$f":"IF($B26=\"\",\"\",IFERROR(INDEX('quantities report_secondary'!$D$2:$D$10003,SMALL(IF('quantities report_secondary'!$A$2:$A$10003=F$6,ROW('quantities report_secondary'!$A$2:$A$10003)-1,\"\"),ROWS($B$8:$B26))),\"0\"))","v":""},{"$f":"IF($B26=\"\",\"\",IFERROR(INDEX('quantities report_secondary'!$D$2:$D$10003,SMALL(IF('quantities report_secondary'!$A$2:$A$10003=G$6,ROW('quantities report_secondary'!$A$2:$A$10003)-1,\"\"),ROWS($B$8:$B26))),\"0\"))","v":""},{"$f":"IF($B26=\"\",\"\",IFERROR(INDEX('quantities report_secondary'!$D$2:$D$10003,SMALL(IF('quantities report_secondary'!$A$2:$A$10003=H$6,ROW('quantities report_secondary'!$A$2:$A$10003)-1,\"\"),ROWS($B$8:$B26))),\"0\"))","v":""},{"$f":"IF(B26=\"\",\"\",SUM(C26:H26))","v":""}]
[null,{"$f":"IFERROR(INDEX('manual inputs_secondary'!M:M,SMALL(IF('manual inputs_secondary'!M:M<>\"\",ROW('manual inputs_secondary'!M:M)),ROW(22:22))),\"\")","v":""},{"$f":"IF($B27=\"\",\"\",IFERROR(INDEX('quantities report_secondary'!$D$2:$D$10003,SMALL(IF('quantities report_secondary'!$A$2:$A$10003=C$6,ROW('quantities report_secondary'!$A$2:$A$10003)-1,\"\"),ROWS($B$8:$B27))),\"0\"))","v":""},{"$f":"IF($B27=\"\",\"\",IFERROR(INDEX('quantities report_secondary'!$D$2:$D$10003,SMALL(IF('quantities report_secondary'!$A$2:$A$10003=D$6,ROW('quantities report_secondary'!$A$2:$A$10003)-1,\"\"),ROWS($B$8:$B27))),\"0\"))","v":""},{"$f":"IF($B27=\"\",\"\",IFERROR(INDEX('quantities report_secondary'!$D$2:$D$10003,SMALL(IF('quantities report_secondary'!$A$2:$A$10003=E$6,ROW('quantities report_secondary'!$A$2:$A$10003)-1,\"\"),ROWS($B$8:$B27))),\"0\"))","v":""},{"$f":"IF($B27=\"\",\"\",IFERROR(INDEX('quantities report_secondary'!$D$2:$D$10003,SMALL(IF('quantities report_secondary'!$A$2:$A$10003=F$6,ROW('quantities report_secondary'!$A$2:$A$10003)-1,\"\"),ROWS($B$8:$B27))),\"0\"))","v":""},{"$f":"IF($B27=\"\",\"\",IFERROR(INDEX('quantities report_secondary'!$D$2:$D$10003,SMALL(IF('quantities report_secondary'!$A$2:$A$10003=G$6,ROW('quantities report_secondary'!$A$2:$A$10003)-1,\"\"),ROWS($B$8:$B27))),\"0\"))","v":""},{"$f":"IF($B27=\"\",\"\",IFERROR(INDEX('quantities report_secondary'!$D$2:$D$10003,SMALL(IF('quantities report_secondary'!$A$2:$A$10003=H$6,ROW('quantities report_secondary'!$A$2:$A$10003)-1,\"\"),ROWS($B$8:$B27))),\"0\"))","v":""},{"$f":"IF(B27=\"\",\"\",SUM(C27:H27))","v":""}]
[null,{"$f":"IFERROR(INDEX('manual inputs_secondary'!M:M,SMALL(IF('manual inputs_secondary'!M:M<>\"\",ROW('manual inputs_secondary'!M:M)),ROW(23:23))),\"\")","v":""},{"$f":"IF($B28=\"\",\"\",IFERROR(INDEX('quantities report_secondary'!$D$2:$D$10003,SMALL(IF('quantities report_secondary'!$A$2:$A$10003=C$6,ROW('quantities report_secondary'!$A$2:$A$10003)-1,\"\"),ROWS($B$8:$B28))),\"0\"))","v":""},{"$f":"IF($B28=\"\",\"\",IFERROR(INDEX('quantities report_secondary'!$D$2:$D$10003,SMALL(IF('quantities report_secondary'!$A$2:$A$10003=D$6,ROW('quantities report_secondary'!$A$2:$A$10003)-1,\"\"),ROWS($B$8:$B28))),\"0\"))","v":""},{"$f":"IF($B28=\"\",\"\",IFERROR(INDEX('quantities report_secondary'!$D$2:$D$10003,SMALL(IF('quantities report_secondary'!$A$2:$A$10003=E$6,ROW('quantities report_secondary'!$A$2:$A$10003)-1,\"\"),ROWS($B$8:$B28))),\"0\"))","v":""},{"$f":"IF($B28=\"\",\"\",IFERROR(INDEX('quantities report_secondary'!$D$2:$D$10003,SMALL(IF('quantities report_secondary'!$A$2:$A$10003=F$6,ROW('quantities report_secondary'!$A$2:$A$10003)-1,\"\"),ROWS($B$8:$B28))),\"0\"))","v":""},{"$f":"IF($B28=\"\",\"\",IFERROR(INDEX('quantities report_secondary'!$D$2:$D$10003,SMALL(IF('quantities report_secondary'!$A$2:$A$10003=G$6,ROW('quantities report_secondary'!$A$2:$A$10003)-1,\"\"),ROWS($B$8:$B28))),\"0\"))","v":""},{"$f":"IF($B28=\"\",\"\",IFERROR(INDEX('quantities report_secondary'!$D$2:$D$10003,SMALL(IF('quantities report_secondary'!$A$2:$A$10003=H$6,ROW('quantities report_secondary'!$A$2:$A$10003)-1,\"\"),ROWS($B$8:$B28))),\"0\"))","v":""},{"$f":"IF(B28=\"\",\"\",SUM(C28:H28))","v":""}]
[null,{"$f":"IFERROR(INDEX('manual inputs_secondary'!M:M,SMALL(IF('manual inputs_secondary'!M:M<>\"\",ROW('manual inputs_secondary'!M:M)),ROW(24:24))),\"\")","v":""},{"$f":"IF($B29=\"\",\"\",IFERROR(INDEX('quantities report_secondary'!$D$2:$D$10003,SMALL(IF('quantities report_secondary'!$A$2:$A$10003=C$6,ROW('quantities report_secondary'!$A$2:$A$10003)-1,\"\"),ROWS($B$8:$B29))),\"0\"))","v":""},{"$f":"IF($B29=\"\",\"\",IFERROR(INDEX('quantities report_secondary'!$D$2:$D$10003,SMALL(IF('quantities report_secondary'!$A$2:$A$10003=D$6,ROW('quantities report_secondary'!$A$2:$A$10003)-1,\"\"),ROWS($B$8:$B29))),\"0\"))","v":""},{"$f":"IF($B29=\"\",\"\",IFERROR(INDEX('quantities report_secondary'!$D$2:$D$10003,SMALL(IF('quantities report_secondary'!$A$2:$A$10003=E$6,ROW('quantities report_secondary'!$A$2:$A$10003)-1,\"\"),ROWS($B$8:$B29))),\"0\"))","v":""},{"$f":"IF($B29=\"\",\"\",IFERROR(INDEX('quantities report_secondary'!$D$2:$D$10003,SMALL(IF('quantities report_secondary'!$A$2:$A$10003=F$6,ROW('quantities report_secondary'!$A$2:$A$10003)-1,\"\"),ROWS($B$8:$B29))),\"0\"))","v":""},{"$f":"IF($B29=\"\",\"\",IFERROR(INDEX('quantities report_secondary'!$D$2:$D$10003,SMALL(IF('quantities report_secondary'!$A$2:$A$10003=G$6,ROW('quantities report_secondary'!$A$2:$A$10003)-1,\"\"),ROWS($B$8:$B29))),\"0\"))","v":""},{"$f":"IF($B29=\"\",\"\",IFERROR(INDEX('quantities report_secondary'!$D$2:$D$10003,SMALL(IF('quantities report_secondary'!$A$2:$A$10003=H$6,ROW('quantities report_secondary'!$A$2:$A$10003)-1,\"\"),ROWS($B$8:$B29))),\"0\"))","v":""},{"$f":"IF(B29=\"\",\"\",SUM(C29:H29))","v":""}]
[null,{"$f":"IFERROR(INDEX('manual inputs_secondary'!M:M,SMALL(IF('manual inputs_secondary'!M:M<>\"\",ROW('manual inputs_secondary'!M:M)),ROW(25:25))),\"\")","v":""},{"$f":"IF($B30=\"\",\"\",IFERROR(INDEX('quantities report_secondary'!$D$2:$D$10003,SMALL(IF('quantities report_secondary'!$A$2:$A$10003=C$6,ROW('quantities report_secondary'!$A$2:$A$10003)-1,\"\"),ROWS($B$8:$B30))),\"0\"))","v":""},{"$f":"IF($B30=\"\",\"\",IFERROR(INDEX('quantities report_secondary'!$D$2:$D$10003,SMALL(IF('quantities report_secondary'!$A$2:$A$10003=D$6,ROW('quantities report_secondary'!$A$2:$A$10003)-1,\"\"),ROWS($B$8:$B30))),\"0\"))","v":""},{"$f":"IF($B30=\"\",\"\",IFERROR(INDEX('quantities report_secondary'!$D$2:$D$10003,SMALL(IF('quantities report_secondary'!$A$2:$A$10003=E$6,ROW('quantities report_secondary'!$A$2:$A$10003)-1,\"\"),ROWS($B$8:$B30))),\"0\"))","v":""},{"$f":"IF($B30=\"\",\"\",IFERROR(INDEX('quantities report_secondary'!$D$2:$D$10003,SMALL(IF('quantities report_secondary'!$A$2:$A$10003=F$6,ROW('quantities report_secondary'!$A$2:$A$10003)-1,\"\"),ROWS($B$8:$B30))),\"0\"))","v":""},{"$f":"IF($B30=\"\",\"\",IFERROR(INDEX('quantities report_secondary'!$D$2:$D$10003,SMALL(IF('quantities report_secondary'!$A$2:$A$10003=G$6,ROW('quantities report_secondary'!$A$2:$A$10003)-1,\"\"),ROWS($B$8:$B30))),\"0\"))","v":""},{"$f":"IF($B30=\"\",\"\",IFERROR(INDEX('quantities report_secondary'!$D$2:$D$10003,SMALL(IF('quantities report_secondary'!$A$2:$A$10003=H$6,ROW('quantities report_secondary'!$A$2:$A$10003)-1,\"\"),ROWS($B$8:$B30))),\"0\"))","v":""},{"$f":"IF(B30=\"\",\"\",SUM(C30:H30))","v":""}]
[null,{"$f":"IFERROR(INDEX('manual inputs_secondary'!M:M,SMALL(IF('manual inputs_secondary'!M:M<>\"\",ROW('manual inputs_secondary'!M:M)),ROW(26:26))),\"\")","v":""},{"$f":"IF($B31=\"\",\"\",IFERROR(INDEX('quantities report_secondary'!$D$2:$D$10003,SMALL(IF('quantities report_secondary'!$A$2:$A$10003=C$6,ROW('quantities report_secondary'!$A$2:$A$10003)-1,\"\"),ROWS($B$8:$B31))),\"0\"))","v":""},{"$f":"IF($B31=\"\",\"\",IFERROR(INDEX('quantities report_secondary'!$D$2:$D$10003,SMALL(IF('quantities report_secondary'!$A$2:$A$10003=D$6,ROW('quantities report_secondary'!$A$2:$A$10003)-1,\"\"),ROWS($B$8:$B31))),\"0\"))","v":""},{"$f":"IF($B31=\"\",\"\",IFERROR(INDEX('quantities report_secondary'!$D$2:$D$10003,SMALL(IF('quantities report_secondary'!$A$2:$A$10003=E$6,ROW('quantities report_secondary'!$A$2:$A$10003)-1,\"\"),ROWS($B$8:$B31))),\"0\"))","v":""},{"$f":"IF($B31=\"\",\"\",IFERROR(INDEX('quantities report_secondary'!$D$2:$D$10003,SMALL(IF('quantities report_secondary'!$A$2:$A$10003=F$6,ROW('quantities report_secondary'!$A$2:$A$10003)-1,\"\"),ROWS($B$8:$B31))),\"0\"))","v":""},{"$f":"IF($B31=\"\",\"\",IFERROR(INDEX('quantities report_secondary'!$D$2:$D$10003,SMALL(IF('quantities report_secondary'!$A$2:$A$10003=G$6,ROW('quantities report_secondary'!$A$2:$A$10003)-1,\"\"),ROWS($B$8:$B31))),\"0\"))","v":""},{"$f":"IF($B31=\"\",\"\",IFERROR(INDEX('quantities report_secondary'!$D$2:$D$10003,SMALL(IF('quantities report_secondary'!$A$2:$A$10003=H$6,ROW('quantities report_secondary'!$A$2:$A$10003)-1,\"\"),ROWS($B$8:$B31))),\"0\"))","v":""},{"$f":"IF(B31=\"\",\"\",SUM(C31:H31))","v":""}]
[null,{"$f":"IFERROR(INDEX(#REF!,SMALL(IF(#REF!<>\"\",ROW(#REF!)),ROW(27:27))),\"\")","v":""}]

{"sheet":"Backfill_secondary","index":20,"n_rows":32,"n_cols":21,"rows_kept":32,"cut":false,"hidden":false,"merged":[[3,2,3,18],[4,3,5,3],[4,7,5,7],[4,17,5,17],[4,20,5,20]]}
[]
[]
["TOTALS",null,{"$f":"SUM(C8:C32)","v":0},null,{"$f":"SUM(E8:E32)","v":0},{"$f":"SUM(F8:F32)","v":0},null,null,0,0,0,0,0,0,{"$f":"SUM(O8:O32)","v":0},0,0,null,0,0]
[]
[null,null,"Parapet\n(+)\nCommon Backfill ","Total Common Backfill (+)","Parapet\n(+)\nFoundation\nFill","Rockery\n(+)\nFoundation\nFill","MSE\n(+)\nFoundation\nFill","Total Foundation Fill (+)","(+)\nSelect Granular\nBackfill","(+)\nRock","(+)\nGranular\nRock Backdrain","Parapet\n(+)\nStructural Backfill","MSE\n(+)\nCommon Backfill","MSE\n(+)\nCommon Backfill","(+)\nCommon Backfill","Parapet\n(+)\nCommon Backfill","(+)\nCommon Backfill","Total Common Backfill (+)","(+)\nSelect Granular\nBackfill","(+)\nGranular\nRock Backdrain","Total Granular Backfill (+)"]
["ORD Component Name",null,"Wall backfill: ",null,"Wall Foundation: ","Rockery Wall Foundation Backfill: ","MSE Wall Foundation: ",null,"MSE Wall Backfill 2: ","Rockery Wall Backfill: ","Rockery Wall Backfill 2: ","Wall Backfill 2: ","MSE Wall Backfill 3:","MSE Wall Front:","Soil Nail Wall Backfill: ","Wall Backfill Top: ","Guard Wall Backfill 1: ",null,"MSE Wall Backfill 1: ","Rockery Wall Backfill 2: "]
["Enter Start of Project",{"$f":"IFERROR(INDEX('manual inputs_secondary'!M:M,SMALL(IF('manual inputs_secondary'!M:M<>\"\",ROW('manual inputs_secondary'!M:M)),ROW(2:2))),\"\")","v":""}]
[null,{"$f":"IFERROR(INDEX('manual inputs_secondary'!M:M,SMALL(IF('manual inputs_secondary'!M:M<>\"\",ROW('manual inputs_secondary'!M:M)),ROW(3:3))),\"\")","v":""},{"$f":"IF($B8=\"\",\"\",IFERROR(INDEX('quantities report_secondary'!$D$2:$D$10003,SMALL(IF('quantities report_secondary'!$A$2:$A$10003=C$6,ROW('quantities report_secondary'!$A$2:$A$10003)-1,\"\"),ROWS($B$8:$B8))),\"0\"))","v":""},{"$f":"IF($B8=\"\",\"\",SUM(C8:C8))","v":""},{"$f":"IF($B8=\"\",\"\",IFERROR(INDEX('quantities report_secondary'!$D$2:$D$10003,SMALL(IF('quantities report_secondary'!$A$2:$A$10003=E$6,ROW('quantities report_secondary'!$A$2:$A$10003)-1,\"\"),ROWS($B$8:$B8))),\"0\"))","v":""},{"$f":"IF($B8=\"\",\"\",IFERROR(INDEX('quantities report_secondary'!$D$2:$D$10003,SMALL(IF('quantities report_secondary'!$A$2:$A$10003=F$6,ROW('quantities report_secondary'!$A$2:$A$10003)-1,\"\"),ROWS($B$8:$B8))),\"0\"))","v":""},{"$f":"IF($B8=\"\",\"\",IFERROR(INDEX('quantities report_secondary'!$D$2:$D$10003,SMALL(IF('quantities report_secondary'!$A$2:$A$10003=G$6,ROW('quantities report_secondary'!$A$2:$A$10003)-1,\"\"),ROWS($B$8:$B8))),\"0\"))","v":""},{"$f":"IF($B8=\"\",\"\",SUM(E8:G8))","v":""},{"$f":"IF($B8=\"\",\"\",IFERROR(INDEX('quantities report_secondary'!$D$2:$D$10003,SMALL(IF('quantities report_secondary'!$A$2:$A$10003=I$6,ROW('quantities report_secondary'!$A$2:$A$10003)-1,\"\"),ROWS($B$8:$B8))),\"0\"))","v":""},{"$f":"IF($B8=\"\",\"\",IFERROR(INDEX('quantities report_secondary'!$D$2:$D$10003,SMALL(IF('quantities report_secondary'!$A$2:$A$10003=J$6,ROW('quantities report_secondary'!$A$2:$A$10003)-1,\"\"),ROWS($B$8:$B8))),\"0\"))","v":""},{"$f":"IF($B8=\"\",\"\",IFERROR(INDEX('quantities report_secondary'!$D$2:$D$10003,SMALL(IF('quantities report_secondary'!$A$2:$A$10003=K$6,ROW('quantities report_secondary'!$A$2:$A$10003)-1,\"\"),ROWS($B$8:$B8))),\"0\"))","v":""},{"$f":"IF($B8=\"\",\"\",IFERROR(INDEX('quantities report_secondary'!$D$2:$D$10003,SMALL(IF('quantities report_secondary'!$A$2:$A$10003=L$6,ROW('quantities report_secondary'!$A$2:$A$10003)-1,\"\"),ROWS($B$8:$B8))),\"0\"))","v":""},{"$f":"IF($B8=\"\",\"\",IFERROR(INDEX('quantities report_secondary'!$D$2:$D$10003,SMALL(IF('quantities report_secondary'!$A$2:$A$10003=M$6,ROW('quantities report_secondary'!$A$2:$A$10003)-1,\"\"),ROWS($B$8:$B8))),\"0\"))","v":""},{"$f":"IF($B8=\"\",\"\",IFERROR(INDEX('quantities report_secondary'!$D$2:$D$10003,SMALL(IF('quantities report_secondary'!$A$2:$A$10003=N$6,ROW('quantities report_secondary'!$A$2:$A$10003)-1,\"\"),ROWS($B$8:$B8))),\"0\"))","v":""},{"$f":"IF($B8=\"\",\"\",IFERROR(INDEX('quantities report_secondary'!$D$2:$D$10003,SMALL(IF('quantities report_secondary'!$A$2:$A$10003=O$6,ROW('quantities report_secondary'!$A$2:$A$10003)-1,\"\"),ROWS($B$8:$B8))),\"0\"))","v":""},{"$f":"IF($B8=\"\",\"\",IFERROR(INDEX('quantities report_secondary'!$D$2:$D$10003,SMALL(IF('quantities report_secondary'!$A$2:$A$10003=P$6,ROW('quantities report_secondary'!$A$2:$A$10003)-1,\"\"),ROWS($B$8:$B8))),\"0\"))","v":""},{"$f":"IF($B8=\"\",\"\",IFERROR(INDEX('quantities report_secondary'!$D$2:$D$10003,SMALL(IF('quantities report_secondary'!$A$2:$A$10003=Q$6,ROW('quantities report_secondary'!$A$2:$A$10003)-1,\"\"),ROWS($B$8:$B8))),\"0\"))","v":""},{"$f":"IF($B8=\"\",\"\",SUM(M8:Q8))","v":""},{"$f":"IF($B8=\"\",\"\",IFERROR(INDEX('quantities report_secondary'!$D$2:$D$10003,SMALL(IF('quantities report_secondary'!$A$2:$A$10003=S$6,ROW('quantities report_secondary'!$A$2:$A$10003)-1,\"\"),ROWS($B$8:$B8))),\"0\"))","v":""},{"$f":"IF($B8=\"\",\"\",IFERROR(INDEX('quantities report_secondary'!$D$2:$D$10003,SMALL(IF('quantities report_secondary'!$A$2:$A$10003=T$6,ROW('quantities report_secondary'!$A$2:$A$10003)-1,\"\"),ROWS($B$8:$B8))),\"0\"))","v":""},{"$f":"IF($B8=\"\",\"\",SUM(S8:T8))","v":""}]
[null,{"$f":"IFERROR(INDEX('manual inputs_secondary'!M:M,SMALL(IF('manual inputs_secondary'!M:M<>\"\",ROW('manual inputs_secondary'!M:M)),ROW(4:4))),\"\")","v":""},{"$f":"IF($B9=\"\",\"\",IFERROR(INDEX('quantities report_secondary'!$D$2:$D$10003,SMALL(IF('quantities report_secondary'!$A$2:$A$10003=C$6,ROW('quantities report_secondary'!$A$2:$A$10003)-1,\"\"),ROWS($B$8:$B9))),\"0\"))","v":""},{"$f":"IF($B9=\"\",\"\",SUM(C9:C9))","v":""},{"$f":"IF($B9=\"\",\"\",IFERROR(INDEX('quantities report_secondary'!$D$2:$D$10003,SMALL(IF('quantities report_secondary'!$A$2:$A$10003=E$6,ROW('quantities report_secondary'!$A$2:$A$10003)-1,\"\"),ROWS($B$8:$B9))),\"0\"))","v":""},{"$f":"IF($B9=\"\",\"\",IFERROR(INDEX('quantities report_secondary'!$D$2:$D$10003,SMALL(IF('quantities report_secondary'!$A$2:$A$10003=F$6,ROW('quantities report_secondary'!$A$2:$A$10003)-1,\"\"),ROWS($B$8:$B9))),\"0\"))","v":""},{"$f":"IF($B9=\"\",\"\",IFERROR(INDEX('quantities report_secondary'!$D$2:$D$10003,SMALL(IF('quantities report_secondary'!$A$2:$A$10003=G$6,ROW('quantities report_secondary'!$A$2:$A$10003)-1,\"\"),ROWS($B$8:$B9))),\"0\"))","v":""},{"$f":"IF($B9=\"\",\"\",SUM(E9:G9))","v":""},{"$f":"IF($B9=\"\",\"\",IFERROR(INDEX('quantities report_secondary'!$D$2:$D$10003,SMALL(IF('quantities report_secondary'!$A$2:$A$10003=I$6,ROW('quantities report_secondary'!$A$2:$A$10003)-1,\"\"),ROWS($B$8:$B9))),\"0\"))","v":""},{"$f":"IF($B9=\"\",\"\",IFERROR(INDEX('quantities report_secondary'!$D$2:$D$10003,SMALL(IF('quantities report_secondary'!$A$2:$A$10003=J$6,ROW('quantities report_secondary'!$A$2:$A$10003)-1,\"\"),ROWS($B$8:$B9))),\"0\"))","v":""},{"$f":"IF($B9=\"\",\"\",IFERROR(INDEX('quantities report_secondary'!$D$2:$D$10003,SMALL(IF('quantities report_secondary'!$A$2:$A$10003=K$6,ROW('quantities report_secondary'!$A$2:$A$10003)-1,\"\"),ROWS($B$8:$B9))),\"0\"))","v":""},{"$f":"IF($B9=\"\",\"\",IFERROR(INDEX('quantities report_secondary'!$D$2:$D$10003,SMALL(IF('quantities report_secondary'!$A$2:$A$10003=L$6,ROW('quantities report_secondary'!$A$2:$A$10003)-1,\"\"),ROWS($B$8:$B9))),\"0\"))","v":""},{"$f":"IF($B9=\"\",\"\",IFERROR(INDEX('quantities report_secondary'!$D$2:$D$10003,SMALL(IF('quantities report_secondary'!$A$2:$A$10003=M$6,ROW('quantities report_secondary'!$A$2:$A$10003)-1,\"\"),ROWS($B$8:$B9))),\"0\"))","v":""},{"$f":"IF($B9=\"\",\"\",IFERROR(INDEX('quantities report_secondary'!$D$2:$D$10003,SMALL(IF('quantities report_secondary'!$A$2:$A$10003=N$6,ROW('quantities report_secondary'!$A$2:$A$10003)-1,\"\"),ROWS($B$8:$B9))),\"0\"))","v":""},{"$f":"IF($B9=\"\",\"\",IFERROR(INDEX('quantities report_secondary'!$D$2:$D$10003,SMALL(IF('quantities report_secondary'!$A$2:$A$10003=O$6,ROW('quantities report_secondary'!$A$2:$A$10003)-1,\"\"),ROWS($B$8:$B9))),\"0\"))","v":""},{"$f":"IF($B9=\"\",\"\",IFERROR(INDEX('quantities report_secondary'!$D$2:$D$10003,SMALL(IF('quantities report_secondary'!$A$2:$A$10003=P$6,ROW('quantities report_secondary'!$A$2:$A$10003)-1,\"\"),ROWS($B$8:$B9))),\"0\"))","v":""},{"$f":"IF($B9=\"\",\"\",IFERROR(INDEX('quantities report_secondary'!$D$2:$D$10003,SMALL(IF('quantities report_secondary'!$A$2:$A$10003=Q$6,ROW('quantities report_secondary'!$A$2:$A$10003)-1,\"\"),ROWS($B$8:$B9))),\"0\"))","v":""},{"$f":"IF($B9=\"\",\"\",SUM(M9:Q9))","v":""},{"$f":"IF($B9=\"\",\"\",IFERROR(INDEX('quantities report_secondary'!$D$2:$D$10003,SMALL(IF('quantities report_secondary'!$A$2:$A$10003=S$6,ROW('quantities report_secondary'!$A$2:$A$10003)-1,\"\"),ROWS($B$8:$B9))),\"0\"))","v":""},{"$f":"IF($B9=\"\",\"\",IFERROR(INDEX('quantities report_secondary'!$D$2:$D$10003,SMALL(IF('quantities report_secondary'!$A$2:$A$10003=T$6,ROW('quantities report_secondary'!$A$2:$A$10003)-1,\"\"),ROWS($B$8:$B9))),\"0\"))","v":""},{"$f":"IF($B9=\"\",\"\",SUM(S9:T9))","v":""}]
[null,{"$f":"IFERROR(INDEX('manual inputs_secondary'!M:M,SMALL(IF('manual inputs_secondary'!M:M<>\"\",ROW('manual inputs_secondary'!M:M)),ROW(5:5))),\"\")","v":""},{"$f":"IF($B10=\"\",\"\",IFERROR(INDEX('quantities report_secondary'!$D$2:$D$10003,SMALL(IF('quantities report_secondary'!$A$2:$A$10003=C$6,ROW('quantities report_secondary'!$A$2:$A$10003)-1,\"\"),ROWS($B$8:$B10))),\"0\"))","v":""},"",{"$f":"IF($B10=\"\",\"\",IFERROR(INDEX('quantities report_secondary'!$D$2:$D$10003,SMALL(IF('quantities report_secondary'!$A$2:$A$10003=E$6,ROW('quantities report_secondary'!$A$2:$A$10003)-1,\"\"),ROWS($B$8:$B10))),\"0\"))","v":""},{"$f":"IF($B10=\"\",\"\",IFERROR(INDEX('quantities report_secondary'!$D$2:$D$10003,SMALL(IF('quantities report_secondary'!$A$2:$A$10003=F$6,ROW('quantities report_secondary'!$A$2:$A$10003)-1,\"\"),ROWS($B$8:$B10))),\"0\"))","v":""},{"$f":"IF($B10=\"\",\"\",IFERROR(INDEX('quantities report_secondary'!$D$2:$D$10003,SMALL(IF('quantities report_secondary'!$A$2:$A$10003=G$6,ROW('quantities report_secondary'!$A$2:$A$10003)-1,\"\"),ROWS($B$8:$B10))),\"0\"))","v":""},"",{"$f":"IF($B10=\"\",\"\",IFERROR(INDEX('quantities report_secondary'!$D$2:$D$10003,SMALL(IF('quantities report_secondary'!$A$2:$A$10003=I$6,ROW('quantities report_secondary'!$A$2:$A$10003)-1,\"\"),ROWS($B$8:$B10))),\"0\"))","v":""},{"$f":"IF($B10=\"\",\"\",IFERROR(INDEX('quantities report_secondary'!$D$2:$D$10003,SMALL(IF('quantities report_secondary'!$A$2:$A$10003=J$6,ROW('quantities report_secondary'!$A$2:$A$10003)-1,\"\"),ROWS($B$8:$B10))),\"0\"))","v":""},{"$f":"IF($B10=\"\",\"\",IFERROR(INDEX('quantities report_secondary'!$D$2:$D$10003,SMALL(IF('quantities report_secondary'!$A$2:$A$10003=K$6,ROW('quantities report_secondary'!$A$2:$A$10003)-1,\"\"),ROWS($B$8:$B10))),\"0\"))","v":""},{"$f":"IF($B10=\"\",\"\",IFERROR(INDEX('quantities report_secondary'!$D$2:$D$10003,SMALL(IF('quantities report_secondary'!$A$2:$A$10003=L$6,ROW('quantities report_secondary'!$A$2:$A$10003)-1,\"\"),ROWS($B$8:$B10))),\"0\"))","v":""},{"$f":"IF($B10=\"\",\"\",IFERROR(INDEX('quantities report_secondary'!$D$2:$D$10003,SMALL(IF('quantities report_secondary'!$A$2:$A$10003=M$6,ROW('quantities report_secondary'!$A$2:$A$10003)-1,\"\"),ROWS($B$8:$B10))),\"0\"))","v":""},{"$f":"IF($B10=\"\",\"\",IFERROR(INDEX('quantities report_secondary'!$D$2:$D$10003,SMALL(IF('quantities report_secondary'!$A$2:$A$10003=N$6,ROW('quantities report_secondary'!$A$2:$A$10003)-1,\"\"),ROWS($B$8:$B10))),\"0\"))","v":""},{"$f":"IF($B10=\"\",\"\",IFERROR(INDEX('quantities report_secondary'!$D$2:$D$10003,SMALL(IF('quantities report_secondary'!$A$2:$A$10003=O$6,ROW('quantities report_secondary'!$A$2:$A$10003)-1,\"\"),ROWS($B$8:$B10))),\"0\"))","v":""},{"$f":"IF($B10=\"\",\"\",IFERROR(INDEX('quantities report_secondary'!$D$2:$D$10003,SMALL(IF('quantities report_secondary'!$A$2:$A$10003=P$6,ROW('quantities report_secondary'!$A$2:$A$10003)-1,\"\"),ROWS($B$8:$B10))),\"0\"))","v":""},{"$f":"IF($B10=\"\",\"\",IFERROR(INDEX('quantities report_secondary'!$D$2:$D$10003,SMALL(IF('quantities report_secondary'!$A$2:$A$10003=Q$6,ROW('quantities report_secondary'!$A$2:$A$10003)-1,\"\"),ROWS($B$8:$B10))),\"0\"))","v":""},"",{"$f":"IF($B10=\"\",\"\",IFERROR(INDEX('quantities report_secondary'!$D$2:$D$10003,SMALL(IF('quantities report_secondary'!$A$2:$A$10003=S$6,ROW('quantities report_secondary'!$A$2:$A$10003)-1,\"\"),ROWS($B$8:$B10))),\"0\"))","v":""},{"$f":"IF($B10=\"\",\"\",IFERROR(INDEX('quantities report_secondary'!$D$2:$D$10003,SMALL(IF('quantities report_secondary'!$A$2:$A$10003=T$6,ROW('quantities report_secondary'!$A$2:$A$10003)-1,\"\"),ROWS($B$8:$B10))),\"0\"))","v":""},""]
[null,{"$f":"IFERROR(INDEX('manual inputs_secondary'!M:M,SMALL(IF('manual inputs_secondary'!M:M<>\"\",ROW('manual inputs_secondary'!M:M)),ROW(6:6))),\"\")","v":""},{"$f":"IF($B11=\"\",\"\",IFERROR(INDEX('quantities report_secondary'!$D$2:$D$10003,SMALL(IF('quantities report_secondary'!$A$2:$A$10003=C$6,ROW('quantities report_secondary'!$A$2:$A$10003)-1,\"\"),ROWS($B$8:$B11))),\"0\"))","v":""},"",{"$f":"IF($B11=\"\",\"\",IFERROR(INDEX('quantities report_secondary'!$D$2:$D$10003,SMALL(IF('quantities report_secondary'!$A$2:$A$10003=E$6,ROW('quantities report_secondary'!$A$2:$A$10003)-1,\"\"),ROWS($B$8:$B11))),\"0\"))","v":""},{"$f":"IF($B11=\"\",\"\",IFERROR(INDEX('quantities report_secondary'!$D$2:$D$10003,SMALL(IF('quantities report_secondary'!$A$2:$A$10003=F$6,ROW('quantities report_secondary'!$A$2:$A$10003)-1,\"\"),ROWS($B$8:$B11))),\"0\"))","v":""},{"$f":"IF($B11=\"\",\"\",IFERROR(INDEX('quantities report_secondary'!$D$2:$D$10003,SMALL(IF('quantities report_secondary'!$A$2:$A$10003=G$6,ROW('quantities report_secondary'!$A$2:$A$10003)-1,\"\"),ROWS($B$8:$B11))),\"0\"))","v":""},"",{"$f":"IF($B11=\"\",\"\",IFERROR(INDEX('quantities report_secondary'!$D$2:$D$10003,SMALL(IF('quantities report_secondary'!$A$2:$A$10003=I$6,ROW('quantities report_secondary'!$A$2:$A$10003)-1,\"\"),ROWS($B$8:$B11))),\"0\"))","v":""},{"$f":"IF($B11=\"\",\"\",IFERROR(INDEX('quantities report_secondary'!$D$2:$D$10003,SMALL(IF('quantities report_secondary'!$A$2:$A$10003=J$6,ROW('quantities report_secondary'!$A$2:$A$10003)-1,\"\"),ROWS($B$8:$B11))),\"0\"))","v":""},{"$f":"IF($B11=\"\",\"\",IFERROR(INDEX('quantities report_secondary'!$D$2:$D$10003,SMALL(IF('quantities report_secondary'!$A$2:$A$10003=K$6,ROW('quantities report_secondary'!$A$2:$A$10003)-1,\"\"),ROWS($B$8:$B11))),\"0\"))","v":""},{"$f":"IF($B11=\"\",\"\",IFERROR(INDEX('quantities report_secondary'!$D$2:$D$10003,SMALL(IF('quantities report_secondary'!$A$2:$A$10003=L$6,ROW('quantities report_secondary'!$A$2:$A$10003)-1,\"\"),ROWS($B$8:$B11))),\"0\"))","v":""},{"$f":"IF($B11=\"\",\"\",IFERROR(INDEX('quantities report_secondary'!$D$2:$D$10003,SMALL(IF('quantities report_secondary'!$A$2:$A$10003=M$6,ROW('quantities report_secondary'!$A$2:$A$10003)-1,\"\"),ROWS($B$8:$B11))),\"0\"))","v":""},{"$f":"IF($B11=\"\",\"\",IFERROR(INDEX('quantities report_secondary'!$D$2:$D$10003,SMALL(IF('quantities report_secondary'!$A$2:$A$10003=N$6,ROW('quantities report_secondary'!$A$2:$A$10003)-1,\"\"),ROWS($B$8:$B11))),\"0\"))","v":""},{"$f":"IF($B11=\"\",\"\",IFERROR(INDEX('quantities report_secondary'!$D$2:$D$10003,SMALL(IF('quantities report_secondary'!$A$2:$A$10003=O$6,ROW('quantities report_secondary'!$A$2:$A$10003)-1,\"\"),ROWS($B$8:$B11))),\"0\"))","v":""},{"$f":"IF($B11=\"\",\"\",IFERROR(INDEX('quantities report_secondary'!$D$2:$D$10003,SMALL(IF('quantities report_secondary'!$A$2:$A$10003=P$6,ROW('quantities report_secondary'!$A$2:$A$10003)-1,\"\"),ROWS($B$8:$B11))),\"0\"))","v":""},{"$f":"IF($B11=\"\",\"\",IFERROR(INDEX('quantities report_secondary'!$D$2:$D$10003,SMALL(IF('quantities report_secondary'!$A$2:$A$10003=Q$6,ROW('quantities report_secondary'!$A$2:$A$10003)-1,\"\"),ROWS($B$8:$B11))),\"0\"))","v":""},"",{"$f":"IF($B11=\"\",\"\",IFERROR(INDEX('quantities report_secondary'!$D$2:$D$10003,SMALL(IF('quantities report_secondary'!$A$2:$A$10003=S$6,ROW('quantities report_secondary'!$A$2:$A$10003)-1,\"\"),ROWS($B$8:$B11))),\"0\"))","v":""},{"$f":"IF($B11=\"\",\"\",IFERROR(INDEX('quantities report_secondary'!$D$2:$D$10003,SMALL(IF('quantities report_secondary'!$A$2:$A$10003=T$6,ROW('quantities report_secondary'!$A$2:$A$10003)-1,\"\"),ROWS($B$8:$B11))),\"0\"))","v":""},""]
[null,{"$f":"IFERROR(INDEX('manual inputs_secondary'!M:M,SMALL(IF('manual inputs_secondary'!M:M<>\"\",ROW('manual inputs_secondary'!M:M)),ROW(7:7))),\"\")","v":""},{"$f":"IF($B12=\"\",\"\",IFERROR(INDEX('quantities report_secondary'!$D$2:$D$10003,SMALL(IF('quantities report_secondary'!$A$2:$A$10003=C$6,ROW('quantities report_secondary'!$A$2:$A$10003)-1,\"\"),ROWS($B$8:$B12))),\"0\"))","v":""},"",{"$f":"IF($B12=\"\",\"\",IFERROR(INDEX('quantities report_secondary'!$D$2:$D$10003,SMALL(IF('quantities report_secondary'!$A$2:$A$10003=E$6,ROW('quantities report_secondary'!$A$2:$A$10003)-1,\"\"),ROWS($B$8:$B12))),\"0\"))","v":""},{"$f":"IF($B12=\"\",\"\",IFERROR(INDEX('quantities report_secondary'!$D$2:$D$10003,SMALL(IF('quantities report_secondary'!$A$2:$A$10003=F$6,ROW('quantities report_secondary'!$A$2:$A$10003)-1,\"\"),ROWS($B$8:$B12))),\"0\"))","v":""},{"$f":"IF($B12=\"\",\"\",IFERROR(INDEX('quantities report_secondary'!$D$2:$D$10003,SMALL(IF('quantities report_secondary'!$A$2:$A$10003=G$6,ROW('quantities report_secondary'!$A$2:$A$10003)-1,\"\"),ROWS($B$8:$B12))),\"0\"))","v":""},"",{"$f":"IF($B12=\"\",\"\",IFERROR(INDEX('quantities report_secondary'!$D$2:$D$10003,SMALL(IF('quantities report_secondary'!$A$2:$A$10003=I$6,ROW('quantities report_secondary'!$A$2:$A$10003)-1,\"\"),ROWS($B$8:$B12))),\"0\"))","v":""},{"$f":"IF($B12=\"\",\"\",IFERROR(INDEX('quantities report_secondary'!$D$2:$D$10003,SMALL(IF('quantities report_secondary'!$A$2:$A$10003=J$6,ROW('quantities report_secondary'!$A$2:$A$10003)-1,\"\"),ROWS($B$8:$B12))),\"0\"))","v":""},{"$f":"IF($B12=\"\",\"\",IFERROR(INDEX('quantities report_secondary'!$D$2:$D$10003,SMALL(IF('quantities report_secondary'!$A$2:$A$10003=K$6,ROW('quantities report_secondary'!$A$2:$A$10003)-1,\"\"),ROWS($B$8:$B12))),\"0\"))","v":""},{"$f":"IF($B12=\"\",\"\",IFERROR(INDEX('quantities report_secondary'!$D$2:$D$10003,SMALL(IF('quantities report_secondary'!$A$2:$A$10003=L$6,ROW('quantities report_secondary'!$A$2:$A$10003)-1,\"\"),ROWS($B$8:$B12))),\"0\"))","v":""},{"$f":"IF($B12=\"\",\"\",IFERROR(INDEX('quantities report_secondary'!$D$2:$D$10003,SMALL(IF('quantities report_secondary'!$A$2:$A$10003=M$6,ROW('quantities report_secondary'!$A$2:$A$10003)-1,\"\"),ROWS($B$8:$B12))),\"0\"))","v":""},{"$f":"IF($B12=\"\",\"\",IFERROR(INDEX('quantities report_secondary'!$D$2:$D$10003,SMALL(IF('quantities report_secondary'!$A$2:$A$10003=N$6,ROW('quantities report_secondary'!$A$2:$A$10003)-1,\"\"),ROWS($B$8:$B12))),\"0\"))","v":""},{"$f":"IF($B12=\"\",\"\",IFERROR(INDEX('quantities report_secondary'!$D$2:$D$10003,SMALL(IF('quantities report_secondary'!$A$2:$A$10003=O$6,ROW('quantities report_secondary'!$A$2:$A$10003)-1,\"\"),ROWS($B$8:$B12))),\"0\"))","v":""},{"$f":"IF($B12=\"\",\"\",IFERROR(INDEX('quantities report_secondary'!$D$2:$D$10003,SMALL(IF('quantities report_secondary'!$A$2:$A$10003=P$6,ROW('quantities report_secondary'!$A$2:$A$10003)-1,\"\"),ROWS($B$8:$B12))),\"0\"))","v":""},{"$f":"IF($B12=\"\",\"\",IFERROR(INDEX('quantities report_secondary'!$D$2:$D$10003,SMALL(IF('quantities report_secondary'!$A$2:$A$10003=Q$6,ROW('quantities report_secondary'!$A$2:$A$10003)-1,\"\"),ROWS($B$8:$B12))),\"0\"))","v":""},"",{"$f":"IF($B12=\"\",\"\",IFERROR(INDEX('quantities report_secondary'!$D$2:$D$10003,SMALL(IF('quantities report_secondary'!$A$2:$A$10003=S$6,ROW('quantities report_secondary'!$A$2:$A$10003)-1,\"\"),ROWS($B$8:$B12))),\"0\"))","v":""},{"$f":"IF($B12=\"\",\"\",IFERROR(INDEX('quantities report_secondary'!$D$2:$D$10003,SMALL(IF('quantities report_secondary'!$A$2:$A$10003=T$6,ROW('quantities report_secondary'!$A$2:$A$10003)-1,\"\"),ROWS($B$8:$B12))),\"0\"))","v":""},""]
[null,{"$f":"IFERROR(INDEX('manual inputs_secondary'!M:M,SMALL(IF('manual inputs_secondary'!M:M<>\"\",ROW('manual inputs_secondary'!M:M)),ROW(8:8))),\"\")","v":""},{"$f":"IF($B13=\"\",\"\",IFERROR(INDEX('quantities report_secondary'!$D$2:$D$10003,SMALL(IF('quantities report_secondary'!$A$2:$A$10003=C$6,ROW('quantities report_secondary'!$A$2:$A$10003)-1,\"\"),ROWS($B$8:$B13))),\"0\"))","v":""},"",{"$f":"IF($B13=\"\",\"\",IFERROR(INDEX('quantities report_secondary'!$D$2:$D$10003,SMALL(IF('quantities report_secondary'!$A$2:$A$10003=E$6,ROW('quantities report_secondary'!$A$2:$A$10003)-1,\"\"),ROWS($B$8:$B13))),\"0\"))","v":""},{"$f":"IF($B13=\"\",\"\",IFERROR(INDEX('quantities report_secondary'!$D$2:$D$10003,SMALL(IF('quantities report_secondary'!$A$2:$A$10003=F$6,ROW('quantities report_secondary'!$A$2:$A$10003)-1,\"\"),ROWS($B$8:$B13))),\"0\"))","v":""},{"$f":"IF($B13=\"\",\"\",IFERROR(INDEX('quantities report_secondary'!$D$2:$D$10003,SMALL(IF('quantities report_secondary'!$A$2:$A$10003=G$6,ROW('quantities report_secondary'!$A$2:$A$10003)-1,\"\"),ROWS($B$8:$B13))),\"0\"))","v":""},"",{"$f":"IF($B13=\"\",\"\",IFERROR(INDEX('quantities report_secondary'!$D$2:$D$10003,SMALL(IF('quantities report_secondary'!$A$2:$A$10003=I$6,ROW('quantities report_secondary'!$A$2:$A$10003)-1,\"\"),ROWS($B$8:$B13))),\"0\"))","v":""},{"$f":"IF($B13=\"\",\"\",IFERROR(INDEX('quantities report_secondary'!$D$2:$D$10003,SMALL(IF('quantities report_secondary'!$A$2:$A$10003=J$6,ROW('quantities report_secondary'!$A$2:$A$10003)-1,\"\"),ROWS($B$8:$B13))),\"0\"))","v":""},{"$f":"IF($B13=\"\",\"\",IFERROR(INDEX('quantities report_secondary'!$D$2:$D$10003,SMALL(IF('quantities report_secondary'!$A$2:$A$10003=K$6,ROW('quantities report_secondary'!$A$2:$A$10003)-1,\"\"),ROWS($B$8:$B13))),\"0\"))","v":""},{"$f":"IF($B13=\"\",\"\",IFERROR(INDEX('quantities report_secondary'!$D$2:$D$10003,SMALL(IF('quantities report_secondary'!$A$2:$A$10003=L$6,ROW('quantities report_secondary'!$A$2:$A$10003)-1,\"\"),ROWS($B$8:$B13))),\"0\"))","v":""},{"$f":"IF($B13=\"\",\"\",IFERROR(INDEX('quantities report_secondary'!$D$2:$D$10003,SMALL(IF('quantities report_secondary'!$A$2:$A$10003=M$6,ROW('quantities report_secondary'!$A$2:$A$10003)-1,\"\"),ROWS($B$8:$B13))),\"0\"))","v":""},{"$f":"IF($B13=\"\",\"\",IFERROR(INDEX('quantities report_secondary'!$D$2:$D$10003,SMALL(IF('quantities report_secondary'!$A$2:$A$10003=N$6,ROW('quantities report_secondary'!$A$2:$A$10003)-1,\"\"),ROWS($B$8:$B13))),\"0\"))","v":""},{"$f":"IF($B13=\"\",\"\",IFERROR(INDEX('quantities report_secondary'!$D$2:$D$10003,SMALL(IF('quantities report_secondary'!$A$2:$A$10003=O$6,ROW('quantities report_secondary'!$A$2:$A$10003)-1,\"\"),ROWS($B$8:$B13))),\"0\"))","v":""},{"$f":"IF($B13=\"\",\"\",IFERROR(INDEX('quantities report_secondary'!$D$2:$D$10003,SMALL(IF('quantities report_secondary'!$A$2:$A$10003=P$6,ROW('quantities report_secondary'!$A$2:$A$10003)-1,\"\"),ROWS($B$8:$B13))),\"0\"))","v":""},{"$f":"IF($B13=\"\",\"\",IFERROR(INDEX('quantities report_secondary'!$D$2:$D$10003,SMALL(IF('quantities report_secondary'!$A$2:$A$10003=Q$6,ROW('quantities report_secondary'!$A$2:$A$10003)-1,\"\"),ROWS($B$8:$B13))),\"0\"))","v":""},"",{"$f":"IF($B13=\"\",\"\",IFERROR(INDEX('quantities report_secondary'!$D$2:$D$10003,SMALL(IF('quantities report_secondary'!$A$2:$A$10003=S$6,ROW('quantities report_secondary'!$A$2:$A$10003)-1,\"\"),ROWS($B$8:$B13))),\"0\"))","v":""},{"$f":"IF($B13=\"\",\"\",IFERROR(INDEX('quantities report_secondary'!$D$2:$D$10003,SMALL(IF('quantities report_secondary'!$A$2:$A$10003=T$6,ROW('quantities report_secondary'!$A$2:$A$10003)-1,\"\"),ROWS($B$8:$B13))),\"0\"))","v":""},""]
[null,{"$f":"IFERROR(INDEX('manual inputs_secondary'!M:M,SMALL(IF('manual inputs_secondary'!M:M<>\"\",ROW('manual inputs_secondary'!M:M)),ROW(9:9))),\"\")","v":""},{"$f":"IF($B14=\"\",\"\",IFERROR(INDEX('quantities report_secondary'!$D$2:$D$10003,SMALL(IF('quantities report_secondary'!$A$2:$A$10003=C$6,ROW('quantities report_secondary'!$A$2:$A$10003)-1,\"\"),ROWS($B$8:$B14))),\"0\"))","v":""},"",{"$f":"IF($B14=\"\",\"\",IFERROR(INDEX('quantities report_secondary'!$D$2:$D$10003,SMALL(IF('quantities report_secondary'!$A$2:$A$10003=E$6,ROW('quantities report_secondary'!$A$2:$A$10003)-1,\"\"),ROWS($B$8:$B14))),\"0\"))","v":""},{"$f":"IF($B14=\"\",\"\",IFERROR(INDEX('quantities report_secondary'!$D$2:$D$10003,SMALL(IF('quantities report_secondary'!$A$2:$A$10003=F$6,ROW('quantities report_secondary'!$A$2:$A$10003)-1,\"\"),ROWS($B$8:$B14))),\"0\"))","v":""},{"$f":"IF($B14=\"\",\"\",IFERROR(INDEX('quantities report_secondary'!$D$2:$D$10003,SMALL(IF('quantities report_secondary'!$A$2:$A$10003=G$6,ROW('quantities report_secondary'!$A$2:$A$10003)-1,\"\"),ROWS($B$8:$B14))),\"0\"))","v":""},"",{"$f":"IF($B14=\"\",\"\",IFERROR(INDEX('quantities report_secondary'!$D$2:$D$10003,SMALL(IF('quantities report_secondary'!$A$2:$A$10003=I$6,ROW('quantities report_secondary'!$A$2:$A$10003)-1,\"\"),ROWS($B$8:$B14))),\"0\"))","v":""},{"$f":"IF($B14=\"\",\"\",IFERROR(INDEX('quantities report_secondary'!$D$2:$D$10003,SMALL(IF('quantities report_secondary'!$A$2:$A$10003=J$6,ROW('quantities report_secondary'!$A$2:$A$10003)-1,\"\"),ROWS($B$8:$B14))),\"0\"))","v":""},{"$f":"IF($B14=\"\",\"\",IFERROR(INDEX('quantities report_secondary'!$D$2:$D$10003,SMALL(IF('quantities report_secondary'!$A$2:$A$10003=K$6,ROW('quantities report_secondary'!$A$2:$A$10003)-1,\"\"),ROWS($B$8:$B14))),\"0\"))","v":""},{"$f":"IF($B14=\"\",\"\",IFERROR(INDEX('quantities report_secondary'!$D$2:$D$10003,SMALL(IF('quantities report_secondary'!$A$2:$A$10003=L$6,ROW('quantities report_secondary'!$A$2:$A$10003)-1,\"\"),ROWS($B$8:$B14))),\"0\"))","v":""},{"$f":"IF($B14=\"\",\"\",IFERROR(INDEX('quantities report_secondary'!$D$2:$D$10003,SMALL(IF('quantities report_secondary'!$A$2:$A$10003=M$6,ROW('quantities report_secondary'!$A$2:$A$10003)-1,\"\"),ROWS($B$8:$B14))),\"0\"))","v":""},{"$f":"IF($B14=\"\",\"\",IFERROR(INDEX('quantities report_secondary'!$D$2:$D$10003,SMALL(IF('quantities report_secondary'!$A$2:$A$10003=N$6,ROW('quantities report_secondary'!$A$2:$A$10003)-1,\"\"),ROWS($B$8:$B14))),\"0\"))","v":""},{"$f":"IF($B14=\"\",\"\",IFERROR(INDEX('quantities report_secondary'!$D$2:$D$10003,SMALL(IF('quantities report_secondary'!$A$2:$A$10003=O$6,ROW('quantities report_secondary'!$A$2:$A$10003)-1,\"\"),ROWS($B$8:$B14))),\"0\"))","v":""},{"$f":"IF($B14=\"\",\"\",IFERROR(INDEX('quantities report_secondary'!$D$2:$D$10003,SMALL(IF('quantities report_secondary'!$A$2:$A$10003=P$6,ROW('quantities report_secondary'!$A$2:$A$10003)-1,\"\"),ROWS($B$8:$B14))),\"0\"))","v":""},{"$f":"IF($B14=\"\",\"\",IFERROR(INDEX('quantities report_secondary'!$D$2:$D$10003,SMALL(IF('quantities report_secondary'!$A$2:$A$10003=Q$6,ROW('quantities report_secondary'!$A$2:$A$10003)-1,\"\"),ROWS($B$8:$B14))),\"0\"))","v":""},"",{"$f":"IF($B14=\"\",\"\",IFERROR(INDEX('quantities report_secondary'!$D$2:$D$10003,SMALL(IF('quantities report_secondary'!$A$2:$A$10003=S$6,ROW('quantities report_secondary'!$A$2:$A$10003)-1,\"\"),ROWS($B$8:$B14))),\"0\"))","v":""},{"$f":"IF($B14=\"\",\"\",IFERROR(INDEX('quantities report_secondary'!$D$2:$D$10003,SMALL(IF('quantities report_secondary'!$A$2:$A$10003=T$6,ROW('quantities report_secondary'!$A$2:$A$10003)-1,\"\"),ROWS($B$8:$B14))),\"0\"))","v":""},""]
[null,{"$f":"IFERROR(INDEX('manual inputs_secondary'!M:M,SMALL(IF('manual inputs_secondary'!M:M<>\"\",ROW('manual inputs_secondary'!M:M)),ROW(10:10))),\"\")","v":""},{"$f":"IF($B15=\"\",\"\",IFERROR(INDEX('quantities report_secondary'!$D$2:$D$10003,SMALL(IF('quantities report_secondary'!$A$2:$A$10003=C$6,ROW('quantities report_secondary'!$A$2:$A$10003)-1,\"\"),ROWS($B$8:$B15))),\"0\"))","v":""},"",{"$f":"IF($B15=\"\",\"\",IFERROR(INDEX('quantities report_secondary'!$D$2:$D$10003,SMALL(IF('quantities report_secondary'!$A$2:$A$10003=E$6,ROW('quantities report_secondary'!$A$2:$A$10003)-1,\"\"),ROWS($B$8:$B15))),\"0\"))","v":""},{"$f":"IF($B15=\"\",\"\",IFERROR(INDEX('quantities report_secondary'!$D$2:$D$10003,SMALL(IF('quantities report_secondary'!$A$2:$A$10003=F$6,ROW('quantities report_secondary'!$A$2:$A$10003)-1,\"\"),ROWS($B$8:$B15))),\"0\"))","v":""},{"$f":"IF($B15=\"\",\"\",IFERROR(INDEX('quantities report_secondary'!$D$2:$D$10003,SMALL(IF('quantities report_secondary'!$A$2:$A$10003=G$6,ROW('quantities report_secondary'!$A$2:$A$10003)-1,\"\"),ROWS($B$8:$B15))),\"0\"))","v":""},"",{"$f":"IF($B15=\"\",\"\",IFERROR(INDEX('quantities report_secondary'!$D$2:$D$10003,SMALL(IF('quantities report_secondary'!$A$2:$A$10003=I$6,ROW('quantities report_secondary'!$A$2:$A$10003)-1,\"\"),ROWS($B$8:$B15))),\"0\"))","v":""},{"$f":"IF($B15=\"\",\"\",IFERROR(INDEX('quantities report_secondary'!$D$2:$D$10003,SMALL(IF('quantities report_secondary'!$A$2:$A$10003=J$6,ROW('quantities report_secondary'!$A$2:$A$10003)-1,\"\"),ROWS($B$8:$B15))),\"0\"))","v":""},{"$f":"IF($B15=\"\",\"\",IFERROR(INDEX('quantities report_secondary'!$D$2:$D$10003,SMALL(IF('quantities report_secondary'!$A$2:$A$10003=K$6,ROW('quantities report_secondary'!$A$2:$A$10003)-1,\"\"),ROWS($B$8:$B15))),\"0\"))","v":""},{"$f":"IF($B15=\"\",\"\",IFERROR(INDEX('quantities report_secondary'!$D$2:$D$10003,SMALL(IF('quantities report_secondary'!$A$2:$A$10003=L$6,ROW('quantities report_secondary'!$A$2:$A$10003)-1,\"\"),ROWS($B$8:$B15))),\"0\"))","v":""},{"$f":"IF($B15=\"\",\"\",IFERROR(INDEX('quantities report_secondary'!$D$2:$D$10003,SMALL(IF('quantities report_secondary'!$A$2:$A$10003=M$6,ROW('quantities report_secondary'!$A$2:$A$10003)-1,\"\"),ROWS($B$8:$B15))),\"0\"))","v":""},{"$f":"IF($B15=\"\",\"\",IFERROR(INDEX('quantities report_secondary'!$D$2:$D$10003,SMALL(IF('quantities report_secondary'!$A$2:$A$10003=N$6,ROW('quantities report_secondary'!$A$2:$A$10003)-1,\"\"),ROWS($B$8:$B15))),\"0\"))","v":""},{"$f":"IF($B15=\"\",\"\",IFERROR(INDEX('quantities report_secondary'!$D$2:$D$10003,SMALL(IF('quantities report_secondary'!$A$2:$A$10003=O$6,ROW('quantities report_secondary'!$A$2:$A$10003)-1,\"\"),ROWS($B$8:$B15))),\"0\"))","v":""},{"$f":"IF($B15=\"\",\"\",IFERROR(INDEX('quantities report_secondary'!$D$2:$D$10003,SMALL(IF('quantities report_secondary'!$A$2:$A$10003=P$6,ROW('quantities report_secondary'!$A$2:$A$10003)-1,\"\"),ROWS($B$8:$B15))),\"0\"))","v":""},{"$f":"IF($B15=\"\",\"\",IFERROR(INDEX('quantities report_secondary'!$D$2:$D$10003,SMALL(IF('quantities report_secondary'!$A$2:$A$10003=Q$6,ROW('quantities report_secondary'!$A$2:$A$10003)-1,\"\"),ROWS($B$8:$B15))),\"0\"))","v":""},"",{"$f":"IF($B15=\"\",\"\",IFERROR(INDEX('quantities report_secondary'!$D$2:$D$10003,SMALL(IF('quantities report_secondary'!$A$2:$A$10003=S$6,ROW('quantities report_secondary'!$A$2:$A$10003)-1,\"\"),ROWS($B$8:$B15))),\"0\"))","v":""},{"$f":"IF($B15=\"\",\"\",IFERROR(INDEX('quantities report_secondary'!$D$2:$D$10003,SMALL(IF('quantities report_secondary'!$A$2:$A$10003=T$6,ROW('quantities report_secondary'!$A$2:$A$10003)-1,\"\"),ROWS($B$8:$B15))),\"0\"))","v":""},""]
[null,{"$f":"IFERROR(INDEX('manual inputs_secondary'!M:M,SMALL(IF('manual inputs_secondary'!M:M<>\"\",ROW('manual inputs_secondary'!M:M)),ROW(11:11))),\"\")","v":""},{"$f":"IF($B16=\"\",\"\",IFERROR(INDEX('quantities report_secondary'!$D$2:$D$10003,SMALL(IF('quantities report_secondary'!$A$2:$A$10003=C$6,ROW('quantities report_secondary'!$A$2:$A$10003)-1,\"\"),ROWS($B$8:$B16))),\"0\"))","v":""},"",{"$f":"IF($B16=\"\",\"\",IFERROR(INDEX('quantities report_secondary'!$D$2:$D$10003,SMALL(IF('quantities report_secondary'!$A$2:$A$10003=E$6,ROW('quantities report_secondary'!$A$2:$A$10003)-1,\"\"),ROWS($B$8:$B16))),\"0\"))","v":""},{"$f":"IF($B16=\"\",\"\",IFERROR(INDEX('quantities report_secondary'!$D$2:$D$10003,SMALL(IF('quantities report_secondary'!$A$2:$A$10003=F$6,ROW('quantities report_secondary'!$A$2:$A$10003)-1,\"\"),ROWS($B$8:$B16))),\"0\"))","v":""},{"$f":"IF($B16=\"\",\"\",IFERROR(INDEX('quantities report_secondary'!$D$2:$D$10003,SMALL(IF('quantities report_secondary'!$A$2:$A$10003=G$6,ROW('quantities report_secondary'!$A$2:$A$10003)-1,\"\"),ROWS($B$8:$B16))),\"0\"))","v":""},"",{"$f":"IF($B16=\"\",\"\",IFERROR(INDEX('quantities report_secondary'!$D$2:$D$10003,SMALL(IF('quantities report_secondary'!$A$2:$A$10003=I$6,ROW('quantities report_secondary'!$A$2:$A$10003)-1,\"\"),ROWS($B$8:$B16))),\"0\"))","v":""},{"$f":"IF($B16=\"\",\"\",IFERROR(INDEX('quantities report_secondary'!$D$2:$D$10003,SMALL(IF('quantities report_secondary'!$A$2:$A$10003=J$6,ROW('quantities report_secondary'!$A$2:$A$10003)-1,\"\"),ROWS($B$8:$B16))),\"0\"))","v":""},{"$f":"IF($B16=\"\",\"\",IFERROR(INDEX('quantities report_secondary'!$D$2:$D$10003,SMALL(IF('quantities report_secondary'!$A$2:$A$10003=K$6,ROW('quantities report_secondary'!$A$2:$A$10003)-1,\"\"),ROWS($B$8:$B16))),\"0\"))","v":""},{"$f":"IF($B16=\"\",\"\",IFERROR(INDEX('quantities report_secondary'!$D$2:$D$10003,SMALL(IF('quantities report_secondary'!$A$2:$A$10003=L$6,ROW('quantities report_secondary'!$A$2:$A$10003)-1,\"\"),ROWS($B$8:$B16))),\"0\"))","v":""},{"$f":"IF($B16=\"\",\"\",IFERROR(INDEX('quantities report_secondary'!$D$2:$D$10003,SMALL(IF('quantities report_secondary'!$A$2:$A$10003=M$6,ROW('quantities report_secondary'!$A$2:$A$10003)-1,\"\"),ROWS($B$8:$B16))),\"0\"))","v":""},{"$f":"IF($B16=\"\",\"\",IFERROR(INDEX('quantities report_secondary'!$D$2:$D$10003,SMALL(IF('quantities report_secondary'!$A$2:$A$10003=N$6,ROW('quantities report_secondary'!$A$2:$A$10003)-1,\"\"),ROWS($B$8:$B16))),\"0\"))","v":""},{"$f":"IF($B16=\"\",\"\",IFERROR(INDEX('quantities report_secondary'!$D$2:$D$10003,SMALL(IF('quantities report_secondary'!$A$2:$A$10003=O$6,ROW('quantities report_secondary'!$A$2:$A$10003)-1,\"\"),ROWS($B$8:$B16))),\"0\"))","v":""},{"$f":"IF($B16=\"\",\"\",IFERROR(INDEX('quantities report_secondary'!$D$2:$D$10003,SMALL(IF('quantities report_secondary'!$A$2:$A$10003=P$6,ROW('quantities report_secondary'!$A$2:$A$10003)-1,\"\"),ROWS($B$8:$B16))),\"0\"))","v":""},{"$f":"IF($B16=\"\",\"\",IFERROR(INDEX('quantities report_secondary'!$D$2:$D$10003,SMALL(IF('quantities report_secondary'!$A$2:$A$10003=Q$6,ROW('quantities report_secondary'!$A$2:$A$10003)-1,\"\"),ROWS($B$8:$B16))),\"0\"))","v":""},"",{"$f":"IF($B16=\"\",\"\",IFERROR(INDEX('quantities report_secondary'!$D$2:$D$10003,SMALL(IF('quantities report_secondary'!$A$2:$A$10003=S$6,ROW('quantities report_secondary'!$A$2:$A$10003)-1,\"\"),ROWS($B$8:$B16))),\"0\"))","v":""},{"$f":"IF($B16=\"\",\"\",IFERROR(INDEX('quantities report_secondary'!$D$2:$D$10003,SMALL(IF('quantities report_secondary'!$A$2:$A$10003=T$6,ROW('quantities report_secondary'!$A$2:$A$10003)-1,\"\"),ROWS($B$8:$B16))),\"0\"))","v":""},""]
[null,{"$f":"IFERROR(INDEX('manual inputs_secondary'!M:M,SMALL(IF('manual inputs_secondary'!M:M<>\"\",ROW('manual inputs_secondary'!M:M)),ROW(12:12))),\"\")","v":""},{"$f":"IF($B17=\"\",\"\",IFERROR(INDEX('quantities report_secondary'!$D$2:$D$10003,SMALL(IF('quantities report_secondary'!$A$2:$A$10003=C$6,ROW('quantities report_secondary'!$A$2:$A$10003)-1,\"\"),ROWS($B$8:$B17))),\"0\"))","v":""},"",{"$f":"IF($B17=\"\",\"\",IFERROR(INDEX('quantities report_secondary'!$D$2:$D$10003,SMALL(IF('quantities report_secondary'!$A$2:$A$10003=E$6,ROW('quantities report_secondary'!$A$2:$A$10003)-1,\"\"),ROWS($B$8:$B17))),\"0\"))","v":""},{"$f":"IF($B17=\"\",\"\",IFERROR(INDEX('quantities report_secondary'!$D$2:$D$10003,SMALL(IF('quantities report_secondary'!$A$2:$A$10003=F$6,ROW('quantities report_secondary'!$A$2:$A$10003)-1,\"\"),ROWS($B$8:$B17))),\"0\"))","v":""},{"$f":"IF($B17=\"\",\"\",IFERROR(INDEX('quantities report_secondary'!$D$2:$D$10003,SMALL(IF('quantities report_secondary'!$A$2:$A$10003=G$6,ROW('quantities report_secondary'!$A$2:$A$10003)-1,\"\"),ROWS($B$8:$B17))),\"0\"))","v":""},"",{"$f":"IF($B17=\"\",\"\",IFERROR(INDEX('quantities report_secondary'!$D$2:$D$10003,SMALL(IF('quantities report_secondary'!$A$2:$A$10003=I$6,ROW('quantities report_secondary'!$A$2:$A$10003)-1,\"\"),ROWS($B$8:$B17))),\"0\"))","v":""},{"$f":"IF($B17=\"\",\"\",IFERROR(INDEX('quantities report_secondary'!$D$2:$D$10003,SMALL(IF('quantities report_secondary'!$A$2:$A$10003=J$6,ROW('quantities report_secondary'!$A$2:$A$10003)-1,\"\"),ROWS($B$8:$B17))),\"0\"))","v":""},{"$f":"IF($B17=\"\",\"\",IFERROR(INDEX('quantities report_secondary'!$D$2:$D$10003,SMALL(IF('quantities report_secondary'!$A$2:$A$10003=K$6,ROW('quantities report_secondary'!$A$2:$A$10003)-1,\"\"),ROWS($B$8:$B17))),\"0\"))","v":""},{"$f":"IF($B17=\"\",\"\",IFERROR(INDEX('quantities report_secondary'!$D$2:$D$10003,SMALL(IF('quantities report_secondary'!$A$2:$A$10003=L$6,ROW('quantities report_secondary'!$A$2:$A$10003)-1,\"\"),ROWS($B$8:$B17))),\"0\"))","v":""},{"$f":"IF($B17=\"\",\"\",IFERROR(INDEX('quantities report_secondary'!$D$2:$D$10003,SMALL(IF('quantities report_secondary'!$A$2:$A$10003=M$6,ROW('quantities report_secondary'!$A$2:$A$10003)-1,\"\"),ROWS($B$8:$B17))),\"0\"))","v":""},{"$f":"IF($B17=\"\",\"\",IFERROR(INDEX('quantities report_secondary'!$D$2:$D$10003,SMALL(IF('quantities report_secondary'!$A$2:$A$10003=N$6,ROW('quantities report_secondary'!$A$2:$A$10003)-1,\"\"),ROWS($B$8:$B17))),\"0\"))","v":""},{"$f":"IF($B17=\"\",\"\",IFERROR(INDEX('quantities report_secondary'!$D$2:$D$10003,SMALL(IF('quantities report_secondary'!$A$2:$A$10003=O$6,ROW('quantities report_secondary'!$A$2:$A$10003)-1,\"\"),ROWS($B$8:$B17))),\"0\"))","v":""},{"$f":"IF($B17=\"\",\"\",IFERROR(INDEX('quantities report_secondary'!$D$2:$D$10003,SMALL(IF('quantities report_secondary'!$A$2:$A$10003=P$6,ROW('quantities report_secondary'!$A$2:$A$10003)-1,\"\"),ROWS($B$8:$B17))),\"0\"))","v":""},{"$f":"IF($B17=\"\",\"\",IFERROR(INDEX('quantities report_secondary'!$D$2:$D$10003,SMALL(IF('quantities report_secondary'!$A$2:$A$10003=Q$6,ROW('quantities report_secondary'!$A$2:$A$10003)-1,\"\"),ROWS($B$8:$B17))),\"0\"))","v":""},"",{"$f":"IF($B17=\"\",\"\",IFERROR(INDEX('quantities report_secondary'!$D$2:$D$10003,SMALL(IF('quantities report_secondary'!$A$2:$A$10003=S$6,ROW('quantities report_secondary'!$A$2:$A$10003)-1,\"\"),ROWS($B$8:$B17))),\"0\"))","v":""},{"$f":"IF($B17=\"\",\"\",IFERROR(INDEX('quantities report_secondary'!$D$2:$D$10003,SMALL(IF('quantities report_secondary'!$A$2:$A$10003=T$6,ROW('quantities report_secondary'!$A$2:$A$10003)-1,\"\"),ROWS($B$8:$B17))),\"0\"))","v":""},""]
[null,{"$f":"IFERROR(INDEX('manual inputs_secondary'!M:M,SMALL(IF('manual inputs_secondary'!M:M<>\"\",ROW('manual inputs_secondary'!M:M)),ROW(13:13))),\"\")","v":""},{"$f":"IF($B18=\"\",\"\",IFERROR(INDEX('quantities report_secondary'!$D$2:$D$10003,SMALL(IF('quantities report_secondary'!$A$2:$A$10003=C$6,ROW('quantities report_secondary'!$A$2:$A$10003)-1,\"\"),ROWS($B$8:$B18))),\"0\"))","v":""},"",{"$f":"IF($B18=\"\",\"\",IFERROR(INDEX('quantities report_secondary'!$D$2:$D$10003,SMALL(IF('quantities report_secondary'!$A$2:$A$10003=E$6,ROW('quantities report_secondary'!$A$2:$A$10003)-1,\"\"),ROWS($B$8:$B18))),\"0\"))","v":""},{"$f":"IF($B18=\"\",\"\",IFERROR(INDEX('quantities report_secondary'!$D$2:$D$10003,SMALL(IF('quantities report_secondary'!$A$2:$A$10003=F$6,ROW('quantities report_secondary'!$A$2:$A$10003)-1,\"\"),ROWS($B$8:$B18))),\"0\"))","v":""},{"$f":"IF($B18=\"\",\"\",IFERROR(INDEX('quantities report_secondary'!$D$2:$D$10003,SMALL(IF('quantities report_secondary'!$A$2:$A$10003=G$6,ROW('quantities report_secondary'!$A$2:$A$10003)-1,\"\"),ROWS($B$8:$B18))),\"0\"))","v":""},"",{"$f":"IF($B18=\"\",\"\",IFERROR(INDEX('quantities report_secondary'!$D$2:$D$10003,SMALL(IF('quantities report_secondary'!$A$2:$A$10003=I$6,ROW('quantities report_secondary'!$A$2:$A$10003)-1,\"\"),ROWS($B$8:$B18))),\"0\"))","v":""},{"$f":"IF($B18=\"\",\"\",IFERROR(INDEX('quantities report_secondary'!$D$2:$D$10003,SMALL(IF('quantities report_secondary'!$A$2:$A$10003=J$6,ROW('quantities report_secondary'!$A$2:$A$10003)-1,\"\"),ROWS($B$8:$B18))),\"0\"))","v":""},{"$f":"IF($B18=\"\",\"\",IFERROR(INDEX('quantities report_secondary'!$D$2:$D$10003,SMALL(IF('quantities report_secondary'!$A$2:$A$10003=K$6,ROW('quantities report_secondary'!$A$2:$A$10003)-1,\"\"),ROWS($B$8:$B18))),\"0\"))","v":""},{"$f":"IF($B18=\"\",\"\",IFERROR(INDEX('quantities report_secondary'!$D$2:$D$10003,SMALL(IF('quantities report_secondary'!$A$2:$A$10003=L$6,ROW('quantities report_secondary'!$A$2:$A$10003)-1,\"\"),ROWS($B$8:$B18))),\"0\"))","v":""},{"$f":"IF($B18=\"\",\"\",IFERROR(INDEX('quantities report_secondary'!$D$2:$D$10003,SMALL(IF('quantities report_secondary'!$A$2:$A$10003=M$6,ROW('quantities report_secondary'!$A$2:$A$10003)-1,\"\"),ROWS($B$8:$B18))),\"0\"))","v":""},{"$f":"IF($B18=\"\",\"\",IFERROR(INDEX('quantities report_secondary'!$D$2:$D$10003,SMALL(IF('quantities report_secondary'!$A$2:$A$10003=N$6,ROW('quantities report_secondary'!$A$2:$A$10003)-1,\"\"),ROWS($B$8:$B18))),\"0\"))","v":""},{"$f":"IF($B18=\"\",\"\",IFERROR(INDEX('quantities report_secondary'!$D$2:$D$10003,SMALL(IF('quantities report_secondary'!$A$2:$A$10003=O$6,ROW('quantities report_secondary'!$A$2:$A$10003)-1,\"\"),ROWS($B$8:$B18))),\"0\"))","v":""},{"$f":"IF($B18=\"\",\"\",IFERROR(INDEX('quantities report_secondary'!$D$2:$D$10003,SMALL(IF('quantities report_secondary'!$A$2:$A$10003=P$6,ROW('quantities report_secondary'!$A$2:$A$10003)-1,\"\"),ROWS($B$8:$B18))),\"0\"))","v":""},{"$f":"IF($B18=\"\",\"\",IFERROR(INDEX('quantities report_secondary'!$D$2:$D$10003,SMALL(IF('quantities report_secondary'!$A$2:$A$10003=Q$6,ROW('quantities report_secondary'!$A$2:$A$10003)-1,\"\"),ROWS($B$8:$B18))),\"0\"))","v":""},"",{"$f":"IF($B18=\"\",\"\",IFERROR(INDEX('quantities report_secondary'!$D$2:$D$10003,SMALL(IF('quantities report_secondary'!$A$2:$A$10003=S$6,ROW('quantities report_secondary'!$A$2:$A$10003)-1,\"\"),ROWS($B$8:$B18))),\"0\"))","v":""},{"$f":"IF($B18=\"\",\"\",IFERROR(INDEX('quantities report_secondary'!$D$2:$D$10003,SMALL(IF('quantities report_secondary'!$A$2:$A$10003=T$6,ROW('quantities report_secondary'!$A$2:$A$10003)-1,\"\"),ROWS($B$8:$B18))),\"0\"))","v":""},""]
[null,{"$f":"IFERROR(INDEX('manual inputs_secondary'!M:M,SMALL(IF('manual inputs_secondary'!M:M<>\"\",ROW('manual inputs_secondary'!M:M)),ROW(14:14))),\"\")","v":""},{"$f":"IF($B19=\"\",\"\",IFERROR(INDEX('quantities report_secondary'!$D$2:$D$10003,SMALL(IF('quantities report_secondary'!$A$2:$A$10003=C$6,ROW('quantities report_secondary'!$A$2:$A$10003)-1,\"\"),ROWS($B$8:$B19))),\"0\"))","v":""},"",{"$f":"IF($B19=\"\",\"\",IFERROR(INDEX('quantities report_secondary'!$D$2:$D$10003,SMALL(IF('quantities report_secondary'!$A$2:$A$10003=E$6,ROW('quantities report_secondary'!$A$2:$A$10003)-1,\"\"),ROWS($B$8:$B19))),\"0\"))","v":""},{"$f":"IF($B19=\"\",\"\",IFERROR(INDEX('quantities report_secondary'!$D$2:$D$10003,SMALL(IF('quantities report_secondary'!$A$2:$A$10003=F$6,ROW('quantities report_secondary'!$A$2:$A$10003)-1,\"\"),ROWS($B$8:$B19))),\"0\"))","v":""},{"$f":"IF($B19=\"\",\"\",IFERROR(INDEX('quantities report_secondary'!$D$2:$D$10003,SMALL(IF('quantities report_secondary'!$A$2:$A$10003=G$6,ROW('quantities report_secondary'!$A$2:$A$10003)-1,\"\"),ROWS($B$8:$B19))),\"0\"))","v":""},"",{"$f":"IF($B19=\"\",\"\",IFERROR(INDEX('quantities report_secondary'!$D$2:$D$10003,SMALL(IF('quantities report_secondary'!$A$2:$A$10003=I$6,ROW('quantities report_secondary'!$A$2:$A$10003)-1,\"\"),ROWS($B$8:$B19))),\"0\"))","v":""},{"$f":"IF($B19=\"\",\"\",IFERROR(INDEX('quantities report_secondary'!$D$2:$D$10003,SMALL(IF('quantities report_secondary'!$A$2:$A$10003=J$6,ROW('quantities report_secondary'!$A$2:$A$10003)-1,\"\"),ROWS($B$8:$B19))),\"0\"))","v":""},{"$f":"IF($B19=\"\",\"\",IFERROR(INDEX('quantities report_secondary'!$D$2:$D$10003,SMALL(IF('quantities report_secondary'!$A$2:$A$10003=K$6,ROW('quantities report_secondary'!$A$2:$A$10003)-1,\"\"),ROWS($B$8:$B19))),\"0\"))","v":""},{"$f":"IF($B19=\"\",\"\",IFERROR(INDEX('quantities report_secondary'!$D$2:$D$10003,SMALL(IF('quantities report_secondary'!$A$2:$A$10003=L$6,ROW('quantities report_secondary'!$A$2:$A$10003)-1,\"\"),ROWS($B$8:$B19))),\"0\"))","v":""},{"$f":"IF($B19=\"\",\"\",IFERROR(INDEX('quantities report_secondary'!$D$2:$D$10003,SMALL(IF('quantities report_secondary'!$A$2:$A$10003=M$6,ROW('quantities report_secondary'!$A$2:$A$10003)-1,\"\"),ROWS($B$8:$B19))),\"0\"))","v":""},{"$f":"IF($B19=\"\",\"\",IFERROR(INDEX('quantities report_secondary'!$D$2:$D$10003,SMALL(IF('quantities report_secondary'!$A$2:$A$10003=N$6,ROW('quantities report_secondary'!$A$2:$A$10003)-1,\"\"),ROWS($B$8:$B19))),\"0\"))","v":""},{"$f":"IF($B19=\"\",\"\",IFERROR(INDEX('quantities report_secondary'!$D$2:$D$10003,SMALL(IF('quantities report_secondary'!$A$2:$A$10003=O$6,ROW('quantities report_secondary'!$A$2:$A$10003)-1,\"\"),ROWS($B$8:$B19))),\"0\"))","v":""},{"$f":"IF($B19=\"\",\"\",IFERROR(INDEX('quantities report_secondary'!$D$2:$D$10003,SMALL(IF('quantities report_secondary'!$A$2:$A$10003=P$6,ROW('quantities report_secondary'!$A$2:$A$10003)-1,\"\"),ROWS($B$8:$B19))),\"0\"))","v":""},{"$f":"IF($B19=\"\",\"\",IFERROR(INDEX('quantities report_secondary'!$D$2:$D$10003,SMALL(IF('quantities report_secondary'!$A$2:$A$10003=Q$6,ROW('quantities report_secondary'!$A$2:$A$10003)-1,\"\"),ROWS($B$8:$B19))),\"0\"))","v":""},"",{"$f":"IF($B19=\"\",\"\",IFERROR(INDEX('quantities report_secondary'!$D$2:$D$10003,SMALL(IF('quantities report_secondary'!$A$2:$A$10003=S$6,ROW('quantities report_secondary'!$A$2:$A$10003)-1,\"\"),ROWS($B$8:$B19))),\"0\"))","v":""},{"$f":"IF($B19=\"\",\"\",IFERROR(INDEX('quantities report_secondary'!$D$2:$D$10003,SMALL(IF('quantities report_secondary'!$A$2:$A$10003=T$6,ROW('quantities report_secondary'!$A$2:$A$10003)-1,\"\"),ROWS($B$8:$B19))),\"0\"))","v":""},""]
[null,{"$f":"IFERROR(INDEX('manual inputs_secondary'!M:M,SMALL(IF('manual inputs_secondary'!M:M<>\"\",ROW('manual inputs_secondary'!M:M)),ROW(15:15))),\"\")","v":""},{"$f":"IF($B20=\"\",\"\",IFERROR(INDEX('quantities report_secondary'!$D$2:$D$10003,SMALL(IF('quantities report_secondary'!$A$2:$A$10003=C$6,ROW('quantities report_secondary'!$A$2:$A$10003)-1,\"\"),ROWS($B$8:$B20))),\"0\"))","v":""},"",{"$f":"IF($B20=\"\",\"\",IFERROR(INDEX('quantities report_secondary'!$D$2:$D$10003,SMALL(IF('quantities report_secondary'!$A$2:$A$10003=E$6,ROW('quantities report_secondary'!$A$2:$A$10003)-1,\"\"),ROWS($B$8:$B20))),\"0\"))","v":""},{"$f":"IF($B20=\"\",\"\",IFERROR(INDEX('quantities report_secondary'!$D$2:$D$10003,SMALL(IF('quantities report_secondary'!$A$2:$A$10003=F$6,ROW('quantities report_secondary'!$A$2:$A$10003)-1,\"\"),ROWS($B$8:$B20))),\"0\"))","v":""},{"$f":"IF($B20=\"\",\"\",IFERROR(INDEX('quantities report_secondary'!$D$2:$D$10003,SMALL(IF('quantities report_secondary'!$A$2:$A$10003=G$6,ROW('quantities report_secondary'!$A$2:$A$10003)-1,\"\"),ROWS($B$8:$B20))),\"0\"))","v":""},"",{"$f":"IF($B20=\"\",\"\",IFERROR(INDEX('quantities report_secondary'!$D$2:$D$10003,SMALL(IF('quantities report_secondary'!$A$2:$A$10003=I$6,ROW('quantities report_secondary'!$A$2:$A$10003)-1,\"\"),ROWS($B$8:$B20))),\"0\"))","v":""},{"$f":"IF($B20=\"\",\"\",IFERROR(INDEX('quantities report_secondary'!$D$2:$D$10003,SMALL(IF('quantities report_secondary'!$A$2:$A$10003=J$6,ROW('quantities report_secondary'!$A$2:$A$10003)-1,\"\"),ROWS($B$8:$B20))),\"0\"))","v":""},{"$f":"IF($B20=\"\",\"\",IFERROR(INDEX('quantities report_secondary'!$D$2:$D$10003,SMALL(IF('quantities report_secondary'!$A$2:$A$10003=K$6,ROW('quantities report_secondary'!$A$2:$A$10003)-1,\"\"),ROWS($B$8:$B20))),\"0\"))","v":""},{"$f":"IF($B20=\"\",\"\",IFERROR(INDEX('quantities report_secondary'!$D$2:$D$10003,SMALL(IF('quantities report_secondary'!$A$2:$A$10003=L$6,ROW('quantities report_secondary'!$A$2:$A$10003)-1,\"\"),ROWS($B$8:$B20))),\"0\"))","v":""},{"$f":"IF($B20=\"\",\"\",IFERROR(INDEX('quantities report_secondary'!$D$2:$D$10003,SMALL(IF('quantities report_secondary'!$A$2:$A$10003=M$6,ROW('quantities report_secondary'!$A$2:$A$10003)-1,\"\"),ROWS($B$8:$B20))),\"0\"))","v":""},{"$f":"IF($B20=\"\",\"\",IFERROR(INDEX('quantities report_secondary'!$D$2:$D$10003,SMALL(IF('quantities report_secondary'!$A$2:$A$10003=N$6,ROW('quantities report_secondary'!$A$2:$A$10003)-1,\"\"),ROWS($B$8:$B20))),\"0\"))","v":""},{"$f":"IF($B20=\"\",\"\",IFERROR(INDEX('quantities report_secondary'!$D$2:$D$10003,SMALL(IF('quantities report_secondary'!$A$2:$A$10003=O$6,ROW('quantities report_secondary'!$A$2:$A$10003)-1,\"\"),ROWS($B$8:$B20))),\"0\"))","v":""},{"$f":"IF($B20=\"\",\"\",IFERROR(INDEX('quantities report_secondary'!$D$2:$D$10003,SMALL(IF('quantities report_secondary'!$A$2:$A$10003=P$6,ROW('quantities report_secondary'!$A$2:$A$10003)-1,\"\"),ROWS($B$8:$B20))),\"0\"))","v":""},{"$f":"IF($B20=\"\",\"\",IFERROR(INDEX('quantities report_secondary'!$D$2:$D$10003,SMALL(IF('quantities report_secondary'!$A$2:$A$10003=Q$6,ROW('quantities report_secondary'!$A$2:$A$10003)-1,\"\"),ROWS($B$8:$B20))),\"0\"))","v":""},"",{"$f":"IF($B20=\"\",\"\",IFERROR(INDEX('quantities report_secondary'!$D$2:$D$10003,SMALL(IF('quantities report_secondary'!$A$2:$A$10003=S$6,ROW('quantities report_secondary'!$A$2:$A$10003)-1,\"\"),ROWS($B$8:$B20))),\"0\"))","v":""},{"$f":"IF($B20=\"\",\"\",IFERROR(INDEX('quantities report_secondary'!$D$2:$D$10003,SMALL(IF('quantities report_secondary'!$A$2:$A$10003=T$6,ROW('quantities report_secondary'!$A$2:$A$10003)-1,\"\"),ROWS($B$8:$B20))),\"0\"))","v":""},""]
[null,{"$f":"IFERROR(INDEX('manual inputs_secondary'!M:M,SMALL(IF('manual inputs_secondary'!M:M<>\"\",ROW('manual inputs_secondary'!M:M)),ROW(16:16))),\"\")","v":""},{"$f":"IF($B21=\"\",\"\",IFERROR(INDEX('quantities report_secondary'!$D$2:$D$10003,SMALL(IF('quantities report_secondary'!$A$2:$A$10003=C$6,ROW('quantities report_secondary'!$A$2:$A$10003)-1,\"\"),ROWS($B$8:$B21))),\"0\"))","v":""},"",{"$f":"IF($B21=\"\",\"\",IFERROR(INDEX('quantities report_secondary'!$D$2:$D$10003,SMALL(IF('quantities report_secondary'!$A$2:$A$10003=E$6,ROW('quantities report_secondary'!$A$2:$A$10003)-1,\"\"),ROWS($B$8:$B21))),\"0\"))","v":""},{"$f":"IF($B21=\"\",\"\",IFERROR(INDEX('quantities report_secondary'!$D$2:$D$10003,SMALL(IF('quantities report_secondary'!$A$2:$A$10003=F$6,ROW('quantities report_secondary'!$A$2:$A$10003)-1,\"\"),ROWS($B$8:$B21))),\"0\"))","v":""},{"$f":"IF($B21=\"\",\"\",IFERROR(INDEX('quantities report_secondary'!$D$2:$D$10003,SMALL(IF('quantities report_secondary'!$A$2:$A$10003=G$6,ROW('quantities report_secondary'!$A$2:$A$10003)-1,\"\"),ROWS($B$8:$B21))),\"0\"))","v":""},"",{"$f":"IF($B21=\"\",\"\",IFERROR(INDEX('quantities report_secondary'!$D$2:$D$10003,SMALL(IF('quantities report_secondary'!$A$2:$A$10003=I$6,ROW('quantities report_secondary'!$A$2:$A$10003)-1,\"\"),ROWS($B$8:$B21))),\"0\"))","v":""},{"$f":"IF($B21=\"\",\"\",IFERROR(INDEX('quantities report_secondary'!$D$2:$D$10003,SMALL(IF('quantities report_secondary'!$A$2:$A$10003=J$6,ROW('quantities report_secondary'!$A$2:$A$10003)-1,\"\"),ROWS($B$8:$B21))),\"0\"))","v":""},{"$f":"IF($B21=\"\",\"\",IFERROR(INDEX('quantities report_secondary'!$D$2:$D$10003,SMALL(IF('quantities report_secondary'!$A$2:$A$10003=K$6,ROW('quantities report_secondary'!$A$2:$A$10003)-1,\"\"),ROWS($B$8:$B21))),\"0\"))","v":""},{"$f":"IF($B21=\"\",\"\",IFERROR(INDEX('quantities report_secondary'!$D$2:$D$10003,SMALL(IF('quantities report_secondary'!$A$2:$A$10003=L$6,ROW('quantities report_secondary'!$A$2:$A$10003)-1,\"\"),ROWS($B$8:$B21))),\"0\"))","v":""},{"$f":"IF($B21=\"\",\"\",IFERROR(INDEX('quantities report_secondary'!$D$2:$D$10003,SMALL(IF('quantities report_secondary'!$A$2:$A$10003=M$6,ROW('quantities report_secondary'!$A$2:$A$10003)-1,\"\"),ROWS($B$8:$B21))),\"0\"))","v":""},{"$f":"IF($B21=\"\",\"\",IFERROR(INDEX('quantities report_secondary'!$D$2:$D$10003,SMALL(IF('quantities report_secondary'!$A$2:$A$10003=N$6,ROW('quantities report_secondary'!$A$2:$A$10003)-1,\"\"),ROWS($B$8:$B21))),\"0\"))","v":""},{"$f":"IF($B21=\"\",\"\",IFERROR(INDEX('quantities report_secondary'!$D$2:$D$10003,SMALL(IF('quantities report_secondary'!$A$2:$A$10003=O$6,ROW('quantities report_secondary'!$A$2:$A$10003)-1,\"\"),ROWS($B$8:$B21))),\"0\"))","v":""},{"$f":"IF($B21=\"\",\"\",IFERROR(INDEX('quantities report_secondary'!$D$2:$D$10003,SMALL(IF('quantities report_secondary'!$A$2:$A$10003=P$6,ROW('quantities report_secondary'!$A$2:$A$10003)-1,\"\"),ROWS($B$8:$B21))),\"0\"))","v":""},{"$f":"IF($B21=\"\",\"\",IFERROR(INDEX('quantities report_secondary'!$D$2:$D$10003,SMALL(IF('quantities report_secondary'!$A$2:$A$10003=Q$6,ROW('quantities report_secondary'!$A$2:$A$10003)-1,\"\"),ROWS($B$8:$B21))),\"0\"))","v":""},"",{"$f":"IF($B21=\"\",\"\",IFERROR(INDEX('quantities report_secondary'!$D$2:$D$10003,SMALL(IF('quantities report_secondary'!$A$2:$A$10003=S$6,ROW('quantities report_secondary'!$A$2:$A$10003)-1,\"\"),ROWS($B$8:$B21))),\"0\"))","v":""},{"$f":"IF($B21=\"\",\"\",IFERROR(INDEX('quantities report_secondary'!$D$2:$D$10003,SMALL(IF('quantities report_secondary'!$A$2:$A$10003=T$6,ROW('quantities report_secondary'!$A$2:$A$10003)-1,\"\"),ROWS($B$8:$B21))),\"0\"))","v":""},""]
[null,{"$f":"IFERROR(INDEX('manual inputs_secondary'!M:M,SMALL(IF('manual inputs_secondary'!M:M<>\"\",ROW('manual inputs_secondary'!M:M)),ROW(17:17))),\"\")","v":""},{"$f":"IF($B22=\"\",\"\",IFERROR(INDEX('quantities report_secondary'!$D$2:$D$10003,SMALL(IF('quantities report_secondary'!$A$2:$A$10003=C$6,ROW('quantities report_secondary'!$A$2:$A$10003)-1,\"\"),ROWS($B$8:$B22))),\"0\"))","v":""},"",{"$f":"IF($B22=\"\",\"\",IFERROR(INDEX('quantities report_secondary'!$D$2:$D$10003,SMALL(IF('quantities report_secondary'!$A$2:$A$10003=E$6,ROW('quantities report_secondary'!$A$2:$A$10003)-1,\"\"),ROWS($B$8:$B22))),\"0\"))","v":""},{"$f":"IF($B22=\"\",\"\",IFERROR(INDEX('quantities report_secondary'!$D$2:$D$10003,SMALL(IF('quantities report_secondary'!$A$2:$A$10003=F$6,ROW('quantities report_secondary'!$A$2:$A$10003)-1,\"\"),ROWS($B$8:$B22))),\"0\"))","v":""},{"$f":"IF($B22=\"\",\"\",IFERROR(INDEX('quantities report_secondary'!$D$2:$D$10003,SMALL(IF('quantities report_secondary'!$A$2:$A$10003=G$6,ROW('quantities report_secondary'!$A$2:$A$10003)-1,\"\"),ROWS($B$8:$B22))),\"0\"))","v":""},"",{"$f":"IF($B22=\"\",\"\",IFERROR(INDEX('quantities report_secondary'!$D$2:$D$10003,SMALL(IF('quantities report_secondary'!$A$2:$A$10003=I$6,ROW('quantities report_secondary'!$A$2:$A$10003)-1,\"\"),ROWS($B$8:$B22))),\"0\"))","v":""},{"$f":"IF($B22=\"\",\"\",IFERROR(INDEX('quantities report_secondary'!$D$2:$D$10003,SMALL(IF('quantities report_secondary'!$A$2:$A$10003=J$6,ROW('quantities report_secondary'!$A$2:$A$10003)-1,\"\"),ROWS($B$8:$B22))),\"0\"))","v":""},{"$f":"IF($B22=\"\",\"\",IFERROR(INDEX('quantities report_secondary'!$D$2:$D$10003,SMALL(IF('quantities report_secondary'!$A$2:$A$10003=K$6,ROW('quantities report_secondary'!$A$2:$A$10003)-1,\"\"),ROWS($B$8:$B22))),\"0\"))","v":""},{"$f":"IF($B22=\"\",\"\",IFERROR(INDEX('quantities report_secondary'!$D$2:$D$10003,SMALL(IF('quantities report_secondary'!$A$2:$A$10003=L$6,ROW('quantities report_secondary'!$A$2:$A$10003)-1,\"\"),ROWS($B$8:$B22))),\"0\"))","v":""},{"$f":"IF($B22=\"\",\"\",IFERROR(INDEX('quantities report_secondary'!$D$2:$D$10003,SMALL(IF('quantities report_secondary'!$A$2:$A$10003=M$6,ROW('quantities report_secondary'!$A$2:$A$10003)-1,\"\"),ROWS($B$8:$B22))),\"0\"))","v":""},{"$f":"IF($B22=\"\",\"\",IFERROR(INDEX('quantities report_secondary'!$D$2:$D$10003,SMALL(IF('quantities report_secondary'!$A$2:$A$10003=N$6,ROW('quantities report_secondary'!$A$2:$A$10003)-1,\"\"),ROWS($B$8:$B22))),\"0\"))","v":""},{"$f":"IF($B22=\"\",\"\",IFERROR(INDEX('quantities report_secondary'!$D$2:$D$10003,SMALL(IF('quantities report_secondary'!$A$2:$A$10003=O$6,ROW('quantities report_secondary'!$A$2:$A$10003)-1,\"\"),ROWS($B$8:$B22))),\"0\"))","v":""},{"$f":"IF($B22=\"\",\"\",IFERROR(INDEX('quantities report_secondary'!$D$2:$D$10003,SMALL(IF('quantities report_secondary'!$A$2:$A$10003=P$6,ROW('quantities report_secondary'!$A$2:$A$10003)-1,\"\"),ROWS($B$8:$B22))),\"0\"))","v":""},{"$f":"IF($B22=\"\",\"\",IFERROR(INDEX('quantities report_secondary'!$D$2:$D$10003,SMALL(IF('quantities report_secondary'!$A$2:$A$10003=Q$6,ROW('quantities report_secondary'!$A$2:$A$10003)-1,\"\"),ROWS($B$8:$B22))),\"0\"))","v":""},"",{"$f":"IF($B22=\"\",\"\",IFERROR(INDEX('quantities report_secondary'!$D$2:$D$10003,SMALL(IF('quantities report_secondary'!$A$2:$A$10003=S$6,ROW('quantities report_secondary'!$A$2:$A$10003)-1,\"\"),ROWS($B$8:$B22))),\"0\"))","v":""},{"$f":"IF($B22=\"\",\"\",IFERROR(INDEX('quantities report_secondary'!$D$2:$D$10003,SMALL(IF('quantities report_secondary'!$A$2:$A$10003=T$6,ROW('quantities report_secondary'!$A$2:$A$10003)-1,\"\"),ROWS($B$8:$B22))),\"0\"))","v":""},""]
[null,{"$f":"IFERROR(INDEX('manual inputs_secondary'!M:M,SMALL(IF('manual inputs_secondary'!M:M<>\"\",ROW('manual inputs_secondary'!M:M)),ROW(18:18))),\"\")","v":""},{"$f":"IF($B23=\"\",\"\",IFERROR(INDEX('quantities report_secondary'!$D$2:$D$10003,SMALL(IF('quantities report_secondary'!$A$2:$A$10003=C$6,ROW('quantities report_secondary'!$A$2:$A$10003)-1,\"\"),ROWS($B$8:$B23))),\"0\"))","v":""},"",{"$f":"IF($B23=\"\",\"\",IFERROR(INDEX('quantities report_secondary'!$D$2:$D$10003,SMALL(IF('quantities report_secondary'!$A$2:$A$10003=E$6,ROW('quantities report_secondary'!$A$2:$A$10003)-1,\"\"),ROWS($B$8:$B23))),\"0\"))","v":""},{"$f":"IF($B23=\"\",\"\",IFERROR(INDEX('quantities report_secondary'!$D$2:$D$10003,SMALL(IF('quantities report_secondary'!$A$2:$A$10003=F$6,ROW('quantities report_secondary'!$A$2:$A$10003)-1,\"\"),ROWS($B$8:$B23))),\"0\"))","v":""},{"$f":"IF($B23=\"\",\"\",IFERROR(INDEX('quantities report_secondary'!$D$2:$D$10003,SMALL(IF('quantities report_secondary'!$A$2:$A$10003=G$6,ROW('quantities report_secondary'!$A$2:$A$10003)-1,\"\"),ROWS($B$8:$B23))),\"0\"))","v":""},"",{"$f":"IF($B23=\"\",\"\",IFERROR(INDEX('quantities report_secondary'!$D$2:$D$10003,SMALL(IF('quantities report_secondary'!$A$2:$A$10003=I$6,ROW('quantities report_secondary'!$A$2:$A$10003)-1,\"\"),ROWS($B$8:$B23))),\"0\"))","v":""},{"$f":"IF($B23=\"\",\"\",IFERROR(INDEX('quantities report_secondary'!$D$2:$D$10003,SMALL(IF('quantities report_secondary'!$A$2:$A$10003=J$6,ROW('quantities report_secondary'!$A$2:$A$10003)-1,\"\"),ROWS($B$8:$B23))),\"0\"))","v":""},{"$f":"IF($B23=\"\",\"\",IFERROR(INDEX('quantities report_secondary'!$D$2:$D$10003,SMALL(IF('quantities report_secondary'!$A$2:$A$10003=K$6,ROW('quantities report_secondary'!$A$2:$A$10003)-1,\"\"),ROWS($B$8:$B23))),\"0\"))","v":""},{"$f":"IF($B23=\"\",\"\",IFERROR(INDEX('quantities report_secondary'!$D$2:$D$10003,SMALL(IF('quantities report_secondary'!$A$2:$A$10003=L$6,ROW('quantities report_secondary'!$A$2:$A$10003)-1,\"\"),ROWS($B$8:$B23))),\"0\"))","v":""},{"$f":"IF($B23=\"\",\"\",IFERROR(INDEX('quantities report_secondary'!$D$2:$D$10003,SMALL(IF('quantities report_secondary'!$A$2:$A$10003=M$6,ROW('quantities report_secondary'!$A$2:$A$10003)-1,\"\"),ROWS($B$8:$B23))),\"0\"))","v":""},{"$f":"IF($B23=\"\",\"\",IFERROR(INDEX('quantities report_secondary'!$D$2:$D$10003,SMALL(IF('quantities report_secondary'!$A$2:$A$10003=N$6,ROW('quantities report_secondary'!$A$2:$A$10003)-1,\"\"),ROWS($B$8:$B23))),\"0\"))","v":""},{"$f":"IF($B23=\"\",\"\",IFERROR(INDEX('quantities report_secondary'!$D$2:$D$10003,SMALL(IF('quantities report_secondary'!$A$2:$A$10003=O$6,ROW('quantities report_secondary'!$A$2:$A$10003)-1,\"\"),ROWS($B$8:$B23))),\"0\"))","v":""},{"$f":"IF($B23=\"\",\"\",IFERROR(INDEX('quantities report_secondary'!$D$2:$D$10003,SMALL(IF('quantities report_secondary'!$A$2:$A$10003=P$6,ROW('quantities report_secondary'!$A$2:$A$10003)-1,\"\"),ROWS($B$8:$B23))),\"0\"))","v":""},{"$f":"IF($B23=\"\",\"\",IFERROR(INDEX('quantities report_secondary'!$D$2:$D$10003,SMALL(IF('quantities report_secondary'!$A$2:$A$10003=Q$6,ROW('quantities report_secondary'!$A$2:$A$10003)-1,\"\"),ROWS($B$8:$B23))),\"0\"))","v":""},"",{"$f":"IF($B23=\"\",\"\",IFERROR(INDEX('quantities report_secondary'!$D$2:$D$10003,SMALL(IF('quantities report_secondary'!$A$2:$A$10003=S$6,ROW('quantities report_secondary'!$A$2:$A$10003)-1,\"\"),ROWS($B$8:$B23))),\"0\"))","v":""},{"$f":"IF($B23=\"\",\"\",IFERROR(INDEX('quantities report_secondary'!$D$2:$D$10003,SMALL(IF('quantities report_secondary'!$A$2:$A$10003=T$6,ROW('quantities report_secondary'!$A$2:$A$10003)-1,\"\"),ROWS($B$8:$B23))),\"0\"))","v":""},""]
[null,{"$f":"IFERROR(INDEX('manual inputs_secondary'!M:M,SMALL(IF('manual inputs_secondary'!M:M<>\"\",ROW('manual inputs_secondary'!M:M)),ROW(19:19))),\"\")","v":""},{"$f":"IF($B24=\"\",\"\",IFERROR(INDEX('quantities report_secondary'!$D$2:$D$10003,SMALL(IF('quantities report_secondary'!$A$2:$A$10003=C$6,ROW('quantities report_secondary'!$A$2:$A$10003)-1,\"\"),ROWS($B$8:$B24))),\"0\"))","v":""},"",{"$f":"IF($B24=\"\",\"\",IFERROR(INDEX('quantities report_secondary'!$D$2:$D$10003,SMALL(IF('quantities report_secondary'!$A$2:$A$10003=E$6,ROW('quantities report_secondary'!$A$2:$A$10003)-1,\"\"),ROWS($B$8:$B24))),\"0\"))","v":""},{"$f":"IF($B24=\"\",\"\",IFERROR(INDEX('quantities report_secondary'!$D$2:$D$10003,SMALL(IF('quantities report_secondary'!$A$2:$A$10003=F$6,ROW('quantities report_secondary'!$A$2:$A$10003)-1,\"\"),ROWS($B$8:$B24))),\"0\"))","v":""},{"$f":"IF($B24=\"\",\"\",IFERROR(INDEX('quantities report_secondary'!$D$2:$D$10003,SMALL(IF('quantities report_secondary'!$A$2:$A$10003=G$6,ROW('quantities report_secondary'!$A$2:$A$10003)-1,\"\"),ROWS($B$8:$B24))),\"0\"))","v":""},"",{"$f":"IF($B24=\"\",\"\",IFERROR(INDEX('quantities report_secondary'!$D$2:$D$10003,SMALL(IF('quantities report_secondary'!$A$2:$A$10003=I$6,ROW('quantities report_secondary'!$A$2:$A$10003)-1,\"\"),ROWS($B$8:$B24))),\"0\"))","v":""},{"$f":"IF($B24=\"\",\"\",IFERROR(INDEX('quantities report_secondary'!$D$2:$D$10003,SMALL(IF('quantities report_secondary'!$A$2:$A$10003=J$6,ROW('quantities report_secondary'!$A$2:$A$10003)-1,\"\"),ROWS($B$8:$B24))),\"0\"))","v":""},{"$f":"IF($B24=\"\",\"\",IFERROR(INDEX('quantities report_secondary'!$D$2:$D$10003,SMALL(IF('quantities report_secondary'!$A$2:$A$10003=K$6,ROW('quantities report_secondary'!$A$2:$A$10003)-1,\"\"),ROWS($B$8:$B24))),\"0\"))","v":""},{"$f":"IF($B24=\"\",\"\",IFERROR(INDEX('quantities report_secondary'!$D$2:$D$10003,SMALL(IF('quantities report_secondary'!$A$2:$A$10003=L$6,ROW('quantities report_secondary'!$A$2:$A$10003)-1,\"\"),ROWS($B$8:$B24))),\"0\"))","v":""},{"$f":"IF($B24=\"\",\"\",IFERROR(INDEX('quantities report_secondary'!$D$2:$D$10003,SMALL(IF('quantities report_secondary'!$A$2:$A$10003=M$6,ROW('quantities report_secondary'!$A$2:$A$10003)-1,\"\"),ROWS($B$8:$B24))),\"0\"))","v":""},{"$f":"IF($B24=\"\",\"\",IFERROR(INDEX('quantities report_secondary'!$D$2:$D$10003,SMALL(IF('quantities report_secondary'!$A$2:$A$10003=N$6,ROW('quantities report_secondary'!$A$2:$A$10003)-1,\"\"),ROWS($B$8:$B24))),\"0\"))","v":""},{"$f":"IF($B24=\"\",\"\",IFERROR(INDEX('quantities report_secondary'!$D$2:$D$10003,SMALL(IF('quantities report_secondary'!$A$2:$A$10003=O$6,ROW('quantities report_secondary'!$A$2:$A$10003)-1,\"\"),ROWS($B$8:$B24))),\"0\"))","v":""},{"$f":"IF($B24=\"\",\"\",IFERROR(INDEX('quantities report_secondary'!$D$2:$D$10003,SMALL(IF('quantities report_secondary'!$A$2:$A$10003=P$6,ROW('quantities report_secondary'!$A$2:$A$10003)-1,\"\"),ROWS($B$8:$B24))),\"0\"))","v":""},{"$f":"IF($B24=\"\",\"\",IFERROR(INDEX('quantities report_secondary'!$D$2:$D$10003,SMALL(IF('quantities report_secondary'!$A$2:$A$10003=Q$6,ROW('quantities report_secondary'!$A$2:$A$10003)-1,\"\"),ROWS($B$8:$B24))),\"0\"))","v":""},"",{"$f":"IF($B24=\"\",\"\",IFERROR(INDEX('quantities report_secondary'!$D$2:$D$10003,SMALL(IF('quantities report_secondary'!$A$2:$A$10003=S$6,ROW('quantities report_secondary'!$A$2:$A$10003)-1,\"\"),ROWS($B$8:$B24))),\"0\"))","v":""},{"$f":"IF($B24=\"\",\"\",IFERROR(INDEX('quantities report_secondary'!$D$2:$D$10003,SMALL(IF('quantities report_secondary'!$A$2:$A$10003=T$6,ROW('quantities report_secondary'!$A$2:$A$10003)-1,\"\"),ROWS($B$8:$B24))),\"0\"))","v":""},""]
[null,{"$f":"IFERROR(INDEX('manual inputs_secondary'!M:M,SMALL(IF('manual inputs_secondary'!M:M<>\"\",ROW('manual inputs_secondary'!M:M)),ROW(20:20))),\"\")","v":""},{"$f":"IF($B25=\"\",\"\",IFERROR(INDEX('quantities report_secondary'!$D$2:$D$10003,SMALL(IF('quantities report_secondary'!$A$2:$A$10003=C$6,ROW('quantities report_secondary'!$A$2:$A$10003)-1,\"\"),ROWS($B$8:$B25))),\"0\"))","v":""},"",{"$f":"IF($B25=\"\",\"\",IFERROR(INDEX('quantities report_secondary'!$D$2:$D$10003,SMALL(IF('quantities report_secondary'!$A$2:$A$10003=E$6,ROW('quantities report_secondary'!$A$2:$A$10003)-1,\"\"),ROWS($B$8:$B25))),\"0\"))","v":""},{"$f":"IF($B25=\"\",\"\",IFERROR(INDEX('quantities report_secondary'!$D$2:$D$10003,SMALL(IF('quantities report_secondary'!$A$2:$A$10003=F$6,ROW('quantities report_secondary'!$A$2:$A$10003)-1,\"\"),ROWS($B$8:$B25))),\"0\"))","v":""},{"$f":"IF($B25=\"\",\"\",IFERROR(INDEX('quantities report_secondary'!$D$2:$D$10003,SMALL(IF('quantities report_secondary'!$A$2:$A$10003=G$6,ROW('quantities report_secondary'!$A$2:$A$10003)-1,\"\"),ROWS($B$8:$B25))),\"0\"))","v":""},"",{"$f":"IF($B25=\"\",\"\",IFERROR(INDEX('quantities report_secondary'!$D$2:$D$10003,SMALL(IF('quantities report_secondary'!$A$2:$A$10003=I$6,ROW('quantities report_secondary'!$A$2:$A$10003)-1,\"\"),ROWS($B$8:$B25))),\"0\"))","v":""},{"$f":"IF($B25=\"\",\"\",IFERROR(INDEX('quantities report_secondary'!$D$2:$D$10003,SMALL(IF('quantities report_secondary'!$A$2:$A$10003=J$6,ROW('quantities report_secondary'!$A$2:$A$10003)-1,\"\"),ROWS($B$8:$B25))),\"0\"))","v":""},{"$f":"IF($B25=\"\",\"\",IFERROR(INDEX('quantities report_secondary'!$D$2:$D$10003,SMALL(IF('quantities report_secondary'!$A$2:$A$10003=K$6,ROW('quantities report_secondary'!$A$2:$A$10003)-1,\"\"),ROWS($B$8:$B25))),\"0\"))","v":""},{"$f":"IF($B25=\"\",\"\",IFERROR(INDEX('quantities report_secondary'!$D$2:$D$10003,SMALL(IF('quantities report_secondary'!$A$2:$A$10003=L$6,ROW('quantities report_secondary'!$A$2:$A$10003)-1,\"\"),ROWS($B$8:$B25))),\"0\"))","v":""},{"$f":"IF($B25=\"\",\"\",IFERROR(INDEX('quantities report_secondary'!$D$2:$D$10003,SMALL(IF('quantities report_secondary'!$A$2:$A$10003=M$6,ROW('quantities report_secondary'!$A$2:$A$10003)-1,\"\"),ROWS($B$8:$B25))),\"0\"))","v":""},{"$f":"IF($B25=\"\",\"\",IFERROR(INDEX('quantities report_secondary'!$D$2:$D$10003,SMALL(IF('quantities report_secondary'!$A$2:$A$10003=N$6,ROW('quantities report_secondary'!$A$2:$A$10003)-1,\"\"),ROWS($B$8:$B25))),\"0\"))","v":""},{"$f":"IF($B25=\"\",\"\",IFERROR(INDEX('quantities report_secondary'!$D$2:$D$10003,SMALL(IF('quantities report_secondary'!$A$2:$A$10003=O$6,ROW('quantities report_secondary'!$A$2:$A$10003)-1,\"\"),ROWS($B$8:$B25))),\"0\"))","v":""},{"$f":"IF($B25=\"\",\"\",IFERROR(INDEX('quantities report_secondary'!$D$2:$D$10003,SMALL(IF('quantities report_secondary'!$A$2:$A$10003=P$6,ROW('quantities report_secondary'!$A$2:$A$10003)-1,\"\"),ROWS($B$8:$B25))),\"0\"))","v":""},{"$f":"IF($B25=\"\",\"\",IFERROR(INDEX('quantities report_secondary'!$D$2:$D$10003,SMALL(IF('quantities report_secondary'!$A$2:$A$10003=Q$6,ROW('quantities report_secondary'!$A$2:$A$10003)-1,\"\"),ROWS($B$8:$B25))),\"0\"))","v":""},"",{"$f":"IF($B25=\"\",\"\",IFERROR(INDEX('quantities report_secondary'!$D$2:$D$10003,SMALL(IF('quantities report_secondary'!$A$2:$A$10003=S$6,ROW('quantities report_secondary'!$A$2:$A$10003)-1,\"\"),ROWS($B$8:$B25))),\"0\"))","v":""},{"$f":"IF($B25=\"\",\"\",IFERROR(INDEX('quantities report_secondary'!$D$2:$D$10003,SMALL(IF('quantities report_secondary'!$A$2:$A$10003=T$6,ROW('quantities report_secondary'!$A$2:$A$10003)-1,\"\"),ROWS($B$8:$B25))),\"0\"))","v":""},""]
[null,{"$f":"IFERROR(INDEX('manual inputs_secondary'!M:M,SMALL(IF('manual inputs_secondary'!M:M<>\"\",ROW('manual inputs_secondary'!M:M)),ROW(21:21))),\"\")","v":""},{"$f":"IF($B26=\"\",\"\",IFERROR(INDEX('quantities report_secondary'!$D$2:$D$10003,SMALL(IF('quantities report_secondary'!$A$2:$A$10003=C$6,ROW('quantities report_secondary'!$A$2:$A$10003)-1,\"\"),ROWS($B$8:$B26))),\"0\"))","v":""},"",{"$f":"IF($B26=\"\",\"\",IFERROR(INDEX('quantities report_secondary'!$D$2:$D$10003,SMALL(IF('quantities report_secondary'!$A$2:$A$10003=E$6,ROW('quantities report_secondary'!$A$2:$A$10003)-1,\"\"),ROWS($B$8:$B26))),\"0\"))","v":""},{"$f":"IF($B26=\"\",\"\",IFERROR(INDEX('quantities report_secondary'!$D$2:$D$10003,SMALL(IF('quantities report_secondary'!$A$2:$A$10003=F$6,ROW('quantities report_secondary'!$A$2:$A$10003)-1,\"\"),ROWS($B$8:$B26))),\"0\"))","v":""},{"$f":"IF($B26=\"\",\"\",IFERROR(INDEX('quantities report_secondary'!$D$2:$D$10003,SMALL(IF('quantities report_secondary'!$A$2:$A$10003=G$6,ROW('quantities report_secondary'!$A$2:$A$10003)-1,\"\"),ROWS($B$8:$B26))),\"0\"))","v":""},"",{"$f":"IF($B26=\"\",\"\",IFERROR(INDEX('quantities report_secondary'!$D$2:$D$10003,SMALL(IF('quantities report_secondary'!$A$2:$A$10003=I$6,ROW('quantities report_secondary'!$A$2:$A$10003)-1,\"\"),ROWS($B$8:$B26))),\"0\"))","v":""},{"$f":"IF($B26=\"\",\"\",IFERROR(INDEX('quantities report_secondary'!$D$2:$D$10003,SMALL(IF('quantities report_secondary'!$A$2:$A$10003=J$6,ROW('quantities report_secondary'!$A$2:$A$10003)-1,\"\"),ROWS($B$8:$B26))),\"0\"))","v":""},{"$f":"IF($B26=\"\",\"\",IFERROR(INDEX('quantities report_secondary'!$D$2:$D$10003,SMALL(IF('quantities report_secondary'!$A$2:$A$10003=K$6,ROW('quantities report_secondary'!$A$2:$A$10003)-1,\"\"),ROWS($B$8:$B26))),\"0\"))","v":""},{"$f":"IF($B26=\"\",\"\",IFERROR(INDEX('quantities report_secondary'!$D$2:$D$10003,SMALL(IF('quantities report_secondary'!$A$2:$A$10003=L$6,ROW('quantities report_secondary'!$A$2:$A$10003)-1,\"\"),ROWS($B$8:$B26))),\"0\"))","v":""},{"$f":"IF($B26=\"\",\"\",IFERROR(INDEX('quantities report_secondary'!$D$2:$D$10003,SMALL(IF('quantities report_secondary'!$A$2:$A$10003=M$6,ROW('quantities report_secondary'!$A$2:$A$10003)-1,\"\"),ROWS($B$8:$B26))),\"0\"))","v":""},{"$f":"IF($B26=\"\",\"\",IFERROR(INDEX('quantities report_secondary'!$D$2:$D$10003,SMALL(IF('quantities report_secondary'!$A$2:$A$10003=N$6,ROW('quantities report_secondary'!$A$2:$A$10003)-1,\"\"),ROWS($B$8:$B26))),\"0\"))","v":""},{"$f":"IF($B26=\"\",\"\",IFERROR(INDEX('quantities report_secondary'!$D$2:$D$10003,SMALL(IF('quantities report_secondary'!$A$2:$A$10003=O$6,ROW('quantities report_secondary'!$A$2:$A$10003)-1,\"\"),ROWS($B$8:$B26))),\"0\"))","v":""},{"$f":"IF($B26=\"\",\"\",IFERROR(INDEX('quantities report_secondary'!$D$2:$D$10003,SMALL(IF('quantities report_secondary'!$A$2:$A$10003=P$6,ROW('quantities report_secondary'!$A$2:$A$10003)-1,\"\"),ROWS($B$8:$B26))),\"0\"))","v":""},{"$f":"IF($B26=\"\",\"\",IFERROR(INDEX('quantities report_secondary'!$D$2:$D$10003,SMALL(IF('quantities report_secondary'!$A$2:$A$10003=Q$6,ROW('quantities report_secondary'!$A$2:$A$10003)-1,\"\"),ROWS($B$8:$B26))),\"0\"))","v":""},"",{"$f":"IF($B26=\"\",\"\",IFERROR(INDEX('quantities report_secondary'!$D$2:$D$10003,SMALL(IF('quantities report_secondary'!$A$2:$A$10003=S$6,ROW('quantities report_secondary'!$A$2:$A$10003)-1,\"\"),ROWS($B$8:$B26))),\"0\"))","v":""},{"$f":"IF($B26=\"\",\"\",IFERROR(INDEX('quantities report_secondary'!$D$2:$D$10003,SMALL(IF('quantities report_secondary'!$A$2:$A$10003=T$6,ROW('quantities report_secondary'!$A$2:$A$10003)-1,\"\"),ROWS($B$8:$B26))),\"0\"))","v":""},""]
[null,{"$f":"IFERROR(INDEX('manual inputs_secondary'!M:M,SMALL(IF('manual inputs_secondary'!M:M<>\"\",ROW('manual inputs_secondary'!M:M)),ROW(22:22))),\"\")","v":""},{"$f":"IF($B27=\"\",\"\",IFERROR(INDEX('quantities report_secondary'!$D$2:$D$10003,SMALL(IF('quantities report_secondary'!$A$2:$A$10003=C$6,ROW('quantities report_secondary'!$A$2:$A$10003)-1,\"\"),ROWS($B$8:$B27))),\"0\"))","v":""},"",{"$f":"IF($B27=\"\",\"\",IFERROR(INDEX('quantities report_secondary'!$D$2:$D$10003,SMALL(IF('quantities report_secondary'!$A$2:$A$10003=E$6,ROW('quantities report_secondary'!$A$2:$A$10003)-1,\"\"),ROWS($B$8:$B27))),\"0\"))","v":""},{"$f":"IF($B27=\"\",\"\",IFERROR(INDEX('quantities report_secondary'!$D$2:$D$10003,SMALL(IF('quantities report_secondary'!$A$2:$A$10003=F$6,ROW('quantities report_secondary'!$A$2:$A$10003)-1,\"\"),ROWS($B$8:$B27))),\"0\"))","v":""},{"$f":"IF($B27=\"\",\"\",IFERROR(INDEX('quantities report_secondary'!$D$2:$D$10003,SMALL(IF('quantities report_secondary'!$A$2:$A$10003=G$6,ROW('quantities report_secondary'!$A$2:$A$10003)-1,\"\"),ROWS($B$8:$B27))),\"0\"))","v":""},"",{"$f":"IF($B27=\"\",\"\",IFERROR(INDEX('quantities report_secondary'!$D$2:$D$10003,SMALL(IF('quantities report_secondary'!$A$2:$A$10003=I$6,ROW('quantities report_secondary'!$A$2:$A$10003)-1,\"\"),ROWS($B$8:$B27))),\"0\"))","v":""},{"$f":"IF($B27=\"\",\"\",IFERROR(INDEX('quantities report_secondary'!$D$2:$D$10003,SMALL(IF('quantities report_secondary'!$A$2:$A$10003=J$6,ROW('quantities report_secondary'!$A$2:$A$10003)-1,\"\"),ROWS($B$8:$B27))),\"0\"))","v":""},{"$f":"IF($B27=\"\",\"\",IFERROR(INDEX('quantities report_secondary'!$D$2:$D$10003,SMALL(IF('quantities report_secondary'!$A$2:$A$10003=K$6,ROW('quantities report_secondary'!$A$2:$A$10003)-1,\"\"),ROWS($B$8:$B27))),\"0\"))","v":""},{"$f":"IF($B27=\"\",\"\",IFERROR(INDEX('quantities report_secondary'!$D$2:$D$10003,SMALL(IF('quantities report_secondary'!$A$2:$A$10003=L$6,ROW('quantities report_secondary'!$A$2:$A$10003)-1,\"\"),ROWS($B$8:$B27))),\"0\"))","v":""},{"$f":"IF($B27=\"\",\"\",IFERROR(INDEX('quantities report_secondary'!$D$2:$D$10003,SMALL(IF('quantities report_secondary'!$A$2:$A$10003=M$6,ROW('quantities report_secondary'!$A$2:$A$10003)-1,\"\"),ROWS($B$8:$B27))),\"0\"))","v":""},{"$f":"IF($B27=\"\",\"\",IFERROR(INDEX('quantities report_secondary'!$D$2:$D$10003,SMALL(IF('quantities report_secondary'!$A$2:$A$10003=N$6,ROW('quantities report_secondary'!$A$2:$A$10003)-1,\"\"),ROWS($B$8:$B27))),\"0\"))","v":""},{"$f":"IF($B27=\"\",\"\",IFERROR(INDEX('quantities report_secondary'!$D$2:$D$10003,SMALL(IF('quantities report_secondary'!$A$2:$A$10003=O$6,ROW('quantities report_secondary'!$A$2:$A$10003)-1,\"\"),ROWS($B$8:$B27))),\"0\"))","v":""},{"$f":"IF($B27=\"\",\"\",IFERROR(INDEX('quantities report_secondary'!$D$2:$D$10003,SMALL(IF('quantities report_secondary'!$A$2:$A$10003=P$6,ROW('quantities report_secondary'!$A$2:$A$10003)-1,\"\"),ROWS($B$8:$B27))),\"0\"))","v":""},{"$f":"IF($B27=\"\",\"\",IFERROR(INDEX('quantities report_secondary'!$D$2:$D$10003,SMALL(IF('quantities report_secondary'!$A$2:$A$10003=Q$6,ROW('quantities report_secondary'!$A$2:$A$10003)-1,\"\"),ROWS($B$8:$B27))),\"0\"))","v":""},"",{"$f":"IF($B27=\"\",\"\",IFERROR(INDEX('quantities report_secondary'!$D$2:$D$10003,SMALL(IF('quantities report_secondary'!$A$2:$A$10003=S$6,ROW('quantities report_secondary'!$A$2:$A$10003)-1,\"\"),ROWS($B$8:$B27))),\"0\"))","v":""},{"$f":"IF($B27=\"\",\"\",IFERROR(INDEX('quantities report_secondary'!$D$2:$D$10003,SMALL(IF('quantities report_secondary'!$A$2:$A$10003=T$6,ROW('quantities report_secondary'!$A$2:$A$10003)-1,\"\"),ROWS($B$8:$B27))),\"0\"))","v":""},""]
[null,{"$f":"IFERROR(INDEX('manual inputs_secondary'!M:M,SMALL(IF('manual inputs_secondary'!M:M<>\"\",ROW('manual inputs_secondary'!M:M)),ROW(23:23))),\"\")","v":""},{"$f":"IF($B28=\"\",\"\",IFERROR(INDEX('quantities report_secondary'!$D$2:$D$10003,SMALL(IF('quantities report_secondary'!$A$2:$A$10003=C$6,ROW('quantities report_secondary'!$A$2:$A$10003)-1,\"\"),ROWS($B$8:$B28))),\"0\"))","v":""},"",{"$f":"IF($B28=\"\",\"\",IFERROR(INDEX('quantities report_secondary'!$D$2:$D$10003,SMALL(IF('quantities report_secondary'!$A$2:$A$10003=E$6,ROW('quantities report_secondary'!$A$2:$A$10003)-1,\"\"),ROWS($B$8:$B28))),\"0\"))","v":""},{"$f":"IF($B28=\"\",\"\",IFERROR(INDEX('quantities report_secondary'!$D$2:$D$10003,SMALL(IF('quantities report_secondary'!$A$2:$A$10003=F$6,ROW('quantities report_secondary'!$A$2:$A$10003)-1,\"\"),ROWS($B$8:$B28))),\"0\"))","v":""},{"$f":"IF($B28=\"\",\"\",IFERROR(INDEX('quantities report_secondary'!$D$2:$D$10003,SMALL(IF('quantities report_secondary'!$A$2:$A$10003=G$6,ROW('quantities report_secondary'!$A$2:$A$10003)-1,\"\"),ROWS($B$8:$B28))),\"0\"))","v":""},"",{"$f":"IF($B28=\"\",\"\",IFERROR(INDEX('quantities report_secondary'!$D$2:$D$10003,SMALL(IF('quantities report_secondary'!$A$2:$A$10003=I$6,ROW('quantities report_secondary'!$A$2:$A$10003)-1,\"\"),ROWS($B$8:$B28))),\"0\"))","v":""},{"$f":"IF($B28=\"\",\"\",IFERROR(INDEX('quantities report_secondary'!$D$2:$D$10003,SMALL(IF('quantities report_secondary'!$A$2:$A$10003=J$6,ROW('quantities report_secondary'!$A$2:$A$10003)-1,\"\"),ROWS($B$8:$B28))),\"0\"))","v":""},{"$f":"IF($B28=\"\",\"\",IFERROR(INDEX('quantities report_secondary'!$D$2:$D$10003,SMALL(IF('quantities report_secondary'!$A$2:$A$10003=K$6,ROW('quantities report_secondary'!$A$2:$A$10003)-1,\"\"),ROWS($B$8:$B28))),\"0\"))","v":""},{"$f":"IF($B28=\"\",\"\",IFERROR(INDEX('quantities report_secondary'!$D$2:$D$10003,SMALL(IF('quantities report_secondary'!$A$2:$A$10003=L$6,ROW('quantities report_secondary'!$A$2:$A$10003)-1,\"\"),ROWS($B$8:$B28))),\"0\"))","v":""},{"$f":"IF($B28=\"\",\"\",IFERROR(INDEX('quantities report_secondary'!$D$2:$D$10003,SMALL(IF('quantities report_secondary'!$A$2:$A$10003=M$6,ROW('quantities report_secondary'!$A$2:$A$10003)-1,\"\"),ROWS($B$8:$B28))),\"0\"))","v":""},{"$f":"IF($B28=\"\",\"\",IFERROR(INDEX('quantities report_secondary'!$D$2:$D$10003,SMALL(IF('quantities report_secondary'!$A$2:$A$10003=N$6,ROW('quantities report_secondary'!$A$2:$A$10003)-1,\"\"),ROWS($B$8:$B28))),\"0\"))","v":""},{"$f":"IF($B28=\"\",\"\",IFERROR(INDEX('quantities report_secondary'!$D$2:$D$10003,SMALL(IF('quantities report_secondary'!$A$2:$A$10003=O$6,ROW('quantities report_secondary'!$A$2:$A$10003)-1,\"\"),ROWS($B$8:$B28))),\"0\"))","v":""},{"$f":"IF($B28=\"\",\"\",IFERROR(INDEX('quantities report_secondary'!$D$2:$D$10003,SMALL(IF('quantities report_secondary'!$A$2:$A$10003=P$6,ROW('quantities report_secondary'!$A$2:$A$10003)-1,\"\"),ROWS($B$8:$B28))),\"0\"))","v":""},{"$f":"IF($B28=\"\",\"\",IFERROR(INDEX('quantities report_secondary'!$D$2:$D$10003,SMALL(IF('quantities report_secondary'!$A$2:$A$10003=Q$6,ROW('quantities report_secondary'!$A$2:$A$10003)-1,\"\"),ROWS($B$8:$B28))),\"0\"))","v":""},"",{"$f":"IF($B28=\"\",\"\",IFERROR(INDEX('quantities report_secondary'!$D$2:$D$10003,SMALL(IF('quantities report_secondary'!$A$2:$A$10003=S$6,ROW('quantities report_secondary'!$A$2:$A$10003)-1,\"\"),ROWS($B$8:$B28))),\"0\"))","v":""},{"$f":"IF($B28=\"\",\"\",IFERROR(INDEX('quantities report_secondary'!$D$2:$D$10003,SMALL(IF('quantities report_secondary'!$A$2:$A$10003=T$6,ROW('quantities report_secondary'!$A$2:$A$10003)-1,\"\"),ROWS($B$8:$B28))),\"0\"))","v":""},""]
[null,{"$f":"IFERROR(INDEX('manual inputs_secondary'!M:M,SMALL(IF('manual inputs_secondary'!M:M<>\"\",ROW('manual inputs_secondary'!M:M)),ROW(24:24))),\"\")","v":""},{"$f":"IF($B29=\"\",\"\",IFERROR(INDEX('quantities report_secondary'!$D$2:$D$10003,SMALL(IF('quantities report_secondary'!$A$2:$A$10003=C$6,ROW('quantities report_secondary'!$A$2:$A$10003)-1,\"\"),ROWS($B$8:$B29))),\"0\"))","v":""},"",{"$f":"IF($B29=\"\",\"\",IFERROR(INDEX('quantities report_secondary'!$D$2:$D$10003,SMALL(IF('quantities report_secondary'!$A$2:$A$10003=E$6,ROW('quantities report_secondary'!$A$2:$A$10003)-1,\"\"),ROWS($B$8:$B29))),\"0\"))","v":""},{"$f":"IF($B29=\"\",\"\",IFERROR(INDEX('quantities report_secondary'!$D$2:$D$10003,SMALL(IF('quantities report_secondary'!$A$2:$A$10003=F$6,ROW('quantities report_secondary'!$A$2:$A$10003)-1,\"\"),ROWS($B$8:$B29))),\"0\"))","v":""},{"$f":"IF($B29=\"\",\"\",IFERROR(INDEX('quantities report_secondary'!$D$2:$D$10003,SMALL(IF('quantities report_secondary'!$A$2:$A$10003=G$6,ROW('quantities report_secondary'!$A$2:$A$10003)-1,\"\"),ROWS($B$8:$B29))),\"0\"))","v":""},"",{"$f":"IF($B29=\"\",\"\",IFERROR(INDEX('quantities report_secondary'!$D$2:$D$10003,SMALL(IF('quantities report_secondary'!$A$2:$A$10003=I$6,ROW('quantities report_secondary'!$A$2:$A$10003)-1,\"\"),ROWS($B$8:$B29))),\"0\"))","v":""},{"$f":"IF($B29=\"\",\"\",IFERROR(INDEX('quantities report_secondary'!$D$2:$D$10003,SMALL(IF('quantities report_secondary'!$A$2:$A$10003=J$6,ROW('quantities report_secondary'!$A$2:$A$10003)-1,\"\"),ROWS($B$8:$B29))),\"0\"))","v":""},{"$f":"IF($B29=\"\",\"\",IFERROR(INDEX('quantities report_secondary'!$D$2:$D$10003,SMALL(IF('quantities report_secondary'!$A$2:$A$10003=K$6,ROW('quantities report_secondary'!$A$2:$A$10003)-1,\"\"),ROWS($B$8:$B29))),\"0\"))","v":""},{"$f":"IF($B29=\"\",\"\",IFERROR(INDEX('quantities report_secondary'!$D$2:$D$10003,SMALL(IF('quantities report_secondary'!$A$2:$A$10003=L$6,ROW('quantities report_secondary'!$A$2:$A$10003)-1,\"\"),ROWS($B$8:$B29))),\"0\"))","v":""},{"$f":"IF($B29=\"\",\"\",IFERROR(INDEX('quantities report_secondary'!$D$2:$D$10003,SMALL(IF('quantities report_secondary'!$A$2:$A$10003=M$6,ROW('quantities report_secondary'!$A$2:$A$10003)-1,\"\"),ROWS($B$8:$B29))),\"0\"))","v":""},{"$f":"IF($B29=\"\",\"\",IFERROR(INDEX('quantities report_secondary'!$D$2:$D$10003,SMALL(IF('quantities report_secondary'!$A$2:$A$10003=N$6,ROW('quantities report_secondary'!$A$2:$A$10003)-1,\"\"),ROWS($B$8:$B29))),\"0\"))","v":""},{"$f":"IF($B29=\"\",\"\",IFERROR(INDEX('quantities report_secondary'!$D$2:$D$10003,SMALL(IF('quantities report_secondary'!$A$2:$A$10003=O$6,ROW('quantities report_secondary'!$A$2:$A$10003)-1,\"\"),ROWS($B$8:$B29))),\"0\"))","v":""},{"$f":"IF($B29=\"\",\"\",IFERROR(INDEX('quantities report_secondary'!$D$2:$D$10003,SMALL(IF('quantities report_secondary'!$A$2:$A$10003=P$6,ROW('quantities report_secondary'!$A$2:$A$10003)-1,\"\"),ROWS($B$8:$B29))),\"0\"))","v":""},{"$f":"IF($B29=\"\",\"\",IFERROR(INDEX('quantities report_secondary'!$D$2:$D$10003,SMALL(IF('quantities report_secondary'!$A$2:$A$10003=Q$6,ROW('quantities report_secondary'!$A$2:$A$10003)-1,\"\"),ROWS($B$8:$B29))),\"0\"))","v":""},"",{"$f":"IF($B29=\"\",\"\",IFERROR(INDEX('quantities report_secondary'!$D$2:$D$10003,SMALL(IF('quantities report_secondary'!$A$2:$A$10003=S$6,ROW('quantities report_secondary'!$A$2:$A$10003)-1,\"\"),ROWS($B$8:$B29))),\"0\"))","v":""},{"$f":"IF($B29=\"\",\"\",IFERROR(INDEX('quantities report_secondary'!$D$2:$D$10003,SMALL(IF('quantities report_secondary'!$A$2:$A$10003=T$6,ROW('quantities report_secondary'!$A$2:$A$10003)-1,\"\"),ROWS($B$8:$B29))),\"0\"))","v":""},""]
[null,{"$f":"IFERROR(INDEX('manual inputs_secondary'!M:M,SMALL(IF('manual inputs_secondary'!M:M<>\"\",ROW('manual inputs_secondary'!M:M)),ROW(25:25))),\"\")","v":""},{"$f":"IF($B30=\"\",\"\",IFERROR(INDEX('quantities report_secondary'!$D$2:$D$10003,SMALL(IF('quantities report_secondary'!$A$2:$A$10003=C$6,ROW('quantities report_secondary'!$A$2:$A$10003)-1,\"\"),ROWS($B$8:$B30))),\"0\"))","v":""},"",{"$f":"IF($B30=\"\",\"\",IFERROR(INDEX('quantities report_secondary'!$D$2:$D$10003,SMALL(IF('quantities report_secondary'!$A$2:$A$10003=E$6,ROW('quantities report_secondary'!$A$2:$A$10003)-1,\"\"),ROWS($B$8:$B30))),\"0\"))","v":""},{"$f":"IF($B30=\"\",\"\",IFERROR(INDEX('quantities report_secondary'!$D$2:$D$10003,SMALL(IF('quantities report_secondary'!$A$2:$A$10003=F$6,ROW('quantities report_secondary'!$A$2:$A$10003)-1,\"\"),ROWS($B$8:$B30))),\"0\"))","v":""},{"$f":"IF($B30=\"\",\"\",IFERROR(INDEX('quantities report_secondary'!$D$2:$D$10003,SMALL(IF('quantities report_secondary'!$A$2:$A$10003=G$6,ROW('quantities report_secondary'!$A$2:$A$10003)-1,\"\"),ROWS($B$8:$B30))),\"0\"))","v":""},"",{"$f":"IF($B30=\"\",\"\",IFERROR(INDEX('quantities report_secondary'!$D$2:$D$10003,SMALL(IF('quantities report_secondary'!$A$2:$A$10003=I$6,ROW('quantities report_secondary'!$A$2:$A$10003)-1,\"\"),ROWS($B$8:$B30))),\"0\"))","v":""},{"$f":"IF($B30=\"\",\"\",IFERROR(INDEX('quantities report_secondary'!$D$2:$D$10003,SMALL(IF('quantities report_secondary'!$A$2:$A$10003=J$6,ROW('quantities report_secondary'!$A$2:$A$10003)-1,\"\"),ROWS($B$8:$B30))),\"0\"))","v":""},{"$f":"IF($B30=\"\",\"\",IFERROR(INDEX('quantities report_secondary'!$D$2:$D$10003,SMALL(IF('quantities report_secondary'!$A$2:$A$10003=K$6,ROW('quantities report_secondary'!$A$2:$A$10003)-1,\"\"),ROWS($B$8:$B30))),\"0\"))","v":""},{"$f":"IF($B30=\"\",\"\",IFERROR(INDEX('quantities report_secondary'!$D$2:$D$10003,SMALL(IF('quantities report_secondary'!$A$2:$A$10003=L$6,ROW('quantities report_secondary'!$A$2:$A$10003)-1,\"\"),ROWS($B$8:$B30))),\"0\"))","v":""},{"$f":"IF($B30=\"\",\"\",IFERROR(INDEX('quantities report_secondary'!$D$2:$D$10003,SMALL(IF('quantities report_secondary'!$A$2:$A$10003=M$6,ROW('quantities report_secondary'!$A$2:$A$10003)-1,\"\"),ROWS($B$8:$B30))),\"0\"))","v":""},{"$f":"IF($B30=\"\",\"\",IFERROR(INDEX('quantities report_secondary'!$D$2:$D$10003,SMALL(IF('quantities report_secondary'!$A$2:$A$10003=N$6,ROW('quantities report_secondary'!$A$2:$A$10003)-1,\"\"),ROWS($B$8:$B30))),\"0\"))","v":""},{"$f":"IF($B30=\"\",\"\",IFERROR(INDEX('quantities report_secondary'!$D$2:$D$10003,SMALL(IF('quantities report_secondary'!$A$2:$A$10003=O$6,ROW('quantities report_secondary'!$A$2:$A$10003)-1,\"\"),ROWS($B$8:$B30))),\"0\"))","v":""},{"$f":"IF($B30=\"\",\"\",IFERROR(INDEX('quantities report_secondary'!$D$2:$D$10003,SMALL(IF('quantities report_secondary'!$A$2:$A$10003=P$6,ROW('quantities report_secondary'!$A$2:$A$10003)-1,\"\"),ROWS($B$8:$B30))),\"0\"))","v":""},{"$f":"IF($B30=\"\",\"\",IFERROR(INDEX('quantities report_secondary'!$D$2:$D$10003,SMALL(IF('quantities report_secondary'!$A$2:$A$10003=Q$6,ROW('quantities report_secondary'!$A$2:$A$10003)-1,\"\"),ROWS($B$8:$B30))),\"0\"))","v":""},"",{"$f":"IF($B30=\"\",\"\",IFERROR(INDEX('quantities report_secondary'!$D$2:$D$10003,SMALL(IF('quantities report_secondary'!$A$2:$A$10003=S$6,ROW('quantities report_secondary'!$A$2:$A$10003)-1,\"\"),ROWS($B$8:$B30))),\"0\"))","v":""},{"$f":"IF($B30=\"\",\"\",IFERROR(INDEX('quantities report_secondary'!$D$2:$D$10003,SMALL(IF('quantities report_secondary'!$A$2:$A$10003=T$6,ROW('quantities report_secondary'!$A$2:$A$10003)-1,\"\"),ROWS($B$8:$B30))),\"0\"))","v":""},""]
[null,{"$f":"IFERROR(INDEX('manual inputs_secondary'!M:M,SMALL(IF('manual inputs_secondary'!M:M<>\"\",ROW('manual inputs_secondary'!M:M)),ROW(26:26))),\"\")","v":""},{"$f":"IF($B31=\"\",\"\",IFERROR(INDEX('quantities report_secondary'!$D$2:$D$10003,SMALL(IF('quantities report_secondary'!$A$2:$A$10003=C$6,ROW('quantities report_secondary'!$A$2:$A$10003)-1,\"\"),ROWS($B$8:$B31))),\"0\"))","v":""},"",{"$f":"IF($B31=\"\",\"\",IFERROR(INDEX('quantities report_secondary'!$D$2:$D$10003,SMALL(IF('quantities report_secondary'!$A$2:$A$10003=E$6,ROW('quantities report_secondary'!$A$2:$A$10003)-1,\"\"),ROWS($B$8:$B31))),\"0\"))","v":""},{"$f":"IF($B31=\"\",\"\",IFERROR(INDEX('quantities report_secondary'!$D$2:$D$10003,SMALL(IF('quantities report_secondary'!$A$2:$A$10003=F$6,ROW('quantities report_secondary'!$A$2:$A$10003)-1,\"\"),ROWS($B$8:$B31))),\"0\"))","v":""},{"$f":"IF($B31=\"\",\"\",IFERROR(INDEX('quantities report_secondary'!$D$2:$D$10003,SMALL(IF('quantities report_secondary'!$A$2:$A$10003=G$6,ROW('quantities report_secondary'!$A$2:$A$10003)-1,\"\"),ROWS($B$8:$B31))),\"0\"))","v":""},"",{"$f":"IF($B31=\"\",\"\",IFERROR(INDEX('quantities report_secondary'!$D$2:$D$10003,SMALL(IF('quantities report_secondary'!$A$2:$A$10003=I$6,ROW('quantities report_secondary'!$A$2:$A$10003)-1,\"\"),ROWS($B$8:$B31))),\"0\"))","v":""},{"$f":"IF($B31=\"\",\"\",IFERROR(INDEX('quantities report_secondary'!$D$2:$D$10003,SMALL(IF('quantities report_secondary'!$A$2:$A$10003=J$6,ROW('quantities report_secondary'!$A$2:$A$10003)-1,\"\"),ROWS($B$8:$B31))),\"0\"))","v":""},{"$f":"IF($B31=\"\",\"\",IFERROR(INDEX('quantities report_secondary'!$D$2:$D$10003,SMALL(IF('quantities report_secondary'!$A$2:$A$10003=K$6,ROW('quantities report_secondary'!$A$2:$A$10003)-1,\"\"),ROWS($B$8:$B31))),\"0\"))","v":""},{"$f":"IF($B31=\"\",\"\",IFERROR(INDEX('quantities report_secondary'!$D$2:$D$10003,SMALL(IF('quantities report_secondary'!$A$2:$A$10003=L$6,ROW('quantities report_secondary'!$A$2:$A$10003)-1,\"\"),ROWS($B$8:$B31))),\"0\"))","v":""},{"$f":"IF($B31=\"\",\"\",IFERROR(INDEX('quantities report_secondary'!$D$2:$D$10003,SMALL(IF('quantities report_secondary'!$A$2:$A$10003=M$6,ROW('quantities report_secondary'!$A$2:$A$10003)-1,\"\"),ROWS($B$8:$B31))),\"0\"))","v":""},{"$f":"IF($B31=\"\",\"\",IFERROR(INDEX('quantities report_secondary'!$D$2:$D$10003,SMALL(IF('quantities report_secondary'!$A$2:$A$10003=N$6,ROW('quantities report_secondary'!$A$2:$A$10003)-1,\"\"),ROWS($B$8:$B31))),\"0\"))","v":""},{"$f":"IF($B31=\"\",\"\",IFERROR(INDEX('quantities report_secondary'!$D$2:$D$10003,SMALL(IF('quantities report_secondary'!$A$2:$A$10003=O$6,ROW('quantities report_secondary'!$A$2:$A$10003)-1,\"\"),ROWS($B$8:$B31))),\"0\"))","v":""},{"$f":"IF($B31=\"\",\"\",IFERROR(INDEX('quantities report_secondary'!$D$2:$D$10003,SMALL(IF('quantities report_secondary'!$A$2:$A$10003=P$6,ROW('quantities report_secondary'!$A$2:$A$10003)-1,\"\"),ROWS($B$8:$B31))),\"0\"))","v":""},{"$f":"IF($B31=\"\",\"\",IFERROR(INDEX('quantities report_secondary'!$D$2:$D$10003,SMALL(IF('quantities report_secondary'!$A$2:$A$10003=Q$6,ROW('quantities report_secondary'!$A$2:$A$10003)-1,\"\"),ROWS($B$8:$B31))),\"0\"))","v":""},"",{"$f":"IF($B31=\"\",\"\",IFERROR(INDEX('quantities report_secondary'!$D$2:$D$10003,SMALL(IF('quantities report_secondary'!$A$2:$A$10003=S$6,ROW('quantities report_secondary'!$A$2:$A$10003)-1,\"\"),ROWS($B$8:$B31))),\"0\"))","v":""},{"$f":"IF($B31=\"\",\"\",IFERROR(INDEX('quantities report_secondary'!$D$2:$D$10003,SMALL(IF('quantities report_secondary'!$A$2:$A$10003=T$6,ROW('quantities report_secondary'!$A$2:$A$10003)-1,\"\"),ROWS($B$8:$B31))),\"0\"))","v":""},""]
[null,{"$f":"IFERROR(INDEX(#REF!,SMALL(IF(#REF!<>\"\",ROW(#REF!)),ROW(27:27))),\"\")","v":""}]

{"sheet":"calc wrksht-rdwy exc Secondary","index":21,"n_rows":52,"n_cols":5,"rows_kept":52,"cut":false,"hidden":true,"merged":[[1,1,1,4]]}
[]
[null,"EARTHWORK SUMMARY\nUSING ROADWAY EXCAVATION AND EITHER BORROW OR WASTE PAY ITEMS"]
[]
[null,"EXCAVATION (unadjusted volumes)"]
[null,null,"Total Roadway Prism Excavation =",{"$f":"SUM(#REF!)","v":{"$error":"#REF!"}},"CUYD"]
[null,null,"Total Approach Road Prism Excavation =",{"$f":"#REF!","v":{"$error":"#REF!"}},"CUYD"]
[null,null,"Total Pay Item 20401-0000 Roadway Excavation =",{"$f":"SUM(D5:D6)","v":{"$error":"#REF!"}},"CUYD"]
[]
[null,"EXCAVATION MATERIAL AVAILABLE FOR FILL (unadjusted volumes)"]
[null,null,"Total Structure Excavation (walls) =",{"$f":"#REF!","v":{"$error":"#REF!"}},"CUYD"]
[null,null,"Total Excavation from Roadway Obliteration = ",{"$f":"#REF!","v":{"$error":"#REF!"}},"CUYD"]
[null,null,"Total Subexcavation =",{"$f":"#REF!","v":{"$error":"#REF!"}},"CUYD"]
[null,null,"Total =",{"$f":"SUM(D10:D12)","v":{"$error":"#REF!"}},"CUYD"]
[]
[null,"EXCAVATION MATERIAL UNAVAILABLE FOR FILL (unadjusted volumes)"]
[null,null,"Total Pavement Removal in Cuts =",{"$f":"#REF!","v":{"$error":"#REF!"}},"CUYD"]
[null,null,"Total Topsoil Stripping in Cuts =",{"$f":"#REF!","v":{"$error":"#REF!"}},"CUYD"]
[null,null,"Total Waste Subexcavation =",{"$f":"#REF!","v":{"$error":"#REF!"}},"CUYD"]
[null,null,"Total =",{"$f":"SUM(D16:D18)","v":{"$error":"#REF!"}},"CUYD"]
[]
[null,"TOTAL EXCAVATION AVAILABLE FOR FILLS (adjusted volume)"]
[null,null,"Total Volume After Adjustments Applied (Including Shrink/Swell) =",{"$f":"#REF!","v":{"$error":"#REF!"}},"CUYD"]
[]
[null,"EMBANKMENT (unadjusted volumes)"]
[null,null,"Total Roadway Prism Fill =",{"$f":"#REF!","v":{"$error":"#REF!"}},"CUYD"]
[null,null,"Total Approach Road Prism Fill =",{"$f":"#REF!","v":{"$error":"#REF!"}},"CUYD"]
[null,null,"Total =",{"$f":"SUM(D25:D26)","v":{"$error":"#REF!"}},"CUYD"]
[]
[null,"VARIOUS BACKFILL MATERIAL GENERATED ONSITE"]
[null,null,"Total Various Types of Wall Backfill Material =",{"$f":"SUM(#REF!)","v":{"$error":"#REF!"}},"CUYD"]
[null,null,"Total Backfill for Pavement Removal Under Fill =",{"$f":"#REF!","v":{"$error":"#REF!"}},"CUYD"]
[null,null,"Total Topsoil Replacement Under Fill =",{"$f":"#REF!","v":{"$error":"#REF!"}},"CUYD"]
[null,null,"Total Volume for Riprap =",{"$f":"#REF!","v":{"$error":"#REF!"}},"CUYD"]
[null,null,"Total Volume for Special Rock Embankment =",{"$f":"#REF!","v":{"$error":"#REF!"}},"CUYD"]
[null,null,"Total Embankment for Roadway Obliteration =",{"$f":"#REF!","v":{"$error":"#REF!"}},"CUYD"]
[null,null,"Total Subexcavation =",{"$f":"#REF!","v":{"$error":"#REF!"}},"CUYD"]
[null,null,"Total Volume for Topping or Select Topping =",{"$f":"#REF!","v":{"$error":"#REF!"}},"CUYD"]
[null,null,"Total Volume for Aggregate Base =",{"$f":"#REF!","v":{"$error":"#REF!"}},"CUYD"]
[null,null,"Total =",{"$f":"SUM(D30:D38)","v":{"$error":"#REF!"}},"CUYD"]
[]
[null,"EXCAVATION MINUS EMBANKMENT"]
[null,null,"Total Estimated Excavation Available for Fills =",{"$f":"D22","v":{"$error":"#REF!"}},"CUYD"]
[null,null,"Total Estimated Fill Material Required =",{"$f":"D27+D39","v":{"$error":"#REF!"}},"CUYD"]
[null,null,"Excavation - Embankment = ",{"$f":"D42-D43","v":{"$error":"#REF!"}},"CUYD"]
[]
[null,"WASTE"]
[null,null,"Estimated Total Pay Item 20441-0000 Waste =",{"$f":"IF(D44>0,D44,\"NA\")","v":{"$error":"#REF!"}},"CUYD"]
[]
[null,"BORROW"]
[null,null,"Estimated Unadjusted Volume of Unclassified Borrow Required =",{"$f":"IF(D44<0,ABS(D44), \"NA\" )","v":{"$error":"#REF!"}},"CUYD"]
[null,null,"Estimated Shrink / Swell at Borrow Pit Site =",0.9]
[null,null,"Estimated Total Pay Item 20403-0000 Unclassified Borrow  =",{"$f":"IF(D50=\"NA\",\"NA\",ABS((ROUNDUP(D50/D51,0))))","v":{"$error":"#REF!"}},"CUYD"]

{"sheet":"calc wrksht-emb const Secondary","index":22,"n_rows":52,"n_cols":5,"rows_kept":52,"cut":false,"hidden":true,"merged":[[1,1,1,4]]}
[]
[null,"EARTHWORK SUMMARY\nUSING EMBANKMENT CONSTRUCTION PAY ITEM"]
[]
[null,"EXCAVATION (unadjusted volumes)"]
[null,null,"Total Roadway Prism Excavation =",{"$f":"SUM(#REF!)","v":{"$error":"#REF!"}},"CUYD"]
[null,null,"Total Approach Road Prism Excavation =",{"$f":"#REF!","v":{"$error":"#REF!"}},"CUYD"]
[null,null,"Total =",{"$f":"SUM(D5:D6)","v":{"$error":"#REF!"}},"CUYD"]
[]
[null,"EXCAVATION MATERIAL AVAILABLE FOR FILL (unadjusted volumes)"]
[null,null,"Total Structure Excavation (walls) =",{"$f":"#REF!","v":{"$error":"#REF!"}},"CUYD"]
[null,null,"Total Excavation from Roadway Obliteration = ",{"$f":"#REF!","v":{"$error":"#REF!"}},"CUYD"]
[null,null,"Total Subexcavation =",{"$f":"#REF!","v":{"$error":"#REF!"}},"CUYD"]
[null,null,"Total =",{"$f":"SUM(D10:D12)","v":{"$error":"#REF!"}},"CUYD"]
[]
[null,"EXCAVATION MATERIAL UNAVAILABLE FOR FILL (unadjusted volumes)"]
[null,null,"Total Pavement Removal in Cuts =",{"$f":"#REF!","v":{"$error":"#REF!"}},"CUYD"]
[null,null,"Total Topsoil Stripping in Cuts =",{"$f":"#REF!","v":{"$error":"#REF!"}},"CUYD"]
[null,null,"Total Waste Subexcavation =",{"$f":"#REF!","v":{"$error":"#REF!"}},"CUYD"]
[null,null,"Total =",{"$f":"SUM(D16:D18)","v":{"$error":"#REF!"}},"CUYD"]
[]
[null,"TOTAL EXCAVATION AVAILABLE FOR FILLS (adjusted volume)"]
[null,null,"Total Volume After Adjustments Applied (Including Shrink/Swell) =",{"$f":"#REF!","v":{"$error":"#REF!"}},"CUYD"]
[]
[null,"EMBANKMENT (unadjusted volumes)"]
[null,null,"Total Roadway Prism Fill =",{"$f":"#REF!","v":{"$error":"#REF!"}},"CUYD"]
[null,null,"Total Approach Road Prism Fill =",{"$f":"#REF!","v":{"$error":"#REF!"}},"CUYD"]
[null,null,"Total =",{"$f":"SUM(D25:D26)","v":{"$error":"#REF!"}},"CUYD"]
[]
[null,"VARIOUS BACKFILL MATERIAL GENERATED ONSITE"]
[null,null,"Total Various Types of Wall Backfill Material =",{"$f":"SUM(#REF!)","v":{"$error":"#REF!"}},"CUYD"]
[null,null,"Total Backfill for Pavement Removal Under Fill =",{"$f":"#REF!","v":{"$error":"#REF!"}},"CUYD"]
[null,null,"Total Topsoil Replacement Under Fill =",{"$f":"#REF!","v":{"$error":"#REF!"}},"CUYD"]
[null,null,"Total Volume for Riprap =",{"$f":"#REF!","v":{"$error":"#REF!"}},"CUYD"]
[null,null,"Total Volume for Special Rock Embankment =",{"$f":"#REF!","v":{"$error":"#REF!"}},"CUYD"]
[null,null,"Total Embankment for Roadway Obliteration =",{"$f":"#REF!","v":{"$error":"#REF!"}},"CUYD"]
[null,null,"Total Subexcavation =",{"$f":"#REF!","v":{"$error":"#REF!"}},"CUYD"]
[null,null,"Total Volume for Topping or Select Topping =",{"$f":"#REF!","v":{"$error":"#REF!"}},"CUYD"]
[null,null,"Total Volume for Aggregate Base =",{"$f":"#REF!","v":{"$error":"#REF!"}},"CUYD"]
[null,null,"Total =",{"$f":"SUM(D30:D38)","v":{"$error":"#REF!"}},"CUYD"]
[]
[null,"EXCAVATION MINUS EMBANKMENT"]
[null,null,"Total Estimated Excavation Available for Fills =",{"$f":"D22","v":{"$error":"#REF!"}},"CUYD"]
[null,null,"Total Estimated Fill Material Required =",{"$f":"D27+D39","v":{"$error":"#REF!"}},"CUYD"]
[null,null,"Excavation - Embankment = ",{"$f":"D42-D43","v":{"$error":"#REF!"}},"CUYD"]
[]
[null,"EMBANKMENT CONSTRUCTION"]
[null,null,"Estimated Total Pay Item 20420-0000 Embankment Construction =",{"$f":"D27","v":{"$error":"#REF!"}},"CUYD"]
[]
[null,"UNCLASSIFIED BORROW"]
[null,null,"Estimated Unadjusted Volume of Unclassified Borrow Required =",{"$f":"ABS(#REF!)","v":{"$error":"#REF!"}},"CUYD"]
[null,null,"Estimated Shrink / Swell at Borrow Pit Site =",{"$f":"#REF!","v":{"$error":"#REF!"}}]
[null,null,"Estimated Quantity of Unclassified Borrow Required =",{"$f":"#REF!","v":{"$error":"#REF!"}},"CUYD"]